[{
    "fieldGroupClassName": "row",
    "fieldGroup": [
        {
            "className": "col-6",
            "fieldGroup": [
                {
                    "wrappers": ["mantle_logo_wrapper"],
                    "templateOptions": {
                        "image": "./assets/img/prod-logo-magic.png",
                        "txt_property":"Category"
                    }
                },
                {
                    "fieldGroupClassName": "row",
                    "fieldGroup": [{
                            "className": "col-4",
                            "fieldGroup": [{
                                "fieldGroupClassName": "row",
                                "fieldGroup": [{
                                        "className": "col-10",
                                        "key": "Child Sku",
                                        "type": "input",
                                        "templateOptions": {
                                            "label": "Child Sku",
                                            "placeholder": "",
                                            "readonly": true,
											"attributes": {
											  "class": "form-control form-control-sm"
											}
                                        }
                                    },
                                    {
                                        "className": "col-2",
                                        "key": "brand_id",
                                        "type": "input",
                                        "templateOptions": {
                                            "type": "hidden"
                                        }
                                    }
                                ]
                            }]
                        },

                        {
                            "className": "col-4",
                            "fieldGroup": [{
                                "fieldGroupClassName": "row",
                                "fieldGroup": [{
                                    "className": "col-10",
                                    "key": "Parent Sku",
                                    "type": "input",
                                    "templateOptions": {
                                        "label": "Parent Sku",
                                        "placeholder": "",
                                        "readonly": true,
										"attributes": {
										  "class": "form-control form-control-sm"
										}
                                    }
                                }]
                            }]
                        },
                        {
                            "className": "col-4",
                            "fieldGroup": [{
                                "fieldGroupClassName": "row",
                                "fieldGroup": [{
                                    "className": "col-10",
                                    "key": "Mantle SKU",
                                    "type": "input",
                                    "templateOptions": {
                                        "label": "Mantle SKU",
                                        "placeholder": "",
                                        "readonly": true,
										"attributes": {
										  "class": "form-control form-control-sm"
										}
                                    }
                                }]
                            }]
                        }
                    ]
                },
                {
                    "fieldGroupClassName": "row",
                    "fieldGroup": [{
                            "className": "col-6",
                            "fieldGroup": [{
                                "fieldGroupClassName": "row",
                                "fieldGroup": [{
                                        "className": "col-10",
                                        "key": "Condition",
                                        "type": "input",
                                        "templateOptions": {
                                            "label": "Condition",
                                            "placeholder": "",
											"attributes": {
											  "class": "form-control form-control-sm"
											}
                                        }
                                    },
                                    {
                                        "className": "col-2",
                                        "type": "mantle_checkbox",
                                        "toggle": "Condition",
                                        "templateOptions": {
                                            "label": "",
                                            "changeExpr": "this.toggleSource($event, field)"
                                        }
                                    }
                                ]
                            }]
                        },
                        {
                            "className": "col-6",
                            "fieldGroup": [{
                                "fieldGroupClassName": "row",
                                "fieldGroup": [{
                                        "className": "col-10",
                                        "key": "Language",
                                        "type": "input",
                                        "templateOptions": {
                                            "label": "Language",
                                            "placeholder": "",
											"attributes": {
											  "class": "form-control form-control-sm"
											}
                                        }
                                    },
                                    {
                                        "className": "col-2",
                                        "type": "mantle_checkbox",
                                        "toggle": "Language",
                                        "templateOptions": {
                                            "label": "",
                                            "changeExpr": "this.toggleSource($event, field)"
                                        }
                                    }
                                ]
                            }]

                        }
                    ]
                },
                {
                    "fieldGroupClassName": "row",
                    "fieldGroup": [{
                        "className": "col-12",
                        "fieldGroup": [{
                            "fieldGroupClassName": "row",
                            "fieldGroup": [{
                                "className": "col-12",
                                "key": "Description",
                                "type": "textarea",
                                "templateOptions": {
                                    "label": "Description",
                                    "placeholder": "",
                                    "rows": 3,
									"attributes": {
									  "class": "form-control form-control-sm"
									}
                                }
                            }]
                        }]
                    }]
                },
                {
                    "fieldGroupClassName": "row",
                    "fieldGroup": [
                        {
                            "className": "col-6",
                            "fieldGroup": [
                                {
                                    "fieldGroupClassName": "row",
                                    "fieldGroup": [{
                                        "className": "col-10",
                                        "key": "Sale Price",
                                        "type": "input",
                                        "templateOptions": {
                                            "type": "number",
                                            "label": "Sale Price",
                                            "placeholder": "",
                                            "readonly": true,
											"attributes": {
											  "class": "form-control form-control-sm"
											}
                                        }
                                    }]
                            }]
                        },
                        {
                            "className": "col-6",
                            "fieldGroup": [{
                                "fieldGroupClassName": "row",
                                "fieldGroup": [{
                                        "className": "col-10",
                                        "key": "Average Cost",
                                        "type": "input",
                                        "templateOptions": {
                                            "type": "number",
                                            "label": "Average Cost",
                                            "placeholder": "",
											"attributes": {
											  "class": "form-control form-control-sm"
											}
                                        }
                                    },
                                    {
                                        "className": "col-2",
                                        "type": "mantle_checkbox",
                                        "toggle": "Average Cost",
                                        "templateOptions": {
                                            "label": "",
                                            "changeExpr": "this.toggleSource($event, field)"
                                        }
                                    }
                                ]
                            }]
                        }
                    ]
                },
                {
                    "fieldGroupClassName": "row",
                    "fieldGroup": [
                        {
                            "className": "col-3",
                            "fieldGroup": [{
                                "fieldGroupClassName": "row",
                                "fieldGroup": [{
                                        "className": "col-10",
                                        "key": "Height",
                                        "type": "input",
                                        "templateOptions": {
                                            "type": "number",
                                            "label": "Height",
                                            "placeholder": "",
											"attributes": {
											  "class": "form-control form-control-sm"
											}
                                        }
                                    },
                                    {
                                        "className": "col-2",
                                        "type": "mantle_checkbox",
                                        "toggle": "Height",
                                        "templateOptions": {
                                            "label": "",
                                            "changeExpr": "this.toggleSource($event, field)"
                                        }
                                    }
                                ]
                            }]
                        },
                        {
                            "className": "col-3",
                            "fieldGroup": [{
                                "fieldGroupClassName": "row",
                                "fieldGroup": [{
                                        "className": "col-10",
                                        "key": "Length",
                                        "type": "input",
                                        "templateOptions": {
                                            "type": "number",
                                            "label": "Length",
                                            "placeholder": "",
											"attributes": {
											  "class": "form-control form-control-sm"
											}
                                        }
                                    },
                                    {
                                        "className": "col-2",
                                        "type": "mantle_checkbox",
                                        "toggle": "Length",
                                        "templateOptions": {
                                            "label": "",
                                            "changeExpr": "this.toggleSource($event, field)"
                                        }
                                    }
                                ]
                            }]
                        },
                        {
                            "className": "col-3",
                            "fieldGroup": [{
                                "fieldGroupClassName": "row",
                                "fieldGroup": [{
                                        "className": "col-10",
                                        "key": "Width",
                                        "type": "input",
                                        "templateOptions": {
                                            "type": "number",
                                            "label": "Width",
                                            "placeholder": "",
											"attributes": {
											  "class": "form-control form-control-sm"
											}
                                        }
                                    },
                                    {
                                        "className": "col-2",
                                        "type": "mantle_checkbox",
                                        "toggle": "Width",
                                        "templateOptions": {
                                            "label": "",
                                            "changeExpr": "this.toggleSource($event, field)"
                                        }
                                    }
                                ]
                            }]
                        },
                        {
                            "className": "col-3",
                            "fieldGroup": [{
                                "fieldGroupClassName": "row",
                                "fieldGroup": [{
                                        "className": "col-10",
                                        "key": "Weight",
                                        "type": "input",
                                        "templateOptions": {
                                            "type": "number",
                                            "label": "Weight",
                                            "placeholder": "",
											"attributes": {
											  "class": "form-control form-control-sm"
											}
                                        }
                                    },
                                    {
                                        "className": "col-2",
                                        "type": "mantle_checkbox",
                                        "toggle": "Weight",
                                        "templateOptions": {
                                            "label": "",
                                            "changeExpr": "this.toggleSource($event, field)"
                                        }
                                    }
                                ]
                            }]
                        }
                    ]
                },
                {
                    "fieldGroupClassName": "row",
                    "fieldGroup": [{
                            "className": "col-4",
                            "fieldGroup": [{
                                "fieldGroupClassName": "row",
                                "fieldGroup": [{
                                    "className": "col-10",
                                    "key": "Quantity on Hand",
                                    "type": "input",
                                    "templateOptions": {
                                        "type": "number",
                                        "label": "Quantity on Hand",
                                        "placeholder": "",
                                        "readonly": true,
										"attributes": {
										  "class": "form-control form-control-sm"
										}
                                    }
                                }]
                            }]
                        },
                        {
                            "className": "col-4",
                            "fieldGroup": [{
                                "fieldGroupClassName": "row",
                                "fieldGroup": [{
                                    "className": "col-10",
                                    "key": "Reorder Point",
                                    "type": "input",
                                    "templateOptions": {
                                        "type": "number",
                                        "label": "Reorder Point",
                                        "placeholder": "",
                                        "readonly": true,
										"attributes": {
										  "class": "form-control form-control-sm"
										}
                                    }
                                }]
                            }]
                        },
                        {
                            "className": "col-4",
                            "fieldGroup": [{
                                "fieldGroupClassName": "row",
                                "fieldGroup": [{
                                    "className": "col-10",
                                    "key": "Reserve Quantity",
                                    "type": "input",
                                    "templateOptions": {
                                        "type": "number",
                                        "label": "Reserve Quantity",
                                        "placeholder": "",
                                        "readonly": true,
										"attributes": {
										  "class": "form-control form-control-sm"
										}
                                    }
                                }]
                            }]
                        }
                    ]
                },

                {
                    "wrappers": ["card_wrapper"],
                    "className": "mt-5",
                    "templateOptions": {
                        "label": "Descriptors"
                    },
                    "fieldGroup": [
                        {
                            "fieldGroupClassName": "row",
                            "fieldGroup": [{
                                    "className": "col-4",
                                    "fieldGroup": [{
                                        "fieldGroupClassName": "row",
                                        "fieldGroup": [{
                                                "className": "col-10",
                                                "key": "TCG Low Price",
                                                "type": "input",
                                                "templateOptions": {
                                                    "type": "number",
                                                    "label": "TCG Low Price",
                                                    "placeholder": "",
													"attributes": {
													  "class": "form-control form-control-sm"
													}
                                                }
                                            },
                                            {
                                                "className": "col-2",
                                                "type": "mantle_checkbox",
                                                "toggle": "TCG Low Price",
                                                "templateOptions": {
                                                    "label": "",
                                                    "changeExpr": "this.toggleSource($event, field)"
                                                }
                                            }
                                        ]
                                    }]
                                },
                                {
                                    "className": "col-4",
                                    "fieldGroup": [{
                                        "fieldGroupClassName": "row",
                                        "fieldGroup": [{
                                                "className": "col-10",
                                                "key": "TCG Direct Low",
                                                "type": "input",
                                                "templateOptions": {
                                                    "type": "number",
                                                    "label": "TCG Direct Low",
                                                    "placeholder": "",
													"attributes": {
													  "class": "form-control form-control-sm"
													}
                                                }
                                            },
                                            {
                                                "className": "col-2",
                                                "type": "mantle_checkbox",
                                                "toggle": "TCG Direct Low",
                                                "templateOptions": {
                                                    "label": "",
                                                    "changeExpr": "this.toggleSource($event, field)"
                                                }
                                            }
                                        ]
                                    }]
                                },
                                {
                                    "className": "col-4",
                                    "fieldGroup": [{
                                        "fieldGroupClassName": "row",
                                        "fieldGroup": [{
                                                "className": "col-10",
                                                "key": "TCG Market Price",
                                                "type": "input",
                                                "templateOptions": {
                                                    "type": "number",
                                                    "label": "TCG Market Price",
                                                    "placeholder": "",
													"attributes": {
													  "class": "form-control form-control-sm"
													}
                                                }
                                            },
                                            {
                                                "className": "col-2",
                                                "type": "mantle_checkbox",
                                                "toggle": "TCG Market Price",
                                                "templateOptions": {
                                                    "label": "",
                                                    "changeExpr": "this.toggleSource($event, field)"
                                                }
                                            }
                                        ]
                                    }]
                                }
                            ]
                        },
                        {
                            "fieldGroupClassName": "row",
                            "fieldGroup": [{
                                    "className": "col-4",
                                    "fieldGroup": [{
                                        "fieldGroupClassName": "row",
                                        "fieldGroup": [{
                                                "className": "col-10",
                                                "key": "TCG Price Date",
                                                "type": "input",
                                                "templateOptions": {
                                                    "type": "date",
                                                    "label": "TCG Price Date",
                                                    "placeholder": "",
													"attributes": {
													  "class": "form-control form-control-sm"
													}
                                                }
                                            },
                                            {
                                                "className": "col-2",
                                                "type": "mantle_checkbox",
                                                "toggle": "TCG Price Date",
                                                "templateOptions": {
                                                    "label": "",
                                                    "changeExpr": "this.toggleSource($event, field)"
                                                }
                                            }
                                        ]
                                    }]
                                },
                                {
                                    "className": "col-4",
                                    "fieldGroup": [{
                                        "fieldGroupClassName": "row",
                                        "fieldGroup": [{
                                                "className": "col-10",
                                                "key": "Buylist Price",
                                                "type": "input",
                                                "templateOptions": {
                                                    "type": "number",
                                                    "label": "Buylist Price",
                                                    "placeholder": "",
													"attributes": {
													  "class": "form-control form-control-sm"
													}
                                                }
                                            },
                                            {
                                                "className": "col-2",
                                                "type": "mantle_checkbox",
                                                "toggle": "Buylist Price",
                                                "templateOptions": {
                                                    "label": "",
                                                    "changeExpr": "this.toggleSource($event, field)"
                                                }
                                            }
                                        ]
                                    }]
                                }
                            ]
                        }

                    ]
                }
            ]
        },
        {
            "className": "col-6",
            "fieldGroup": 
            [
                {
                    "wrappers": ["magic_right_wrapper"],
                    "templateOptions": {},
                    "fieldGroup": [
                        {
                            "fieldGroupClassName": "row",
                            "fieldGroup": [
                                {
                                    "className": "col-6",
                                    "fieldGroup": [{
                                        "fieldGroupClassName": "row",
                                        "fieldGroup": [{
                                                "className": "col-10",
                                                "key": "Product Name",
                                                "type": "input",
                                                "templateOptions": {
                                                    "label": "Product Name",
                                                    "placeholder": "",
													"attributes": {
													  "class": "form-control form-control-sm"
													}
                                                }
                                            },
                                            {
                                                "className": "col-2",
                                                "type": "mantle_checkbox",
                                                "toggle": "Product Name",
                                                "templateOptions": {
                                                    "label": "",
                                                    "changeExpr": "this.toggleSource($event, field)"
                                                }
                                            }
                                        ]
                                    }]
                                },
                                {
                                    "className": "col-6",
                                    "fieldGroup": [{
                                        "fieldGroupClassName": "row",
                                        "fieldGroup": [{
                                                "className": "col-10",
                                                "key": "Parent Product Name",
                                                "type": "input",
                                                "templateOptions": {
                                                    "label": "Parent Product Name",
                                                    "placeholder": "",
													"attributes": {
													  "class": "form-control form-control-sm"
													}
                                                }
                                            },
                                            {
                                                "className": "col-2",
                                                "type": "mantle_checkbox",
                                                "toggle": "Parent Product Name",
                                                "templateOptions": {
                                                    "label": "",
                                                    "changeExpr": "this.toggleSource($event, field)"
                                                }
                                            }
                                        ]
                                    }]
                                }
                            ]
                        },
                        {
                            "fieldGroupClassName": "row",
                            "fieldGroup":[
                                {
                                    "className": "col-4",
                                    "fieldGroup": [{
                                        "fieldGroupClassName": "row",
                                        "fieldGroup": [{
                                                "className": "col-10",
                                                "key": "Card Number",
                                                "type": "input",
                                                "templateOptions": {
                                                    "label": "Card Number",
                                                    "placeholder": "",
													"attributes": {
													  "class": "form-control form-control-sm"
													}
                                                }
                                            },
                                            {
                                                "className": "col-2",
                                                "type": "mantle_checkbox",
                                                "toggle": "Card Number",
                                                "templateOptions": {
                                                    "label": "",
                                                    "changeExpr": "this.toggleSource($event, field)"
                                                }
                                            }
                                        ]
                                    }]
                                },
                                {
                                    "className": "col-4",
                                    "fieldGroup": [{
                                        "fieldGroupClassName": "row",
                                        "fieldGroup": [{
                                                "className": "col-10",
                                                "key": "Set Name",
                                                "type": "input",
                                                "templateOptions": {
                                                    "label": "Set Name",
                                                    "placeholder": "",
													"attributes": {
													  "class": "form-control form-control-sm"
													}
                                                }
                                            },
                                            {
                                                "className": "col-2",
                                                "type": "mantle_checkbox",
                                                "toggle": "Set Name",
                                                "templateOptions": {
                                                    "label": "",
                                                    "changeExpr": "this.toggleSource($event, field)"
                                                }
                                            }
                                        ]
                                    }]
                                },
                                
                                {
                                    "className": "col-4",
                                    "fieldGroup": [{
                                        "fieldGroupClassName": "row",
                                        "fieldGroup": [{
                                                "className": "col-10",
                                                "key": "Rarity",
                                                "type": "input",
                                                "templateOptions": {
                                                    "label": "Rarity",
                                                    "placeholder": "",
													"attributes": {
													  "class": "form-control form-control-sm"
													}
                                                }
                                            },
                                            {
                                                "className": "col-2",
                                                "type": "mantle_checkbox",
                                                "toggle": "Rarity",
                                                "templateOptions": {
                                                    "label": "",
                                                    "changeExpr": "this.toggleSource($event, field)"
                                                }
                                            }
                                        ]
                                    }]
                                }
                            ]
                        },
                        {
                            "fieldGroupClassName": "row",
                            "fieldGroup": [{
                                    "className": "col-4",
                                    "fieldGroup": [{
                                        "fieldGroupClassName": "row",
                                        "fieldGroup": [{
                                                "className": "col-10",
                                                "key": "Color",
                                                "type": "input",
                                                "templateOptions": {
                                                    "label": "Color",
                                                    "placeholder": "",
													"attributes": {
													  "class": "form-control form-control-sm"
													}
                                                }
                                            },
                                            {
                                                "className": "col-2",
                                                "type": "mantle_checkbox",
                                                "toggle": "Color",
                                                "templateOptions": {
                                                    "label": "",
                                                    "changeExpr": "this.toggleSource($event, field)"
                                                }
                                            }
                                        ]
                                    }]
                                },
                                {
                                    "className": "col-4",
                                    "fieldGroup": [{
                                        "fieldGroupClassName": "row",
                                        "fieldGroup": [{
                                                "className": "col-10",
                                                "key": "Mana Cost",
                                                "type": "input",
                                                "templateOptions": {
                                                    "type": "number",
                                                    "label": "Mana Cost",
                                                    "placeholder": "",
													"attributes": {
													  "class": "form-control form-control-sm"
													}
                                                }
                                            },
                                            {
                                                "className": "col-2",
                                                "type": "mantle_checkbox",
                                                "toggle": "Mana Cost",
                                                "templateOptions": {
                                                    "label": "",
                                                    "changeExpr": "this.toggleSource($event, field)"
                                                }
                                            }
                                        ]
                                    }]
                                },
                                {
                                    "className": "col-4",
                                    "fieldGroup": [{
                                        "fieldGroupClassName": "row",
                                        "fieldGroup": [{
                                                "className": "col-10",
                                                "key": "Card Type",
                                                "type": "input",
                                                "templateOptions": {
                                                    "label": "Card Type",
                                                    "placeholder": "",
													"attributes": {
													  "class": "form-control form-control-sm"
													}
                                                }
                                            },
                                            {
                                                "className": "col-2",
                                                "type": "mantle_checkbox",
                                                "toggle": "Card Type",
                                                "templateOptions": {
                                                    "label": "",
                                                    "changeExpr": "this.toggleSource($event, field)"
                                                }
                                            }
                                        ]
                                    }]
                                }
                            ]
                        },
                        {
                            "fieldGroupClassName": "row",
                            "fieldGroup": [
                                {
                                    "className": "col-4",
                                    "fieldGroup": [{
                                        "fieldGroupClassName": "row",
                                        "fieldGroup": [{
                                                "className": "col-10",
                                                "key": "Power",
                                                "type": "input",
                                                "templateOptions": {
                                                    "label": "Power",
                                                    "placeholder": "",
													"attributes": {
													  "class": "form-control form-control-sm"
													}
                                                }
                                            },
                                            {
                                                "className": "col-2",
                                                "type": "mantle_checkbox",
                                                "toggle": "Power",
                                                "templateOptions": {
                                                    "label": "",
                                                    "changeExpr": "this.toggleSource($event, field)"
                                                }
                                            }
                                        ]
                                    }]
                                },
                                {
                                    "className": "col-4",
                                    "fieldGroup": [{
                                        "fieldGroupClassName": "row",
                                        "fieldGroup": [{
                                                "className": "col-10",
                                                "key": "Toughness",
                                                "type": "input",
                                                "templateOptions": {
                                                    "label": "Toughness",
                                                    "placeholder": "",
													"attributes": {
													  "class": "form-control form-control-sm"
													}
                                                }
                                            },
                                            {
                                                "className": "col-2",
                                                "type": "mantle_checkbox",
                                                "toggle": "Toughness",
                                                "templateOptions": {
                                                    "label": "",
                                                    "changeExpr": "this.toggleSource($event, field)"
                                                }
                                            }
                                        ]
                                    }]
                                },
                                {
                                    "className": "col-4",
                                    "fieldGroup": [{
                                        "fieldGroupClassName": "row",
                                        "fieldGroup": [{
                                                "className": "col-10",
                                                "key": "Short Code",
                                                "type": "input",
                                                "templateOptions": {
                                                    "label": "Short Code",
                                                    "placeholder": "",
													"attributes": {
													  "class": "form-control form-control-sm"
													}
                                                }
                                            },
                                            {
                                                "className": "col-2",
                                                "type": "mantle_checkbox",
                                                "toggle": "Short Code",
                                                "templateOptions": {
                                                    "label": "",
                                                    "changeExpr": "this.toggleSource($event, field)"
                                                }
                                            }
                                        ]
                                    }]
                                }
                            ]
                        },
                        {
                            "fieldGroupClassName": "row",
                            "fieldGroup": [
                                {
                                    "className": "col-4",
                                    "fieldGroup": [{
                                        "fieldGroupClassName": "row",
                                        "fieldGroup": [{
                                                "className": "col-10",
                                                "key": "Rules Text",
                                                "type": "input",
                                                "templateOptions": {
                                                    "label": "Rules Text",
                                                    "placeholder": "",
													"attributes": {
													  "class": "form-control form-control-sm"
													}
                                                }
                                            },
                                            {
                                                "className": "col-2",
                                                "type": "mantle_checkbox",
                                                "toggle": "Rules Text",
                                                "templateOptions": {
                                                    "label": "",
                                                    "changeExpr": "this.toggleSource($event, field)"
                                                }
                                            }
                                        ]
                                    }]
                                },
                                {
                                    "className": "col-4",
                                    "fieldGroup": [{
                                        "fieldGroupClassName": "row",
                                        "fieldGroup": [{
                                                "className": "col-10",
                                                "key": "Flavor Text",
                                                "type": "input",
                                                "templateOptions": {
                                                    "label": "Flavor Text",
                                                    "placeholder": "",
													"attributes": {
													  "class": "form-control form-control-sm"
													}
                                                }
                                            },
                                            {
                                                "className": "col-2",
                                                "type": "mantle_checkbox",
                                                "toggle": "Flavor Text",
                                                "templateOptions": {
                                                    "label": "",
                                                    "changeExpr": "this.toggleSource($event, field)"
                                                }
                                            }
                                        ]
                                    }]
                                },
                                {
                                    "className": "col-4",
                                    "fieldGroup": [{
                                        "fieldGroupClassName": "row",
                                        "fieldGroup": [{
                                                "className": "col-10",
                                                "key": "Artist",
                                                "type": "input",
                                                "templateOptions": {
                                                    "label": "Artist",
                                                    "placeholder": "",
													"attributes": {
													  "class": "form-control form-control-sm"
													}
                                                }
                                            },
                                            {
                                                "className": "col-2",
                                                "type": "mantle_checkbox",
                                                "toggle": "Artist",
                                                "templateOptions": {
                                                    "label": "",
                                                    "changeExpr": "this.toggleSource($event, field)"
                                                }
                                            }
                                        ]
                                    }]
                                }
                            ]
                        }

                    ]
                }
            ]
        }
    ],
    "extras":{
        "background_image":"./assets/img/prod-magic-bg.png",
        "product_logo":"./assets/img/prod-logo-magic.png"
    }

}]