{
  "roots": ["<rootDir>/src"],
  "setupFilesAfterEnv": ["./jest-setup.ts"],
  "moduleFileExtensions": ["ts", "tsx", "js", "jsx"],
  "testPathIgnorePatterns": ["node_modules/"],
  "testEnvironment": "jsdom",
  "preset": "ts-jest",
  "transform": {
    "^.+\\.(t|j)sx?$": "ts-jest"
  },
  "testMatch": ["**/?(*.)+(spec|test).[jt]s?(x)"],
  "moduleNameMapper": {
    "\\.(jpg|ico|jpeg|png|gif|eot|otf|webp|svg|ttf|woff|woff2|mp4|webm|wav|mp3|m4a|aac|oga)$": "identity-obj-proxy",
    "\\.(css|less|scss|sass)$": "identity-obj-proxy",
    "single-spa-react/parcel": "single-spa-react/lib/cjs/parcel.cjs",
    "@/modules/(.*)": ["<rootDir>/src/modules/$1"],
    "@/domains/(.*)": ["<rootDir>/src/domains/$1"],
    "@/shared/(.*)": ["<rootDir>/src/shared/$1"],
    "@/core/(.*)": ["<rootDir>/src/shared/core/$1"],
    "@/theme/(.*)": ["<rootDir>/src/assets/theme/$1"],
    "@/logoos/(.*)": ["<rootDir>/src/assets/images/logos/$1"]
  },
  "modulePaths": ["<rootDir>/src"],
  "transformIgnorePatterns": ["<rootDir>/node_modules/(?!@capitalx|@byorange)"],
  "collectCoverage": true,
  "coverageReporters": ["text-summary", "html", "lcovonly", "cobertura"],
  "coverageDirectory": "<rootDir>/coverage/",
  "resetMocks": true,
  "testTimeout": 30000
}
