%YAML 1.1
%TAG !u! tag:unity3d.com,2011:
--- !u!1045 &1
EditorBuildSettings:
  m_ObjectHideFlags: 0
  serializedVersion: 2
  m_Scenes:
  - enabled: 1
    path: Assets/ui-menu.unity
    guid: 7488d015d29aef2459cc3717b152a92e
  - enabled: 1
    path: Assets/Scenes/Setup_Vuforia.unity
    guid: e97ce48df45128f40806879f06914aa1
  m_configObjects:
    Unity.XR.WindowsMR.Settings: {fileID: 11400000, guid: 744b813df90924c169af73489b8325de,
      type: 2}
    UnityEditor.XR.ARCore.ARCoreSettings: {fileID: 11400000, guid: c03a4c7b86affe343b287edb45333a0e,
      type: 2}
    UnityEditor.XR.ARKit.ARKitSettings: {fileID: 11400000, guid: de8a8e4f987434338a4b1062feb8d069,
      type: 2}
    com.unity.xr.arcore.PlayerSettings: {fileID: 11400000, guid: c2f7b8d7c0bff4d10874cbcf3f24af78,
      type: 2}
    com.unity.xr.arkit.PlayerSettings: {fileID: 11400000, guid: b27ec7d82a91a48e69fd689ad6808e5e,
      type: 2}
    com.unity.xr.magicleap.magic_leap_settings: {fileID: 11400000, guid: 1eb95d77acb39444e8cf44313496a874,
      type: 2}
    com.unity.xr.management.loader_settings: {fileID: 11400000, guid: 851db0d4a29b7a342a84d855a64210ed,
      type: 2}
