Yoann - Toufik  (Universite Clermont Auvergne, Students)
Date: Project 
Object: Sample case of ATACseq workflow showing job execution and dependency handling.
Inputs: paths to scripts qc, trim and bwa
Outputs: trimmed fastq files, QC HTML files and BAM files
13921 : Initial Quality Control --> QC-init
13922 : Trimming with Trimmomatic tool
13923 : Second quality control --> QC-Post
13924 : Bowtie2 --> aligning Seq reads to long genom reference 
13925 : Picard --> remove PCR duplicates
13926 : Multibamsummary Build -->  used in plot corr + Pca + ..
13927 : Plot corr based on Multibamsummary matrix
13928 : Plot Pca based on Multibamsummary matrix
13929 : MACS-2  --> Accesible sites on chromatins
13930 : Plot what in r script producted by MACS2
13931 : Peaks-filtred for Significatif Peaks on MACS2 output
13932 : Closest
13933 : Intersection Peaks
13934 : Intersection2 Peaks
13935 : Multiinter  
   JOBID CPUS MIN_MEMORY           DEPENDENCY
   13921    8         2G               (null)
   13922    8        12G afterok:13921_*(unfu
   13923    8         2G afterany:13922_*(unf
   13924    8        30G afterany:13923_*(unf
   13925    8        26G afterany:13924_*(unf
   13926    8         2G afterany:13925_*(unf
   13927    8         2G afterany:13926_*(unf
   13928    8         2G afterany:13926_*(unf
   13929    8         2G afterany:13928_*(unf
   13930    8         2G afterany:13929_*(unf
   13931    8         2G afterany:13929_*(unf
   13932    8         2G afterany:13931_*(unf
   13933    8         2G afterany:13931_*(unf
   13934    8         2G afterany:13933_*(unf
   13935    8         2G afterany:13934_*(unf
   13920    1      3000M               (null)
