target_file : CAH/CAH-PRONY-INCUBATION/cynT_K01673.fasta.txt 	 nontarget_file : FDH/Brazelton_et_al_FDH_sequences.fasta.txt
Kaspod : Kmer_size=25, Max_repet_in_probes=8, Edit_distance=2, Max_cross-hybridizations=2, Accepted_match_against_target=0, Max_score_degen=2000
ID	Seq	coverage	cross_hyb	start_on_target	probe_length	degen_score	targeted_target_seq
1741	CCTGCTGAAACAGATTACCAACCTG	9.0909	0	432	25	1	{'bin.26.orig~~c_000000000134_47'}
5894	TGGTGGAACGCAGCGAACTGATTAG	9.0909	0	164	25	1	{'bin.46.orig~~c_000000046795_2'}
209	TCAGGGCATTGGCGATRTKTTTGTG	18.1818	0	324	25	4	{'bin.44.permissive~~NODE_125_length_2866_cov_2.861958_3', 'bin.60.permissive~~NODE_134_length_3197_cov_33.096474_1'}
2002	GCCAGATGATGGGCGGCGTGAGCAC	9.0909	0	278	25	1	{'bin.10.orig~~c_000000000310_47'}
5257	ATGTGGTGGATGCGGCGGTGCGCGC	9.0909	0	911	25	1	{'bin.36.permissive~~NODE_497_length_1492_cov_8.438869_1'}
2823	GCTGCAGCGATAGCCGCSTGSCGGC	18.1818	0	125	25	4	{'bin.53.strict~~NODE_420_length_3662_cov_4.777127_1', 'bin.46.orig~~c_000000038210_1'}
594	ATKGTGATTCTGACCTGCATGGATA	27.2727	0	97	25	2	{'bin.20.strict~~NODE_43_length_29622_cov_49.113149_7', 'bin.21.permissive~~NODE_395_length_1737_cov_3.213253_3', 'bin.22.strict~~NODE_2_length_401672_cov_394.879874_159'}

 next_probes_set
ID	Seq	coverage	cross_hyb	start_on_target	probe_length	degen_score	targeted_target_seq
5787	CATGGTGATTCTGACCTGCATGGAT	27.2727	0	96	25	1	{'bin.20.strict~~NODE_43_length_29622_cov_49.113149_7', 'bin.21.permissive~~NODE_395_length_1737_cov_3.213253_3', 'bin.22.strict~~NODE_2_length_401672_cov_394.879874_159'}
1741	CCTGCTGAAACAGATTACCAACCTG	9.0909	0	432	25	1	{'bin.26.orig~~c_000000000134_47'}
5894	TGGTGGAACGCAGCGAACTGATTAG	9.0909	0	164	25	1	{'bin.46.orig~~c_000000046795_2'}
209	TCAGGGCATTGGCGATRTKTTTGTG	18.1818	0	324	25	4	{'bin.44.permissive~~NODE_125_length_2866_cov_2.861958_3', 'bin.60.permissive~~NODE_134_length_3197_cov_33.096474_1'}
2002	GCCAGATGATGGGCGGCGTGAGCAC	9.0909	0	278	25	1	{'bin.10.orig~~c_000000000310_47'}
5257	ATGTGGTGGATGCGGCGGTGCGCGC	9.0909	0	911	25	1	{'bin.36.permissive~~NODE_497_length_1492_cov_8.438869_1'}
2823	GCTGCAGCGATAGCCGCSTGSCGGC	18.1818	0	125	25	4	{'bin.53.strict~~NODE_420_length_3662_cov_4.777127_1', 'bin.46.orig~~c_000000038210_1'}

 next_probes_set
ID	Seq	coverage	cross_hyb	start_on_target	probe_length	degen_score	targeted_target_seq
572	TTGTGGCGGAAAAAMARTATGAAMM	27.2727	0	41	25	16	{'bin.20.strict~~NODE_43_length_29622_cov_49.113149_7', 'bin.21.permissive~~NODE_395_length_1737_cov_3.213253_3', 'bin.22.strict~~NODE_2_length_401672_cov_394.879874_159'}
1741	CCTGCTGAAACAGATTACCAACCTG	9.0909	0	432	25	1	{'bin.26.orig~~c_000000000134_47'}
5894	TGGTGGAACGCAGCGAACTGATTAG	9.0909	0	164	25	1	{'bin.46.orig~~c_000000046795_2'}
209	TCAGGGCATTGGCGATRTKTTTGTG	18.1818	0	324	25	4	{'bin.44.permissive~~NODE_125_length_2866_cov_2.861958_3', 'bin.60.permissive~~NODE_134_length_3197_cov_33.096474_1'}
2002	GCCAGATGATGGGCGGCGTGAGCAC	9.0909	0	278	25	1	{'bin.10.orig~~c_000000000310_47'}
5257	ATGTGGTGGATGCGGCGGTGCGCGC	9.0909	0	911	25	1	{'bin.36.permissive~~NODE_497_length_1492_cov_8.438869_1'}
2823	GCTGCAGCGATAGCCGCSTGSCGGC	18.1818	0	125	25	4	{'bin.53.strict~~NODE_420_length_3662_cov_4.777127_1', 'bin.46.orig~~c_000000038210_1'}

 next_probes_set
ID	Seq	coverage	cross_hyb	start_on_target	probe_length	degen_score	targeted_target_seq
5482	TGGTGATTCTGACCTGCATGGATAC	27.2727	0	98	25	1	{'bin.20.strict~~NODE_43_length_29622_cov_49.113149_7', 'bin.21.permissive~~NODE_395_length_1737_cov_3.213253_3', 'bin.22.strict~~NODE_2_length_401672_cov_394.879874_159'}
1741	CCTGCTGAAACAGATTACCAACCTG	9.0909	0	432	25	1	{'bin.26.orig~~c_000000000134_47'}
5894	TGGTGGAACGCAGCGAACTGATTAG	9.0909	0	164	25	1	{'bin.46.orig~~c_000000046795_2'}
209	TCAGGGCATTGGCGATRTKTTTGTG	18.1818	0	324	25	4	{'bin.44.permissive~~NODE_125_length_2866_cov_2.861958_3', 'bin.60.permissive~~NODE_134_length_3197_cov_33.096474_1'}
2002	GCCAGATGATGGGCGGCGTGAGCAC	9.0909	0	278	25	1	{'bin.10.orig~~c_000000000310_47'}
5257	ATGTGGTGGATGCGGCGGTGCGCGC	9.0909	0	911	25	1	{'bin.36.permissive~~NODE_497_length_1492_cov_8.438869_1'}
2823	GCTGCAGCGATAGCCGCSTGSCGGC	18.1818	0	125	25	4	{'bin.53.strict~~NODE_420_length_3662_cov_4.777127_1', 'bin.46.orig~~c_000000038210_1'}

 next_probes_set
ID	Seq	coverage	cross_hyb	start_on_target	probe_length	degen_score	targeted_target_seq
4942	CGCTTTGTGGCGGAAAAAMARTATG	27.2727	0	37	25	4	{'bin.20.strict~~NODE_43_length_29622_cov_49.113149_7', 'bin.21.permissive~~NODE_395_length_1737_cov_3.213253_3', 'bin.22.strict~~NODE_2_length_401672_cov_394.879874_159'}
1741	CCTGCTGAAACAGATTACCAACCTG	9.0909	0	432	25	1	{'bin.26.orig~~c_000000000134_47'}
5894	TGGTGGAACGCAGCGAACTGATTAG	9.0909	0	164	25	1	{'bin.46.orig~~c_000000046795_2'}
209	TCAGGGCATTGGCGATRTKTTTGTG	18.1818	0	324	25	4	{'bin.44.permissive~~NODE_125_length_2866_cov_2.861958_3', 'bin.60.permissive~~NODE_134_length_3197_cov_33.096474_1'}
2002	GCCAGATGATGGGCGGCGTGAGCAC	9.0909	0	278	25	1	{'bin.10.orig~~c_000000000310_47'}
5257	ATGTGGTGGATGCGGCGGTGCGCGC	9.0909	0	911	25	1	{'bin.36.permissive~~NODE_497_length_1492_cov_8.438869_1'}
2823	GCTGCAGCGATAGCCGCSTGSCGGC	18.1818	0	125	25	4	{'bin.53.strict~~NODE_420_length_3662_cov_4.777127_1', 'bin.46.orig~~c_000000038210_1'}
