   80
Minimum  Converged. Energy =     -117.3909117253 kJ/mol
C    4.6483400  -1.8114179   5.8559517
O    3.9831077  -1.9997226   6.9109770
N    5.7341972  -2.5518819   5.5718339
H    6.0203948  -3.2723696   6.2178627
H    6.2554642  -2.3914064   4.7273893
N    4.3006005  -0.8620324   4.9694764
H    3.4902200  -0.2899229   5.1547745
H    4.8395500  -0.7223971   4.1324738
C    8.5253879   1.2433411   5.1957155
O    9.1906212   1.4316345   4.1406937
N    8.8180652   1.8972378   6.3336267
H    9.5863276   2.5515194   6.3406623
H    8.2797843   1.7378259   7.1675293
N    7.4945940   0.3804916   5.2283925
H    7.2505135  -0.1253908   4.3900332
H    6.9726371   0.2397968   6.0759407
C    0.0807419  -1.3912334   2.0640770
O   -0.7316775  -1.3912334   3.0289841
N    1.1525322  -2.2031501   2.0517207
H    1.3075229  -2.8241978   2.8318762
H    1.7922704  -2.1931381   1.2763544
N   -0.0896215  -0.5793274   1.0058337
H   -0.8847738   0.0417203   0.9859948
H    0.5654365  -0.5893394   0.2433792
C    4.1747799   1.3912017   1.5201357
O    4.9871992   1.3911911   0.5552339
N    4.3451432   2.2031078   2.5783738
H    5.1402955   2.8241555   2.5982127
H    3.6900747   2.1930904   3.3408283
N    3.1029896   0.5792745   1.5324973
H    2.9479988  -0.0417521   0.7523419
H    2.4632407   0.5892971   2.3078637
C    0.0807419   4.1737374   2.0640770
O   -0.7316775   4.1737374   3.0289841
N    1.1525322   3.3618207   2.0517207
H    1.3075229   2.7407730   2.8318762
H    1.7922704   3.3718328   1.2763544
N   -0.0896215   4.9856435   1.0058337
H   -0.8847738   5.6066912   0.9859948
H    0.5654365   4.9756314   0.2433792
C    4.1747799   6.9561725   1.5201357
O    4.9871992   6.9561620   0.5552339
N    4.3451432   7.7680786   2.5783738
H    5.1402955   8.3891263   2.5982127
H    3.6900747   7.7580613   3.3408283
N    3.1029896   6.1442453   1.5324973
H    2.9479988   5.5232188   0.7523419
H    2.4632407   6.1542679   2.3078637
C    7.3545668  -1.3912334   2.0640770
O    6.5421474  -1.3912334   3.0289841
N    8.4263571  -2.2031501   2.0517207
H    8.5813478  -2.8241978   2.8318762
H    9.0660954  -2.1931381   1.2763544
N    7.1842035  -0.5793274   1.0058337
H    6.3890512   0.0417203   0.9859948
H    7.8392614  -0.5893394   0.2433792
C   11.4486048   1.3912017   1.5201357
O   12.2610242   1.3911911   0.5552339
N   11.6189681   2.2031078   2.5783738
H   12.4141205   2.8241555   2.5982127
H   10.9638996   2.1930904   3.3408283
N   10.3768145   0.5792745   1.5324973
H   10.2218238  -0.0417521   0.7523419
H    9.7370657   0.5892971   2.3078637
C    7.3545668   4.1737374   2.0640770
O    6.5421474   4.1737374   3.0289841
N    8.4263571   3.3618207   2.0517207
H    8.5813478   2.7407730   2.8318762
H    9.0660954   3.3718328   1.2763544
N    7.1842035   4.9856435   1.0058337
H    6.3890512   5.6066912   0.9859948
H    7.8392614   4.9756314   0.2433792
C   11.4486048   6.9561725   1.5201357
O   12.2610242   6.9561620   0.5552339
N   11.6189681   7.7680786   2.5783738
H   12.4141205   8.3891263   2.5982127
H   10.9638996   7.7580613   3.3408283
N   10.3768145   6.1442453   1.5324973
H   10.2218238   5.5232188   0.7523419
H    9.7370657   6.1542679   2.3078637
