{
  "name": "sub-app-package-json-sample",
  "version": "1.0.0",
  "description": "sub-app-package-json-sample",
  "type": "module",
  "main": "app.js",
  "scripts": {
    "start": "node app.js",
    "set-env": "echo \"Run 1 of commands:\n (when env \\x1b[92mcontain\\x1b[0m \\\\\\n) \\x1b[94mset -o allexport; source <source_file>; set +o allexport;\\x1b[0m\n (when env \\x1b[91mwithout\\x1b[0m \\\\\\n) \\x1b[94m\\$(cat <source_file> | grep \"^[^#\\;]\" | xargs)\\x1b[0m \"",
    "serve": "nodemon --watch . --inspect app.js",
    "lint": "eslint . --quiet",
    "test:unit": "jest  --coverage --testPathIgnorePatterns /routes/ --testPathIgnorePatterns /sub_modules/",
    "test:integration": "jest --detectOpenHandles --testPathPattern /src/routes/"
  },
  "author": "gofa",
  "license": "MIT",
  "private": true,
  "jest": {
    "testEnvironment": "node",
    "testPathIgnorePatterns": [
      "/config/"
    ],
    "coveragePathIgnorePatterns": [
      "/node_modules/",
      "/config/"
    ],
    "coverageThreshold": {
      "global": {
        "branches": 100,
        "functions": 100,
        "lines": 100,
        "statements": 100
      }
    }
  },
  "dependencies": {
    "express": "^4.17.1",
    "nodemon": "^2.0.15",
    "util-api": "link:sub_modules/util-api"
  },
  "devDependencies": {
    "@babel/preset-env": "^7.16.4",
    "babel-plugin-rewire": "^1.2.0",
    "eslint": "^8.4.1",
    "eslint-config-standard": "^16.0.3",
    "eslint-plugin-import": "^2.25.3",
    "eslint-plugin-node": "^11.1.0",
    "eslint-plugin-promise": "^5.1.1",
    "jest": "^27.4.3",
    "regenerator-runtime": "^0.13.9",
    "supertest": "^6.1.6"
  }
}
