%YAML 1.1
%TAG !u! tag:unity3d.com,2011:
--- !u!162 &1
EditorUserSettings:
  m_ObjectHideFlags: 0
  serializedVersion: 4
  m_ConfigSettings:
    RecentlyUsedSceneGuid-0:
      value: 0503575f5c57085954560d2447775e4513151e7c292c2035787f4b60b4e23760
      flags: 0
    RecentlyUsedSceneGuid-1:
      value: 5202055452570d0a5e575e24487a5a44464e4e7c297a24347a7d1f60b1e5676e
      flags: 0
    RecentlyUsedSceneGuid-2:
      value: 0754035e5454585d545e5f7345775e494e164e7b7b2a71687b2d4e65e3b36768
      flags: 0
    RecentlyUsedSceneGuid-3:
      value: 0500575355050d58085e08204871084444164972742e713478704462bab0616e
      flags: 0
    RecentlyUsedSceneGuid-4:
      value: 520101505d565108585c5a7b1627094444151a2f297d75617e791c6ae1b0673e
      flags: 0
    RecentlyUsedSceneGuid-5:
      value: 0204510256030a080e5d08764672074412151b282f7e22327b281b36e4e5623a
      flags: 0
    RecentlyUsedSceneGuid-6:
      value: 57505052500d5b09555a5e7547765e44434e482f7d7d23362b714e63e4b56439
      flags: 0
    RecentlyUsedSceneGuid-7:
      value: 5252005255575f08590a5f7a137a0844124e197b757f7e607a784a61e1e36268
      flags: 0
    RecentlyUsedSceneGuid-8:
      value: 5b55010351040b085a5e5e7347225b44464e4c2c7e7b7265782c4960e1b5603c
      flags: 0
    RecentlyUsedSceneGuid-9:
      value: 5757025000055009595a582111735944424f4e7a2f7175607f7c1c30e0b2676c
      flags: 0
    vcSharedLogLevel:
      value: 0d5e400f0650
      flags: 0
  m_VCAutomaticAdd: 1
  m_VCDebugCom: 0
  m_VCDebugCmd: 0
  m_VCDebugOut: 0
  m_SemanticMergeMode: 2
  m_DesiredImportWorkerCount: 4
  m_StandbyImportWorkerCount: 2
  m_IdleImportWorkerShutdownDelay: 60000
  m_VCShowFailedCheckout: 1
  m_VCOverwriteFailedCheckoutAssets: 1
  m_VCProjectOverlayIcons: 1
  m_VCHierarchyOverlayIcons: 1
  m_VCOtherOverlayIcons: 1
  m_VCAllowAsyncUpdate: 1
  m_ArtifactGarbageCollection: 1
