%YAML 1.1
%TAG !u! tag:unity3d.com,2011:
--- !u!114 &11400000
MonoBehaviour:
  m_ObjectHideFlags: 0
  m_CorrespondingSourceObject: {fileID: 0}
  m_PrefabInstance: {fileID: 0}
  m_PrefabAsset: {fileID: 0}
  m_GameObject: {fileID: 0}
  m_Enabled: 1
  m_EditorHideFlags: 0
  m_Script: {fileID: 11500000, guid: 121307dffee746d7af5c4af3f8fe1cb7, type: 3}
  m_Name: PinkBrickItemConfig
  m_EditorClassIdentifier: 
  icon: {fileID: 0}
  visuals:
  - prefab: {fileID: 9163095788243084563, guid: 4852dd2ff57c1fd4f89aee9dff3d006c,
      type: 3}
    sharedMesh: {fileID: -7018330538815869774, guid: a3dfb396e6990304d8ac2397a69a042d,
      type: 3}
    meshSize: {x: 0.6191961, y: 0.6191961, z: 0.6191961}
