%YAML 1.1
%TAG !u! tag:unity3d.com,2011:
--- !u!114 &11400000
MonoBehaviour:
  m_ObjectHideFlags: 0
  m_CorrespondingSourceObject: {fileID: 0}
  m_PrefabInstance: {fileID: 0}
  m_PrefabAsset: {fileID: 0}
  m_GameObject: {fileID: 0}
  m_Enabled: 1
  m_EditorHideFlags: 0
  m_Script: {fileID: 11500000, guid: f6e0426ba15e4ef5ad9e061da4aed4e1, type: 3}
  m_Name: ZeroLevelBuildBuildParam
  m_EditorClassIdentifier: 
  BuildPartHP: 50
  ItemsCount: 1
  ItemConfig: {fileID: 11400000, guid: 3e49f9f11c4c7c148a8c61acd4577a8a, type: 2}
