%YAML 1.1
%TAG !u! tag:unity3d.com,2011:
--- !u!1001 &7559378509269432727
PrefabInstance:
  m_ObjectHideFlags: 0
  serializedVersion: 2
  m_Modification:
    m_TransformParent: {fileID: 0}
    m_Modifications:
    - target: {fileID: -8679921383154817045, guid: a3dfb396e6990304d8ac2397a69a042d,
        type: 3}
      propertyPath: m_RootOrder
      value: 0
      objectReference: {fileID: 0}
    - target: {fileID: -8679921383154817045, guid: a3dfb396e6990304d8ac2397a69a042d,
        type: 3}
      propertyPath: m_LocalPosition.x
      value: -0
      objectReference: {fileID: 0}
    - target: {fileID: -8679921383154817045, guid: a3dfb396e6990304d8ac2397a69a042d,
        type: 3}
      propertyPath: m_LocalPosition.y
      value: 0
      objectReference: {fileID: 0}
    - target: {fileID: -8679921383154817045, guid: a3dfb396e6990304d8ac2397a69a042d,
        type: 3}
      propertyPath: m_LocalPosition.z
      value: 7.86
      objectReference: {fileID: 0}
    - target: {fileID: -8679921383154817045, guid: a3dfb396e6990304d8ac2397a69a042d,
        type: 3}
      propertyPath: m_LocalRotation.w
      value: 1
      objectReference: {fileID: 0}
    - target: {fileID: -8679921383154817045, guid: a3dfb396e6990304d8ac2397a69a042d,
        type: 3}
      propertyPath: m_LocalRotation.x
      value: 0
      objectReference: {fileID: 0}
    - target: {fileID: -8679921383154817045, guid: a3dfb396e6990304d8ac2397a69a042d,
        type: 3}
      propertyPath: m_LocalRotation.y
      value: -0
      objectReference: {fileID: 0}
    - target: {fileID: -8679921383154817045, guid: a3dfb396e6990304d8ac2397a69a042d,
        type: 3}
      propertyPath: m_LocalRotation.z
      value: -0
      objectReference: {fileID: 0}
    - target: {fileID: -8679921383154817045, guid: a3dfb396e6990304d8ac2397a69a042d,
        type: 3}
      propertyPath: m_LocalEulerAnglesHint.x
      value: 0
      objectReference: {fileID: 0}
    - target: {fileID: -8679921383154817045, guid: a3dfb396e6990304d8ac2397a69a042d,
        type: 3}
      propertyPath: m_LocalEulerAnglesHint.y
      value: 0
      objectReference: {fileID: 0}
    - target: {fileID: -8679921383154817045, guid: a3dfb396e6990304d8ac2397a69a042d,
        type: 3}
      propertyPath: m_LocalEulerAnglesHint.z
      value: 0
      objectReference: {fileID: 0}
    - target: {fileID: -7511558181221131132, guid: a3dfb396e6990304d8ac2397a69a042d,
        type: 3}
      propertyPath: m_Materials.Array.data[0]
      value: 
      objectReference: {fileID: 2100000, guid: c1e8d92d4a8ad38469fa89ec159c32b6, type: 2}
    - target: {fileID: 919132149155446097, guid: a3dfb396e6990304d8ac2397a69a042d,
        type: 3}
      propertyPath: m_Name
      value: brickGreen
      objectReference: {fileID: 0}
    m_RemovedComponents: []
  m_SourcePrefab: {fileID: 100100000, guid: a3dfb396e6990304d8ac2397a69a042d, type: 3}
