^C:\Users\ermuk\source\repos\FirstProgramC++\FirstProgramC++.vcxproj
C:\Users\ermuk\source\repos\FirstProgramC++\x64\Release\FirstProgramC++.ipdb
C:\Users\ermuk\source\repos\FirstProgramC++\x64\Release\FirstProgramC++.iobj
