^C:\USERS\ERMUK\SOURCE\REPOS\FIRSTPROGRAMC++\X64\DEBUG\FIRSTPROGRAMC++.OBJ
C:\USERS\ERMUK\SOURCE\REPOS\FIRSTPROGRAMC++\X64\DEBUG\FIRSTPROGRAMC++.EXE
C:\USERS\ERMUK\SOURCE\REPOS\FIRSTPROGRAMC++\X64\DEBUG\FIRSTPROGRAMC++.ILK
C:\USERS\ERMUK\SOURCE\REPOS\FIRSTPROGRAMC++\X64\DEBUG\FIRSTPROGRAMC++.PDB
