^C:\Users\ermuk\source\repos\FirstProgramC++\FirstProgramC++.vcxproj
C:\Users\ermuk\source\repos\FirstProgramC++\x64\Release\FirstProgramC++.ipdb
C:\Users\ermuk\source\repos\FirstProgramC++\x64\Release\FirstProgramC++.iobj
^C:\USERS\ERMUK\SOURCE\REPOS\FIRSTPROGRAMC++\X64\RELEASE\FIRSTPROGRAMC++.OBJ
C:\USERS\ERMUK\SOURCE\REPOS\FIRSTPROGRAMC++\X64\RELEASE\FIRSTPROGRAMC++.EXE
C:\USERS\ERMUK\SOURCE\REPOS\FIRSTPROGRAMC++\X64\RELEASE\FIRSTPROGRAMC++.PDB
