eth008 Board details:
IP address: 10.218.113.59
Port: 17494

connecting...
Relay states 8->1 : 00010001
1 off
2 off
Relay states 8->1 : 00010000
1 on
Relay states 8->1 : 00010001
3 on
Relay states 8->1 : 00010101
3 off
Relay states 8->1 : 00010001
exit
Disconnected
Pre-Script returned: Success
**************************************************
Testcase mods & parameters invoked:
**************************************************
Two core test case: None (this is not a two core testcase)

**************************************************
Copying test case files from the Build server
**************************************************
amk: remote testcase data path: http://gtjenkins.itg.ti.com/nightly_builds/mmwave_sdk-rel2/67-2018-04-18_18-31-01/artifacts/test/mmwave_sdk/packages/ti/drivers/cbuff/test/testdata


Testdata directory was not found on build server for this testcase

Call to copy_testcase_binary:
TCP: http://gtjenkins.itg.ti.com/nightly_builds/mmwave_sdk-rel2/67-2018-04-18_18-31-01/artifacts/test/mmwave_sdk/packages/ti/drivers/cbuff/test/xwr16xx; /home/a0216598/ti/mcpi_tf/mcpi_testframework_1_12_00_01/test/temp/mmWave_SDK___hs_awr16xx_sdk02.00.00_Test_Plan___jenkins-67_2018_04_18_19_04_56

Copying testcase binary file from http://gtjenkins.itg.ti.com/nightly_builds/mmwave_sdk-rel2/67-2018-04-18_18-31-01/artifacts/test/mmwave_sdk/packages/ti/drivers/cbuff/test/xwr16xx/xwr16xx_cbuff_dss.xe674 to /home/a0216598/ti/mcpi_tf/mcpi_testframework_1_12_00_01/test/temp/mmWave_SDK___hs_awr16xx_sdk02.00.00_Test_Plan___jenkins-67_2018_04_18_19_04_56 using command: 
wget -e robots=off --no-proxy -N -T 30 -t 2 -P /home/a0216598/ti/mcpi_tf/mcpi_testframework_1_12_00_01/test/temp/mmWave_SDK___hs_awr16xx_sdk02.00.00_Test_Plan___jenkins-67_2018_04_18_19_04_56 http://gtjenkins.itg.ti.com/nightly_builds/mmwave_sdk-rel2/67-2018-04-18_18-31-01/artifacts/test/mmwave_sdk/packages/ti/drivers/cbuff/test/xwr16xx/xwr16xx_cbuff_dss.xe674
**************************************************
Executing Testcase:/home/a0216598/ti/mcpi_tf/mcpi_testframework_1_12_00_01/test/temp/mmWave_SDK___hs_awr16xx_sdk02.00.00_Test_Plan___jenkins-67_2018_04_18_19_04_56/xwr16xx_cbuff_dss.xe674
**************************************************
Checking if Py4J Gateway server has started...
Py4J Gateway Server is Started
amk: a path in cpuList is Texas Instruments XDS110 USB Debug Probe_1/DEBUGSSM_0
amk: a path in cpuList is Texas Instruments XDS110 USB Debug Probe_1/IcePick_M_0
amk: a path in cpuList is Texas Instruments XDS110 USB Debug Probe_1/C674X_0
DSS test case opening debug session.

cr4ctl = 0x0

Loading binary to the DUT (no binary args updated):/home/a0216598/ti/mcpi_tf/mcpi_testframework_1_12_00_01/test/temp/mmWave_SDK___hs_awr16xx_sdk02.00.00_Test_Plan___jenkins-67_2018_04_18_19_04_56/xwr16xx_cbuff_dss.xe674
binary path = /home/a0216598/ti/mcpi_tf/mcpi_testframework_1_12_00_01/test/temp/mmWave_SDK___hs_awr16xx_sdk02.00.00_Test_Plan___jenkins-67_2018_04_18_19_04_56/xwr16xx_cbuff_dss.xe674


**************************************************
CIO Log captured for the testcase
**************************************************
***********************************************
************** CBUFF Unit Tests ***************
***********************************************
Debug: EDMA instance 0 has been initialized
---------------------------------------------------
Debug: Testing Invalid Data Size Failures
---------------------------------------------------
Feature: CBUFF: Invalid Minimum Data Size Test: Passed
Feature: CBUFF: Invalid Maximum Data Size Test: Passed
---------------------------------------------------
Debug: Testing CBUFF Data Formats in Non Interleaved mode
---------------------------------------------------
Debug: EDMA Channel Usage = 1
Feature: CBUFF HW Session: ADC Channels=1 Data Format [Non-Interleaved] ADC: Passed
Debug: EDMA Channel Usage = 2
Feature: CBUFF HW Session: ADC Channels=1 Data Format [Non-Interleaved] Chirp Parameters + ADC: Passed
Debug: EDMA Channel Usage = 2
Feature: CBUFF HW Session: ADC Channels=1 Data Format [Non-Interleaved] ADC + Chirp Parameters: Passed
Debug: EDMA Channel Usage = 4
Feature: CBUFF HW Session: ADC Channels=1 Data Format [Non-Interleaved] Chirp Parameters + ADC + Chirp Quality: Passed
Debug: EDMA Channel Usage = 4
Feature: CBUFF HW Session: ADC Channels=1 Data Format [Non-Interleaved] ADC + User: Passed
Debug: EDMA Channel Usage = 7
Feature: CBUFF HW Session: ADC Channels=1 Data Format [Non-Interleaved] Chirp Parameters + ADC + Chirp Quality + User: Passed
Debug: EDMA Channel Usage = 2
Feature: CBUFF HW Session: ADC Channels=2 Data Format [Non-Interleaved] ADC: Passed
Debug: EDMA Channel Usage = 4
Feature: CBUFF HW Session: ADC Channels=2 Data Format [Non-Interleaved] Chirp Parameters + ADC: Passed
Debug: EDMA Channel Usage = 4
Feature: CBUFF HW Session: ADC Channels=2 Data Format [Non-Interleaved] ADC + Chirp Parameters: Passed
Debug: EDMA Channel Usage = 6
Feature: CBUFF HW Session: ADC Channels=2 Data Format [Non-Interleaved] Chirp Parameters + ADC + Chirp Quality: Passed
Debug: EDMA Channel Usage = 5
Feature: CBUFF HW Session: ADC Channels=2 Data Format [Non-Interleaved] ADC + User: Passed
Debug: EDMA Channel Usage = 9
Feature: CBUFF HW Session: ADC Channels=2 Data Format [Non-Interleaved] Chirp Parameters + ADC + Chirp Quality + User: Passed
Debug: EDMA Channel Usage = 3
Feature: CBUFF HW Session: ADC Channels=3 Data Format [Non-Interleaved] ADC: Passed
Debug: EDMA Channel Usage = 6
Feature: CBUFF HW Session: ADC Channels=3 Data Format [Non-Interleaved] Chirp Parameters + ADC: Passed
Debug: EDMA Channel Usage = 6
Feature: CBUFF HW Session: ADC Channels=3 Data Format [Non-Interleaved] ADC + Chirp Parameters: Passed
Debug: EDMA Channel Usage = 8
Feature: CBUFF HW Session: ADC Channels=3 Data Format [Non-Interleaved] Chirp Parameters + ADC + Chirp Quality: Passed
Debug: EDMA Channel Usage = 6
Feature: CBUFF HW Session: ADC Channels=3 Data Format [Non-Interleaved] ADC + User: Passed
Debug: EDMA Channel Usage = 11
Feature: CBUFF HW Session: ADC Channels=3 Data Format [Non-Interleaved] Chirp Parameters + ADC + Chirp Quality + User: Passed
Debug: EDMA Channel Usage = 4
Feature: CBUFF HW Session: ADC Channels=4 Data Format [Non-Interleaved] ADC: Passed
Debug: EDMA Channel Usage = 8
Feature: CBUFF HW Session: ADC Channels=4 Data Format [Non-Interleaved] Chirp Parameters + ADC: Passed
Debug: EDMA Channel Usage = 8
Feature: CBUFF HW Session: ADC Channels=4 Data Format [Non-Interleaved] ADC + Chirp Parameters: Passed
Debug: EDMA Channel Usage = 10
Feature: CBUFF HW Session: ADC Channels=4 Data Format [Non-Interleaved] Chirp Parameters + ADC + Chirp Quality: Passed
Debug: EDMA Channel Usage = 7
Feature: CBUFF HW Session: ADC Channels=4 Data Format [Non-Interleaved] ADC + User: Passed
Debug: EDMA Channel Usage = 13
Feature: CBUFF HW Session: ADC Channels=4 Data Format [Non-Interleaved] Chirp Parameters + ADC + Chirp Quality + User: Passed
---------------------------------------------------
Debug: Testing Multiple Sessions
---------------------------------------------------
Debug: Session 0 created successfully
Debug: Session 1 created successfully
Debug: Session 2 created successfully
Debug: Session 3 created successfully
Debug: Session 4 created successfully
Debug: Session 5 created successfully
Debug: Session 6 created successfully
Debug: Session 0 has been activated and deactivated successfully
Debug: Session 1 has been activated and deactivated successfully
Debug: Session 2 has been activated and deactivated successfully
Debug: Session 3 has been activated and deactivated successfully
Debug: Session 4 has been activated and deactivated successfully
Debug: Session 5 has been activated and deactivated successfully
Debug: Session 6 has been activated and deactivated successfully
Debug: Session 0 has been deleted successfully
Debug: Session 1 has been deleted successfully
Debug: Session 2 has been deleted successfully
Debug: Session 3 has been deleted successfully
Debug: Session 4 has been deleted successfully
Debug: Session 5 has been deleted successfully
Debug: Session 6 has been deleted successfully
Feature: CBUFF: Multiple Session: Passed
---------------------------------------------------
Debug: Testing EDMA Channel Allocation Failures in Non Interleaved mode
---------------------------------------------------
Feature: CBUFF: EDMA Memory Allocation Test for Data Format ADC: Passed
Feature: CBUFF: EDMA Memory Allocation Test for Data Format Chirp Parameters + ADC: Passed
Feature: CBUFF: EDMA Memory Allocation Test for Data Format ADC + Chirp Parameters: Passed
Feature: CBUFF: EDMA Memory Allocation Test for Data Format Chirp Parameters + ADC + Chirp Quality: Passed
Feature: CBUFF: EDMA Memory Allocation Test for Data Format ADC + User: Passed
Feature: CBUFF: EDMA Memory Allocation Test for Data Format Chirp Parameters + ADC + Chirp Quality + User: Passed
---------------------------------------------------
Debug: Testing Multiple Chirp Mode
---------------------------------------------------
Debug: EDMA Channel Usage = 1
Feature: CBUFF ADC Channel: 1 Multiple Chirp: 1 Data Format: ADC: Passed
Debug: EDMA Channel Usage = 1
Feature: CBUFF ADC Channel: 1 Multiple Chirp: 2 Data Format: ADC: Passed
Debug: EDMA Channel Usage = 1
Feature: CBUFF ADC Channel: 1 Multiple Chirp: 3 Data Format: ADC: Passed
Debug: EDMA Channel Usage = 1
Feature: CBUFF ADC Channel: 1 Multiple Chirp: 4 Data Format: ADC: Passed
Debug: EDMA Channel Usage = 1
Feature: CBUFF ADC Channel: 1 Multiple Chirp: 5 Data Format: ADC: Passed
Debug: EDMA Channel Usage = 1
Feature: CBUFF ADC Channel: 1 Multiple Chirp: 6 Data Format: ADC: Passed
Debug: EDMA Channel Usage = 1
Feature: CBUFF ADC Channel: 1 Multiple Chirp: 7 Data Format: ADC: Passed
Debug: EDMA Channel Usage = 1
Feature: CBUFF ADC Channel: 1 Multiple Chirp: 8 Data Format: ADC: Passed
Debug: EDMA Channel Usage = 2
Feature: CBUFF ADC Channel: 1 Multiple Chirp: 1 Data Format: Chirp Parameters + ADC: Passed
Debug: EDMA Channel Usage = 3
Feature: CBUFF ADC Channel: 1 Multiple Chirp: 2 Data Format: Chirp Parameters + ADC: Passed
Debug: EDMA Channel Usage = 4
Feature: CBUFF ADC Channel: 1 Multiple Chirp: 3 Data Format: Chirp Parameters + ADC: Passed
Debug: EDMA Channel Usage = 5
Feature: CBUFF ADC Channel: 1 Multiple Chirp: 4 Data Format: Chirp Parameters + ADC: Passed
Debug: EDMA Channel Usage = 6
Feature: CBUFF ADC Channel: 1 Multiple Chirp: 5 Data Format: Chirp Parameters + ADC: Passed
Debug: EDMA Channel Usage = 7
Feature: CBUFF ADC Channel: 1 Multiple Chirp: 6 Data Format: Chirp Parameters + ADC: Passed
Debug: EDMA Channel Usage = 8
Feature: CBUFF ADC Channel: 1 Multiple Chirp: 7 Data Format: Chirp Parameters + ADC: Passed
Debug: EDMA Channel Usage = 9
Feature: CBUFF ADC Channel: 1 Multiple Chirp: 8 Data Format: Chirp Parameters + ADC: Passed
Debug: EDMA Channel Usage = 2
Feature: CBUFF ADC Channel: 1 Multiple Chirp: 1 Data Format: ADC + Chirp Parameters: Passed
Debug: EDMA Channel Usage = 3
Feature: CBUFF ADC Channel: 1 Multiple Chirp: 2 Data Format: ADC + Chirp Parameters: Passed
Debug: EDMA Channel Usage = 4
Feature: CBUFF ADC Channel: 1 Multiple Chirp: 3 Data Format: ADC + Chirp Parameters: Passed
Debug: EDMA Channel Usage = 5
Feature: CBUFF ADC Channel: 1 Multiple Chirp: 4 Data Format: ADC + Chirp Parameters: Passed
Debug: EDMA Channel Usage = 6
Feature: CBUFF ADC Channel: 1 Multiple Chirp: 5 Data Format: ADC + Chirp Parameters: Passed
Debug: EDMA Channel Usage = 7
Feature: CBUFF ADC Channel: 1 Multiple Chirp: 6 Data Format: ADC + Chirp Parameters: Passed
Debug: EDMA Channel Usage = 8
Feature: CBUFF ADC Channel: 1 Multiple Chirp: 7 Data Format: ADC + Chirp Parameters: Passed
Debug: EDMA Channel Usage = 9
Feature: CBUFF ADC Channel: 1 Multiple Chirp: 8 Data Format: ADC + Chirp Parameters: Passed
Debug: EDMA Channel Usage = 4
Feature: CBUFF ADC Channel: 1 Multiple Chirp: 1 Data Format: Chirp Parameters + ADC + Chirp Quality: Passed
Debug: EDMA Channel Usage = 5
Feature: CBUFF ADC Channel: 1 Multiple Chirp: 2 Data Format: Chirp Parameters + ADC + Chirp Quality: Passed
Debug: EDMA Channel Usage = 6
Feature: CBUFF ADC Channel: 1 Multiple Chirp: 3 Data Format: Chirp Parameters + ADC + Chirp Quality: Passed
Debug: EDMA Channel Usage = 7
Feature: CBUFF ADC Channel: 1 Multiple Chirp: 4 Data Format: Chirp Parameters + ADC + Chirp Quality: Passed
Debug: EDMA Channel Usage = 8
Feature: CBUFF ADC Channel: 1 Multiple Chirp: 5 Data Format: Chirp Parameters + ADC + Chirp Quality: Passed
Debug: EDMA Channel Usage = 9
Feature: CBUFF ADC Channel: 1 Multiple Chirp: 6 Data Format: Chirp Parameters + ADC + Chirp Quality: Passed
Debug: EDMA Channel Usage = 10
Feature: CBUFF ADC Channel: 1 Multiple Chirp: 7 Data Format: Chirp Parameters + ADC + Chirp Quality: Passed
Debug: EDMA Channel Usage = 11
Feature: CBUFF ADC Channel: 1 Multiple Chirp: 8 Data Format: Chirp Parameters + ADC + Chirp Quality: Passed
Debug: EDMA Channel Usage = 4
Feature: CBUFF ADC Channel: 1 Multiple Chirp: 1 Data Format: ADC + User: Passed
Debug: EDMA Channel Usage = 4
Feature: CBUFF ADC Channel: 1 Multiple Chirp: 2 Data Format: ADC + User: Passed
Debug: EDMA Channel Usage = 4
Feature: CBUFF ADC Channel: 1 Multiple Chirp: 3 Data Format: ADC + User: Passed
Debug: EDMA Channel Usage = 4
Feature: CBUFF ADC Channel: 1 Multiple Chirp: 4 Data Format: ADC + User: Passed
Debug: EDMA Channel Usage = 4
Feature: CBUFF ADC Channel: 1 Multiple Chirp: 5 Data Format: ADC + User: Passed
Debug: EDMA Channel Usage = 4
Feature: CBUFF ADC Channel: 1 Multiple Chirp: 6 Data Format: ADC + User: Passed
Debug: EDMA Channel Usage = 4
Feature: CBUFF ADC Channel: 1 Multiple Chirp: 7 Data Format: ADC + User: Passed
Debug: EDMA Channel Usage = 4
Feature: CBUFF ADC Channel: 1 Multiple Chirp: 8 Data Format: ADC + User: Passed
Debug: EDMA Channel Usage = 7
Feature: CBUFF ADC Channel: 1 Multiple Chirp: 1 Data Format: Chirp Parameters + ADC + Chirp Quality + User: Passed
Debug: EDMA Channel Usage = 8
Feature: CBUFF ADC Channel: 1 Multiple Chirp: 2 Data Format: Chirp Parameters + ADC + Chirp Quality + User: Passed
Debug: EDMA Channel Usage = 9
Feature: CBUFF ADC Channel: 1 Multiple Chirp: 3 Data Format: Chirp Parameters + ADC + Chirp Quality + User: Passed
Debug: EDMA Channel Usage = 10
Feature: CBUFF ADC Channel: 1 Multiple Chirp: 4 Data Format: Chirp Parameters + ADC + Chirp Quality + User: Passed
Debug: EDMA Channel Usage = 11
Feature: CBUFF ADC Channel: 1 Multiple Chirp: 5 Data Format: Chirp Parameters + ADC + Chirp Quality + User: Passed
Debug: EDMA Channel Usage = 12
Feature: CBUFF ADC Channel: 1 Multiple Chirp: 6 Data Format: Chirp Parameters + ADC + Chirp Quality + User: Passed
Debug: EDMA Channel Usage = 13
Feature: CBUFF ADC Channel: 1 Multiple Chirp: 7 Data Format: Chirp Parameters + ADC + Chirp Quality + User: Passed
Debug: EDMA Channel Usage = 14
Feature: CBUFF ADC Channel: 1 Multiple Chirp: 8 Data Format: Chirp Parameters + ADC + Chirp Quality + User: Passed
Debug: EDMA Channel Usage = 2
Feature: CBUFF ADC Channel: 2 Multiple Chirp: 1 Data Format: ADC: Passed
Debug: EDMA Channel Usage = 2
Feature: CBUFF ADC Channel: 2 Multiple Chirp: 2 Data Format: ADC: Passed
Debug: EDMA Channel Usage = 2
Feature: CBUFF ADC Channel: 2 Multiple Chirp: 3 Data Format: ADC: Passed
Debug: EDMA Channel Usage = 2
Feature: CBUFF ADC Channel: 2 Multiple Chirp: 4 Data Format: ADC: Passed
Debug: EDMA Channel Usage = 2
Feature: CBUFF ADC Channel: 2 Multiple Chirp: 5 Data Format: ADC: Passed
Debug: EDMA Channel Usage = 2
Feature: CBUFF ADC Channel: 2 Multiple Chirp: 6 Data Format: ADC: Passed
Debug: EDMA Channel Usage = 2
Feature: CBUFF ADC Channel: 2 Multiple Chirp: 7 Data Format: ADC: Passed
Debug: EDMA Channel Usage = 2
Feature: CBUFF ADC Channel: 2 Multiple Chirp: 8 Data Format: ADC: Passed
Debug: EDMA Channel Usage = 4
Feature: CBUFF ADC Channel: 2 Multiple Chirp: 1 Data Format: Chirp Parameters + ADC: Passed
Debug: EDMA Channel Usage = 4
Feature: CBUFF ADC Channel: 2 Multiple Chirp: 2 Data Format: Chirp Parameters + ADC: Passed
Debug: EDMA Channel Usage = 5
Feature: CBUFF ADC Channel: 2 Multiple Chirp: 3 Data Format: Chirp Parameters + ADC: Passed
Debug: EDMA Channel Usage = 6
Feature: CBUFF ADC Channel: 2 Multiple Chirp: 4 Data Format: Chirp Parameters + ADC: Passed
Debug: EDMA Channel Usage = 7
Feature: CBUFF ADC Channel: 2 Multiple Chirp: 5 Data Format: Chirp Parameters + ADC: Passed
Debug: EDMA Channel Usage = 8
Feature: CBUFF ADC Channel: 2 Multiple Chirp: 6 Data Format: Chirp Parameters + ADC: Passed
Debug: EDMA Channel Usage = 9
Feature: CBUFF ADC Channel: 2 Multiple Chirp: 7 Data Format: Chirp Parameters + ADC: Passed
Debug: EDMA Channel Usage = 10
Feature: CBUFF ADC Channel: 2 Multiple Chirp: 8 Data Format: Chirp Parameters + ADC: Passed
Debug: EDMA Channel Usage = 4
Feature: CBUFF ADC Channel: 2 Multiple Chirp: 1 Data Format: ADC + Chirp Parameters: Passed
Debug: EDMA Channel Usage = 4
Feature: CBUFF ADC Channel: 2 Multiple Chirp: 2 Data Format: ADC + Chirp Parameters: Passed
Debug: EDMA Channel Usage = 5
Feature: CBUFF ADC Channel: 2 Multiple Chirp: 3 Data Format: ADC + Chirp Parameters: Passed
Debug: EDMA Channel Usage = 6
Feature: CBUFF ADC Channel: 2 Multiple Chirp: 4 Data Format: ADC + Chirp Parameters: Passed
Debug: EDMA Channel Usage = 7
Feature: CBUFF ADC Channel: 2 Multiple Chirp: 5 Data Format: ADC + Chirp Parameters: Passed
Debug: EDMA Channel Usage = 8
Feature: CBUFF ADC Channel: 2 Multiple Chirp: 6 Data Format: ADC + Chirp Parameters: Passed
Debug: EDMA Channel Usage = 9
Feature: CBUFF ADC Channel: 2 Multiple Chirp: 7 Data Format: ADC + Chirp Parameters: Passed
Debug: EDMA Channel Usage = 10
Feature: CBUFF ADC Channel: 2 Multiple Chirp: 8 Data Format: ADC + Chirp Parameters: Passed
Debug: EDMA Channel Usage = 6
Feature: CBUFF ADC Channel: 2 Multiple Chirp: 1 Data Format: Chirp Parameters + ADC + Chirp Quality: Passed
Debug: EDMA Channel Usage = 6
Feature: CBUFF ADC Channel: 2 Multiple Chirp: 2 Data Format: Chirp Parameters + ADC + Chirp Quality: Passed
Debug: EDMA Channel Usage = 7
Feature: CBUFF ADC Channel: 2 Multiple Chirp: 3 Data Format: Chirp Parameters + ADC + Chirp Quality: Passed
Debug: EDMA Channel Usage = 8
Feature: CBUFF ADC Channel: 2 Multiple Chirp: 4 Data Format: Chirp Parameters + ADC + Chirp Quality: Passed
Debug: EDMA Channel Usage = 9
Feature: CBUFF ADC Channel: 2 Multiple Chirp: 5 Data Format: Chirp Parameters + ADC + Chirp Quality: Passed
Debug: EDMA Channel Usage = 10
Feature: CBUFF ADC Channel: 2 Multiple Chirp: 6 Data Format: Chirp Parameters + ADC + Chirp Quality: Passed
Debug: EDMA Channel Usage = 11
Feature: CBUFF ADC Channel: 2 Multiple Chirp: 7 Data Format: Chirp Parameters + ADC + Chirp Quality: Passed
Debug: EDMA Channel Usage = 12
Feature: CBUFF ADC Channel: 2 Multiple Chirp: 8 Data Format: Chirp Parameters + ADC + Chirp Quality: Passed
Debug: EDMA Channel Usage = 5
Feature: CBUFF ADC Channel: 2 Multiple Chirp: 1 Data Format: ADC + User: Passed
Debug: EDMA Channel Usage = 5
Feature: CBUFF ADC Channel: 2 Multiple Chirp: 2 Data Format: ADC + User: Passed
Debug: EDMA Channel Usage = 5
Feature: CBUFF ADC Channel: 2 Multiple Chirp: 3 Data Format: ADC + User: Passed
Debug: EDMA Channel Usage = 5
Feature: CBUFF ADC Channel: 2 Multiple Chirp: 4 Data Format: ADC + User: Passed
Debug: EDMA Channel Usage = 5
Feature: CBUFF ADC Channel: 2 Multiple Chirp: 5 Data Format: ADC + User: Passed
Debug: EDMA Channel Usage = 5
Feature: CBUFF ADC Channel: 2 Multiple Chirp: 6 Data Format: ADC + User: Passed
Debug: EDMA Channel Usage = 5
Feature: CBUFF ADC Channel: 2 Multiple Chirp: 7 Data Format: ADC + User: Passed
Debug: EDMA Channel Usage = 5
Feature: CBUFF ADC Channel: 2 Multiple Chirp: 8 Data Format: ADC + User: Passed
Debug: EDMA Channel Usage = 9
Feature: CBUFF ADC Channel: 2 Multiple Chirp: 1 Data Format: Chirp Parameters + ADC + Chirp Quality + User: Passed
Debug: EDMA Channel Usage = 9
Feature: CBUFF ADC Channel: 2 Multiple Chirp: 2 Data Format: Chirp Parameters + ADC + Chirp Quality + User: Passed
Debug: EDMA Channel Usage = 10
Feature: CBUFF ADC Channel: 2 Multiple Chirp: 3 Data Format: Chirp Parameters + ADC + Chirp Quality + User: Passed
Debug: EDMA Channel Usage = 11
Feature: CBUFF ADC Channel: 2 Multiple Chirp: 4 Data Format: Chirp Parameters + ADC + Chirp Quality + User: Passed
Debug: EDMA Channel Usage = 12
Feature: CBUFF ADC Channel: 2 Multiple Chirp: 5 Data Format: Chirp Parameters + ADC + Chirp Quality + User: Passed
Debug: EDMA Channel Usage = 13
Feature: CBUFF ADC Channel: 2 Multiple Chirp: 6 Data Format: Chirp Parameters + ADC + Chirp Quality + User: Passed
Debug: EDMA Channel Usage = 14
Feature: CBUFF ADC Channel: 2 Multiple Chirp: 7 Data Format: Chirp Parameters + ADC + Chirp Quality + User: Passed
Debug: EDMA Channel Usage = 15
Feature: CBUFF ADC Channel: 2 Multiple Chirp: 8 Data Format: Chirp Parameters + ADC + Chirp Quality + User: Passed
Debug: EDMA Channel Usage = 3
Feature: CBUFF ADC Channel: 3 Multiple Chirp: 1 Data Format: ADC: Passed
Debug: EDMA Channel Usage = 3
Feature: CBUFF ADC Channel: 3 Multiple Chirp: 2 Data Format: ADC: Passed
Debug: EDMA Channel Usage = 3
Feature: CBUFF ADC Channel: 3 Multiple Chirp: 3 Data Format: ADC: Passed
Debug: EDMA Channel Usage = 3
Feature: CBUFF ADC Channel: 3 Multiple Chirp: 4 Data Format: ADC: Passed
Debug: EDMA Channel Usage = 3
Feature: CBUFF ADC Channel: 3 Multiple Chirp: 5 Data Format: ADC: Passed
Debug: EDMA Channel Usage = 3
Feature: CBUFF ADC Channel: 3 Multiple Chirp: 6 Data Format: ADC: Passed
Debug: EDMA Channel Usage = 3
Feature: CBUFF ADC Channel: 3 Multiple Chirp: 7 Data Format: ADC: Passed
Debug: EDMA Channel Usage = 3
Feature: CBUFF ADC Channel: 3 Multiple Chirp: 8 Data Format: ADC: Passed
Debug: EDMA Channel Usage = 6
Feature: CBUFF ADC Channel: 3 Multiple Chirp: 1 Data Format: Chirp Parameters + ADC: Passed
Debug: EDMA Channel Usage = 5
Feature: CBUFF ADC Channel: 3 Multiple Chirp: 2 Data Format: Chirp Parameters + ADC: Passed
Debug: EDMA Channel Usage = 6
Feature: CBUFF ADC Channel: 3 Multiple Chirp: 3 Data Format: Chirp Parameters + ADC: Passed
Debug: EDMA Channel Usage = 7
Feature: CBUFF ADC Channel: 3 Multiple Chirp: 4 Data Format: Chirp Parameters + ADC: Passed
Debug: EDMA Channel Usage = 8
Feature: CBUFF ADC Channel: 3 Multiple Chirp: 5 Data Format: Chirp Parameters + ADC: Passed
Debug: EDMA Channel Usage = 9
Feature: CBUFF ADC Channel: 3 Multiple Chirp: 6 Data Format: Chirp Parameters + ADC: Passed
Debug: EDMA Channel Usage = 10
Feature: CBUFF ADC Channel: 3 Multiple Chirp: 7 Data Format: Chirp Parameters + ADC: Passed
Debug: EDMA Channel Usage = 11
Feature: CBUFF ADC Channel: 3 Multiple Chirp: 8 Data Format: Chirp Parameters + ADC: Passed
Debug: EDMA Channel Usage = 6
Feature: CBUFF ADC Channel: 3 Multiple Chirp: 1 Data Format: ADC + Chirp Parameters: Passed
Debug: EDMA Channel Usage = 5
Feature: CBUFF ADC Channel: 3 Multiple Chirp: 2 Data Format: ADC + Chirp Parameters: Passed
Debug: EDMA Channel Usage = 6
Feature: CBUFF ADC Channel: 3 Multiple Chirp: 3 Data Format: ADC + Chirp Parameters: Passed
Debug: EDMA Channel Usage = 7
Feature: CBUFF ADC Channel: 3 Multiple Chirp: 4 Data Format: ADC + Chirp Parameters: Passed
Debug: EDMA Channel Usage = 8
Feature: CBUFF ADC Channel: 3 Multiple Chirp: 5 Data Format: ADC + Chirp Parameters: Passed
Debug: EDMA Channel Usage = 9
Feature: CBUFF ADC Channel: 3 Multiple Chirp: 6 Data Format: ADC + Chirp Parameters: Passed
Debug: EDMA Channel Usage = 10
Feature: CBUFF ADC Channel: 3 Multiple Chirp: 7 Data Format: ADC + Chirp Parameters: Passed
Debug: EDMA Channel Usage = 11
Feature: CBUFF ADC Channel: 3 Multiple Chirp: 8 Data Format: ADC + Chirp Parameters: Passed
Debug: EDMA Channel Usage = 8
Feature: CBUFF ADC Channel: 3 Multiple Chirp: 1 Data Format: Chirp Parameters + ADC + Chirp Quality: Passed
Debug: EDMA Channel Usage = 7
Feature: CBUFF ADC Channel: 3 Multiple Chirp: 2 Data Format: Chirp Parameters + ADC + Chirp Quality: Passed
Debug: EDMA Channel Usage = 8
Feature: CBUFF ADC Channel: 3 Multiple Chirp: 3 Data Format: Chirp Parameters + ADC + Chirp Quality: Passed
Debug: EDMA Channel Usage = 9
Feature: CBUFF ADC Channel: 3 Multiple Chirp: 4 Data Format: Chirp Parameters + ADC + Chirp Quality: Passed
Debug: EDMA Channel Usage = 10
Feature: CBUFF ADC Channel: 3 Multiple Chirp: 5 Data Format: Chirp Parameters + ADC + Chirp Quality: Passed
Debug: EDMA Channel Usage = 11
Feature: CBUFF ADC Channel: 3 Multiple Chirp: 6 Data Format: Chirp Parameters + ADC + Chirp Quality: Passed
Debug: EDMA Channel Usage = 12
Feature: CBUFF ADC Channel: 3 Multiple Chirp: 7 Data Format: Chirp Parameters + ADC + Chirp Quality: Passed
Debug: EDMA Channel Usage = 13
Feature: CBUFF ADC Channel: 3 Multiple Chirp: 8 Data Format: Chirp Parameters + ADC + Chirp Quality: Passed
Debug: EDMA Channel Usage = 6
Feature: CBUFF ADC Channel: 3 Multiple Chirp: 1 Data Format: ADC + User: Passed
Debug: EDMA Channel Usage = 6
Feature: CBUFF ADC Channel: 3 Multiple Chirp: 2 Data Format: ADC + User: Passed
Debug: EDMA Channel Usage = 6
Feature: CBUFF ADC Channel: 3 Multiple Chirp: 3 Data Format: ADC + User: Passed
Debug: EDMA Channel Usage = 6
Feature: CBUFF ADC Channel: 3 Multiple Chirp: 4 Data Format: ADC + User: Passed
Debug: EDMA Channel Usage = 6
Feature: CBUFF ADC Channel: 3 Multiple Chirp: 5 Data Format: ADC + User: Passed
Debug: EDMA Channel Usage = 6
Feature: CBUFF ADC Channel: 3 Multiple Chirp: 6 Data Format: ADC + User: Passed
Debug: EDMA Channel Usage = 6
Feature: CBUFF ADC Channel: 3 Multiple Chirp: 7 Data Format: ADC + User: Passed
Debug: EDMA Channel Usage = 6
Feature: CBUFF ADC Channel: 3 Multiple Chirp: 8 Data Format: ADC + User: Passed
Debug: EDMA Channel Usage = 11
Feature: CBUFF ADC Channel: 3 Multiple Chirp: 1 Data Format: Chirp Parameters + ADC + Chirp Quality + User: Passed
Debug: EDMA Channel Usage = 10
Feature: CBUFF ADC Channel: 3 Multiple Chirp: 2 Data Format: Chirp Parameters + ADC + Chirp Quality + User: Passed
Debug: EDMA Channel Usage = 11
Feature: CBUFF ADC Channel: 3 Multiple Chirp: 3 Data Format: Chirp Parameters + ADC + Chirp Quality + User: Passed
Debug: EDMA Channel Usage = 12
Feature: CBUFF ADC Channel: 3 Multiple Chirp: 4 Data Format: Chirp Parameters + ADC + Chirp Quality + User: Passed
Debug: EDMA Channel Usage = 13
Feature: CBUFF ADC Channel: 3 Multiple Chirp: 5 Data Format: Chirp Parameters + ADC + Chirp Quality + User: Passed
Debug: EDMA Channel Usage = 14
Feature: CBUFF ADC Channel: 3 Multiple Chirp: 6 Data Format: Chirp Parameters + ADC + Chirp Quality + User: Passed
Debug: EDMA Channel Usage = 15
Feature: CBUFF ADC Channel: 3 Multiple Chirp: 7 Data Format: Chirp Parameters + ADC + Chirp Quality + User: Passed
Debug: EDMA Channel Usage = 16
Feature: CBUFF ADC Channel: 3 Multiple Chirp: 8 Data Format: Chirp Parameters + ADC + Chirp Quality + User: Passed
Debug: EDMA Channel Usage = 4
Feature: CBUFF ADC Channel: 4 Multiple Chirp: 1 Data Format: ADC: Passed
Debug: EDMA Channel Usage = 4
Feature: CBUFF ADC Channel: 4 Multiple Chirp: 2 Data Format: ADC: Passed
Debug: EDMA Channel Usage = 4
Feature: CBUFF ADC Channel: 4 Multiple Chirp: 3 Data Format: ADC: Passed
Debug: EDMA Channel Usage = 4
Feature: CBUFF ADC Channel: 4 Multiple Chirp: 4 Data Format: ADC: Passed
Debug: EDMA Channel Usage = 4
Feature: CBUFF ADC Channel: 4 Multiple Chirp: 5 Data Format: ADC: Passed
Debug: EDMA Channel Usage = 4
Feature: CBUFF ADC Channel: 4 Multiple Chirp: 6 Data Format: ADC: Passed
Debug: EDMA Channel Usage = 4
Feature: CBUFF ADC Channel: 4 Multiple Chirp: 7 Data Format: ADC: Passed
Debug: EDMA Channel Usage = 4
Feature: CBUFF ADC Channel: 4 Multiple Chirp: 8 Data Format: ADC: Passed
Debug: EDMA Channel Usage = 8
Feature: CBUFF ADC Channel: 4 Multiple Chirp: 1 Data Format: Chirp Parameters + ADC: Passed
Debug: EDMA Channel Usage = 6
Feature: CBUFF ADC Channel: 4 Multiple Chirp: 2 Data Format: Chirp Parameters + ADC: Passed
Debug: EDMA Channel Usage = 7
Feature: CBUFF ADC Channel: 4 Multiple Chirp: 3 Data Format: Chirp Parameters + ADC: Passed
Debug: EDMA Channel Usage = 8
Feature: CBUFF ADC Channel: 4 Multiple Chirp: 4 Data Format: Chirp Parameters + ADC: Passed
Debug: EDMA Channel Usage = 9
Feature: CBUFF ADC Channel: 4 Multiple Chirp: 5 Data Format: Chirp Parameters + ADC: Passed
Debug: EDMA Channel Usage = 10
Feature: CBUFF ADC Channel: 4 Multiple Chirp: 6 Data Format: Chirp Parameters + ADC: Passed
Debug: EDMA Channel Usage = 11
Feature: CBUFF ADC Channel: 4 Multiple Chirp: 7 Data Format: Chirp Parameters + ADC: Passed
Debug: EDMA Channel Usage = 12
Feature: CBUFF ADC Channel: 4 Multiple Chirp: 8 Data Format: Chirp Parameters + ADC: Passed
Debug: EDMA Channel Usage = 8
Feature: CBUFF ADC Channel: 4 Multiple Chirp: 1 Data Format: ADC + Chirp Parameters: Passed
Debug: EDMA Channel Usage = 6
Feature: CBUFF ADC Channel: 4 Multiple Chirp: 2 Data Format: ADC + Chirp Parameters: Passed
Debug: EDMA Channel Usage = 7
Feature: CBUFF ADC Channel: 4 Multiple Chirp: 3 Data Format: ADC + Chirp Parameters: Passed
Debug: EDMA Channel Usage = 8
Feature: CBUFF ADC Channel: 4 Multiple Chirp: 4 Data Format: ADC + Chirp Parameters: Passed
Debug: EDMA Channel Usage = 9
Feature: CBUFF ADC Channel: 4 Multiple Chirp: 5 Data Format: ADC + Chirp Parameters: Passed
Debug: EDMA Channel Usage = 10
Feature: CBUFF ADC Channel: 4 Multiple Chirp: 6 Data Format: ADC + Chirp Parameters: Passed
Debug: EDMA Channel Usage = 11
Feature: CBUFF ADC Channel: 4 Multiple Chirp: 7 Data Format: ADC + Chirp Parameters: Passed
Debug: EDMA Channel Usage = 12
Feature: CBUFF ADC Channel: 4 Multiple Chirp: 8 Data Format: ADC + Chirp Parameters: Passed
Debug: EDMA Channel Usage = 10
Feature: CBUFF ADC Channel: 4 Multiple Chirp: 1 Data Format: Chirp Parameters + ADC + Chirp Quality: Passed
Debug: EDMA Channel Usage = 8
Feature: CBUFF ADC Channel: 4 Multiple Chirp: 2 Data Format: Chirp Parameters + ADC + Chirp Quality: Passed
Debug: EDMA Channel Usage = 9
Feature: CBUFF ADC Channel: 4 Multiple Chirp: 3 Data Format: Chirp Parameters + ADC + Chirp Quality: Passed
Debug: EDMA Channel Usage = 10
Feature: CBUFF ADC Channel: 4 Multiple Chirp: 4 Data Format: Chirp Parameters + ADC + Chirp Quality: Passed
Debug: EDMA Channel Usage = 11
Feature: CBUFF ADC Channel: 4 Multiple Chirp: 5 Data Format: Chirp Parameters + ADC + Chirp Quality: Passed
Debug: EDMA Channel Usage = 12
Feature: CBUFF ADC Channel: 4 Multiple Chirp: 6 Data Format: Chirp Parameters + ADC + Chirp Quality: Passed
Debug: EDMA Channel Usage = 13
Feature: CBUFF ADC Channel: 4 Multiple Chirp: 7 Data Format: Chirp Parameters + ADC + Chirp Quality: Passed
Debug: EDMA Channel Usage = 14
Feature: CBUFF ADC Channel: 4 Multiple Chirp: 8 Data Format: Chirp Parameters + ADC + Chirp Quality: Passed
Debug: EDMA Channel Usage = 7
Feature: CBUFF ADC Channel: 4 Multiple Chirp: 1 Data Format: ADC + User: Passed
Debug: EDMA Channel Usage = 7
Feature: CBUFF ADC Channel: 4 Multiple Chirp: 2 Data Format: ADC + User: Passed
Debug: EDMA Channel Usage = 7
Feature: CBUFF ADC Channel: 4 Multiple Chirp: 3 Data Format: ADC + User: Passed
Debug: EDMA Channel Usage = 7
Feature: CBUFF ADC Channel: 4 Multiple Chirp: 4 Data Format: ADC + User: Passed
Debug: EDMA Channel Usage = 7
Feature: CBUFF ADC Channel: 4 Multiple Chirp: 5 Data Format: ADC + User: Passed
Debug: EDMA Channel Usage = 7
Feature: CBUFF ADC Channel: 4 Multiple Chirp: 6 Data Format: ADC + User: Passed
Debug: EDMA Channel Usage = 7
Feature: CBUFF ADC Channel: 4 Multiple Chirp: 7 Data Format: ADC + User: Passed
Debug: EDMA Channel Usage = 7
Feature: CBUFF ADC Channel: 4 Multiple Chirp: 8 Data Format: ADC + User: Passed
Debug: EDMA Channel Usage = 13
Feature: CBUFF ADC Channel: 4 Multiple Chirp: 1 Data Format: Chirp Parameters + ADC + Chirp Quality + User: Passed
Debug: EDMA Channel Usage = 11
Feature: CBUFF ADC Channel: 4 Multiple Chirp: 2 Data Format: Chirp Parameters + ADC + Chirp Quality + User: Passed
Debug: EDMA Channel Usage = 12
Feature: CBUFF ADC Channel: 4 Multiple Chirp: 3 Data Format: Chirp Parameters + ADC + Chirp Quality + User: Passed
Debug: EDMA Channel Usage = 13
Feature: CBUFF ADC Channel: 4 Multiple Chirp: 4 Data Format: Chirp Parameters + ADC + Chirp Quality + User: Passed
Debug: EDMA Channel Usage = 14
Feature: CBUFF ADC Channel: 4 Multiple Chirp: 5 Data Format: Chirp Parameters + ADC + Chirp Quality + User: Passed
Debug: EDMA Channel Usage = 15
Feature: CBUFF ADC Channel: 4 Multiple Chirp: 6 Data Format: Chirp Parameters + ADC + Chirp Quality + User: Passed
Debug: EDMA Channel Usage = 16
Feature: CBUFF ADC Channel: 4 Multiple Chirp: 7 Data Format: Chirp Parameters + ADC + Chirp Quality + User: Passed
Debug: EDMA Channel Usage = 17
Feature: CBUFF ADC Channel: 4 Multiple Chirp: 8 Data Format: Chirp Parameters + ADC + Chirp Quality + User: Passed
Debug: CBUFF Unit Tests completed
Value read from Global variable (MCPI_Result): 0
Test Failure Signature: 0
Test Log Messages: 
Feature tested: CBUFF: Invalid Minimum Data Size Test: Passed
Feature tested: CBUFF: Invalid Maximum Data Size Test: Passed
Feature tested: CBUFF HW Session: ADC Channels=1 Data Format [Non-Interleaved] ADC: Passed
Feature tested: CBUFF HW Session: ADC Channels=1 Data Format [Non-Interleaved] Chirp Parameters + ADC: Passed
Feature tested: CBUFF HW Session: ADC Channels=1 Data Format [Non-Interleaved] ADC + Chirp Parameters: Passed
Feature tested: CBUFF HW Session: ADC Channels=1 Data Format [Non-Interleaved] Chirp Parameters + ADC + Chirp Quality: Passed
Feature tested: CBUFF HW Session: ADC Channels=1 Data Format [Non-Interleaved] ADC + User: Passed
Feature tested: CBUFF HW Session: ADC Channels=1 Data Format [Non-Interleaved] Chirp Parameters + ADC + Chirp Quality + User: Passed
Feature tested: CBUFF HW Session: ADC Channels=2 Data Format [Non-Interleaved] ADC: Passed
Feature tested: CBUFF HW Session: ADC Channels=2 Data Format [Non-Interleaved] Chirp Parameters + ADC: Passed
Feature tested: CBUFF HW Session: ADC Channels=2 Data Format [Non-Interleaved] ADC + Chirp Parameters: Passed
Feature tested: CBUFF HW Session: ADC Channels=2 Data Format [Non-Interleaved] Chirp Parameters + ADC + Chirp Quality: Passed
Feature tested: CBUFF HW Session: ADC Channels=2 Data Format [Non-Interleaved] ADC + User: Passed
Feature tested: CBUFF HW Session: ADC Channels=2 Data Format [Non-Interleaved] Chirp Parameters + ADC + Chirp Quality + User: Passed
Feature tested: CBUFF HW Session: ADC Channels=3 Data Format [Non-Interleaved] ADC: Passed
Feature tested: CBUFF HW Session: ADC Channels=3 Data Format [Non-Interleaved] Chirp Parameters + ADC: Passed
Feature tested: CBUFF HW Session: ADC Channels=3 Data Format [Non-Interleaved] ADC + Chirp Parameters: Passed
Feature tested: CBUFF HW Session: ADC Channels=3 Data Format [Non-Interleaved] Chirp Parameters + ADC + Chirp Quality: Passed
Feature tested: CBUFF HW Session: ADC Channels=3 Data Format [Non-Interleaved] ADC + User: Passed
Feature tested: CBUFF HW Session: ADC Channels=3 Data Format [Non-Interleaved] Chirp Parameters + ADC + Chirp Quality + User: Passed
Feature tested: CBUFF HW Session: ADC Channels=4 Data Format [Non-Interleaved] ADC: Passed
Feature tested: CBUFF HW Session: ADC Channels=4 Data Format [Non-Interleaved] Chirp Parameters + ADC: Passed
Feature tested: CBUFF HW Session: ADC Channels=4 Data Format [Non-Interleaved] ADC + Chirp Parameters: Passed
Feature tested: CBUFF HW Session: ADC Channels=4 Data Format [Non-Interleaved] Chirp Parameters + ADC + Chirp Quality: Passed
Feature tested: CBUFF HW Session: ADC Channels=4 Data Format [Non-Interleaved] ADC + User: Passed
Feature tested: CBUFF HW Session: ADC Channels=4 Data Format [Non-Interleaved] Chirp Parameters + ADC + Chirp Quality + User: Passed
Feature tested: CBUFF: Multiple Session: Passed
Feature tested: CBUFF: EDMA Memory Allocation Test for Data Format ADC: Passed
Feature tested: CBUFF: EDMA Memory Allocation Test for Data Format Chirp Parameters + ADC: Passed
Feature tested: CBUFF: EDMA Memory Allocation Test for Data Format ADC + Chirp Parameters: Passed
Feature tested: CBUFF: EDMA Memory Allocation Test for Data Format Chirp Parameters + ADC + Chirp Quality: Passed
Feature tested: CBUFF: EDMA Memory Allocation Test for Data Format ADC + User: Passed
Feature tested: CBUFF: EDMA Memory Allocation Test for Data Format Chirp Parameters + ADC + Chirp Quality + User: Passed
Feature tested: CBUFF ADC Channel: 1 Multiple Chirp: 1 Data Format: ADC: Passed
Feature tested: CBUFF ADC Channel: 1 Multiple Chirp: 2 Data Format: ADC: Passed
Feature tested: CBUFF ADC Channel: 1 Multiple Chirp: 3 Data Format: ADC: Passed
Feature tested: CBUFF ADC Channel: 1 Multiple Chirp: 4 Data Format: ADC: Passed
Feature tested: CBUFF ADC Channel: 1 Multiple Chirp: 5 Data Format: ADC: Passed
Feature tested: CBUFF ADC Channel: 1 Multiple Chirp: 6 Data Format: ADC: Passed
Feature tested: CBUFF ADC Channel: 1 Multiple Chirp: 7 Data Format: ADC: Passed
Feature tested: CBUFF ADC Channel: 1 Multiple Chirp: 8 Data Format: ADC: Passed
Feature tested: CBUFF ADC Channel: 1 Multiple Chirp: 1 Data Format: Chirp Parameters + ADC: Passed
Feature tested: CBUFF ADC Channel: 1 Multiple Chirp: 2 Data Format: Chirp Parameters + ADC: Passed
Feature tested: CBUFF ADC Channel: 1 Multiple Chirp: 3 Data Format: Chirp Parameters + ADC: Passed
Feature tested: CBUFF ADC Channel: 1 Multiple Chirp: 4 Data Format: Chirp Parameters + ADC: Passed
Feature tested: CBUFF ADC Channel: 1 Multiple Chirp: 5 Data Format: Chirp Parameters + ADC: Passed
Feature tested: CBUFF ADC Channel: 1 Multiple Chirp: 6 Data Format: Chirp Parameters + ADC: Passed
Feature tested: CBUFF ADC Channel: 1 Multiple Chirp: 7 Data Format: Chirp Parameters + ADC: Passed
Feature tested: CBUFF ADC Channel: 1 Multiple Chirp: 8 Data Format: Chirp Parameters + ADC: Passed
Feature tested: CBUFF ADC Channel: 1 Multiple Chirp: 1 Data Format: ADC + Chirp Parameters: Passed
Feature tested: CBUFF ADC Channel: 1 Multiple Chirp: 2 Data Format: ADC + Chirp Parameters: Passed
Feature tested: CBUFF ADC Channel: 1 Multiple Chirp: 3 Data Format: ADC + Chirp Parameters: Passed
Feature tested: CBUFF ADC Channel: 1 Multiple Chirp: 4 Data Format: ADC + Chirp Parameters: Passed
Feature tested: CBUFF ADC Channel: 1 Multiple Chirp: 5 Data Format: ADC + Chirp Parameters: Passed
Feature tested: CBUFF ADC Channel: 1 Multiple Chirp: 6 Data Format: ADC + Chirp Parameters: Passed
Feature tested: CBUFF ADC Channel: 1 Multiple Chirp: 7 Data Format: ADC + Chirp Parameters: Passed
Feature tested: CBUFF ADC Channel: 1 Multiple Chirp: 8 Data Format: ADC + Chirp Parameters: Passed
Feature tested: CBUFF ADC Channel: 1 Multiple Chirp: 1 Data Format: Chirp Parameters + ADC + Chirp Quality: Passed
Feature tested: CBUFF ADC Channel: 1 Multiple Chirp: 2 Data Format: Chirp Parameters + ADC + Chirp Quality: Passed
Feature tested: CBUFF ADC Channel: 1 Multiple Chirp: 3 Data Format: Chirp Parameters + ADC + Chirp Quality: Passed
Feature tested: CBUFF ADC Channel: 1 Multiple Chirp: 4 Data Format: Chirp Parameters + ADC + Chirp Quality: Passed
Feature tested: CBUFF ADC Channel: 1 Multiple Chirp: 5 Data Format: Chirp Parameters + ADC + Chirp Quality: Passed
Feature tested: CBUFF ADC Channel: 1 Multiple Chirp: 6 Data Format: Chirp Parameters + ADC + Chirp Quality: Passed
Feature tested: CBUFF ADC Channel: 1 Multiple Chirp: 7 Data Format: Chirp Parameters + ADC + Chirp Quality: Passed
Feature tested: CBUFF ADC Channel: 1 Multiple Chirp: 8 Data Format: Chirp Parameters + ADC + Chirp Quality: Passed
Feature tested: CBUFF ADC Channel: 1 Multiple Chirp: 1 Data Format: ADC + User: Passed
Feature tested: CBUFF ADC Channel: 1 Multiple Chirp: 2 Data Format: ADC + User: Passed
Feature tested: CBUFF ADC Channel: 1 Multiple Chirp: 3 Data Format: ADC + User: Passed
Feature tested: CBUFF ADC Channel: 1 Multiple Chirp: 4 Data Format: ADC + User: Passed
Feature tested: CBUFF ADC Channel: 1 Multiple Chirp: 5 Data Format: ADC + User: Passed
Feature tested: CBUFF ADC Channel: 1 Multiple Chirp: 6 Data Format: ADC + User: Passed
Feature tested: CBUFF ADC Channel: 1 Multiple Chirp: 7 Data Format: ADC + User: Passed
Feature tested: CBUFF ADC Channel: 1 Multiple Chirp: 8 Data Format: ADC + User: Passed
Feature tested: CBUFF ADC Channel: 1 Multiple Chirp: 1 Data Format: Chirp Parameters + ADC + Chirp Quality + User: Passed
Feature tested: CBUFF ADC Channel: 1 Multiple Chirp: 2 Data Format: Chirp Parameters + ADC + Chirp Quality + User: Passed
Feature tested: CBUFF ADC Channel: 1 Multiple Chirp: 3 Data Format: Chirp Parameters + ADC + Chirp Quality + User: Passed
Feature tested: CBUFF ADC Channel: 1 Multiple Chirp: 4 Data Format: Chirp Parameters + ADC + Chirp Quality + User: Passed
Feature tested: CBUFF ADC Channel: 1 Multiple Chirp: 5 Data Format: Chirp Parameters + ADC + Chirp Quality + User: Passed
Feature tested: CBUFF ADC Channel: 1 Multiple Chirp: 6 Data Format: Chirp Parameters + ADC + Chirp Quality + User: Passed
Feature tested: CBUFF ADC Channel: 1 Multiple Chirp: 7 Data Format: Chirp Parameters + ADC + Chirp Quality + User: Passed
Feature tested: CBUFF ADC Channel: 1 Multiple Chirp: 8 Data Format: Chirp Parameters + ADC + Chirp Quality + User: Passed
Feature tested: CBUFF ADC Channel: 2 Multiple Chirp: 1 Data Format: ADC: Passed
Feature tested: CBUFF ADC Channel: 2 Multiple Chirp: 2 Data Format: ADC: Passed
Feature tested: CBUFF ADC Channel: 2 Multiple Chirp: 3 Data Format: ADC: Passed
Feature tested: CBUFF ADC Channel: 2 Multiple Chirp: 4 Data Format: ADC: Passed
Feature tested: CBUFF ADC Channel: 2 Multiple Chirp: 5 Data Format: ADC: Passed
Feature tested: CBUFF ADC Channel: 2 Multiple Chirp: 6 Data Format: ADC: Passed
Feature tested: CBUFF ADC Channel: 2 Multiple Chirp: 7 Data Format: ADC: Passed
Feature tested: CBUFF ADC Channel: 2 Multiple Chirp: 8 Data Format: ADC: Passed
Feature tested: CBUFF ADC Channel: 2 Multiple Chirp: 1 Data Format: Chirp Parameters + ADC: Passed
Feature tested: CBUFF ADC Channel: 2 Multiple Chirp: 2 Data Format: Chirp Parameters + ADC: Passed
Feature tested: CBUFF ADC Channel: 2 Multiple Chirp: 3 Data Format: Chirp Parameters + ADC: Passed
Feature tested: CBUFF 


shutting down py4j gw server.


**************************************************
Terminating the debug session and Shutting down gateway.
**************************************************

**************************************************
Test case execution completed
**************************************************

**************************************************
Testcase Result : PASS
**************************************************
