mss in binary >>> xwr16xx_edma_mss.xer4f
eth008 Board details:
IP address: 10.218.113.59
Port: 17494

connecting...
Relay states 8->1 : 00010001
1 off
2 off
Relay states 8->1 : 00010000
1 on
Relay states 8->1 : 00010001
3 on
Relay states 8->1 : 00010101
3 off
Relay states 8->1 : 00010001
exit
Disconnected
Pre-Script returned: Success
**************************************************
Testcase mods & parameters invoked:
**************************************************
Two core test case: None (this is not a two core testcase)

**************************************************
Copying test case files from the Build server
**************************************************
amk: remote testcase data path: http://gtjenkins.itg.ti.com/nightly_builds/mmwave_sdk-rel2/67-2018-04-18_18-31-01/artifacts/test/mmwave_sdk/packages/ti/drivers/edma/test/testdata


Testdata directory was not found on build server for this testcase

Call to copy_testcase_binary:
TCP: http://gtjenkins.itg.ti.com/nightly_builds/mmwave_sdk-rel2/67-2018-04-18_18-31-01/artifacts/test/mmwave_sdk/packages/ti/drivers/edma/test/xwr16xx; /home/a0216598/ti/mcpi_tf/mcpi_testframework_1_12_00_01/test/temp/mmWave_SDK___hs_awr16xx_sdk02.00.00_Test_Plan___jenkins-67_2018_04_18_19_04_56

Copying testcase binary file from http://gtjenkins.itg.ti.com/nightly_builds/mmwave_sdk-rel2/67-2018-04-18_18-31-01/artifacts/test/mmwave_sdk/packages/ti/drivers/edma/test/xwr16xx/xwr16xx_edma_mss.xer4f to /home/a0216598/ti/mcpi_tf/mcpi_testframework_1_12_00_01/test/temp/mmWave_SDK___hs_awr16xx_sdk02.00.00_Test_Plan___jenkins-67_2018_04_18_19_04_56 using command: 
wget -e robots=off --no-proxy -N -T 30 -t 2 -P /home/a0216598/ti/mcpi_tf/mcpi_testframework_1_12_00_01/test/temp/mmWave_SDK___hs_awr16xx_sdk02.00.00_Test_Plan___jenkins-67_2018_04_18_19_04_56 http://gtjenkins.itg.ti.com/nightly_builds/mmwave_sdk-rel2/67-2018-04-18_18-31-01/artifacts/test/mmwave_sdk/packages/ti/drivers/edma/test/xwr16xx/xwr16xx_edma_mss.xer4f
**************************************************
Executing Testcase:/home/a0216598/ti/mcpi_tf/mcpi_testframework_1_12_00_01/test/temp/mmWave_SDK___hs_awr16xx_sdk02.00.00_Test_Plan___jenkins-67_2018_04_18_19_04_56/xwr16xx_edma_mss.xer4f
**************************************************
Checking if Py4J Gateway server has started...
Py4J Gateway Server is Started
amk: a path in cpuList is Texas Instruments XDS110 USB Debug Probe_1/DEBUGSSM_0
amk: a path in cpuList is Texas Instruments XDS110 USB Debug Probe_1/IcePick_M_0
amk: a path in cpuList is Texas Instruments XDS110 USB Debug Probe_1/C674X_0
amk: a path in cpuList is Texas Instruments XDS110 USB Debug Probe_1/CS_DAP_0
amk: a path in cpuList is Texas Instruments XDS110 USB Debug Probe_1/CortexR4_0
DSS test case opening debug session.

cr4ctl = 0xadad00

Loading binary to the DUT (no binary args updated):/home/a0216598/ti/mcpi_tf/mcpi_testframework_1_12_00_01/test/temp/mmWave_SDK___hs_awr16xx_sdk02.00.00_Test_Plan___jenkins-67_2018_04_18_19_04_56/xwr16xx_edma_mss.xer4f
binary path = /home/a0216598/ti/mcpi_tf/mcpi_testframework_1_12_00_01/test/temp/mmWave_SDK___hs_awr16xx_sdk02.00.00_Test_Plan___jenkins-67_2018_04_18_19_04_56/xwr16xx_edma_mss.xer4f


**************************************************
CIO Log captured for the testcase
**************************************************
Updating the addresses in testConfig for access from EDMA

=====================================================
============ Testing EDMA instance #0 ==============
=====================================================

==================================================
Testing simultaneous unlinked unchained transfers
==================================================

Test#1..A type single transfer (bCount = 1 AND cCount = 1), mix QDMA and DMA
Test channel 0 transfer completed successfully
..transfer time in CPU cycles = 1863
Test channel 1 transfer completed successfully
..transfer time in CPU cycles = 3894
Test channel 2 transfer completed successfully
..transfer time in CPU cycles = 5792
Test channel 3 transfer completed successfully
..transfer time in CPU cycles = 7030
Feature: A type single transfer (bCount = 1 AND cCount = 1), mix QDMA and DMA: Passed

Test#2..A type multi transfers (bCount != 1 AND cCount != 1)
Test channel 0 transfer completed successfully
..transfer time in CPU cycles = 16013
Test channel 1 transfer completed successfully
..transfer time in CPU cycles = 20715
Test channel 2 transfer completed successfully
..transfer time in CPU cycles = 19289
Test channel 3 transfer completed successfully
..transfer time in CPU cycles = 17513
Feature: A type multi transfers (bCount != 1 AND cCount != 1): Passed

Test#3..AB type multi transfers (cCount != 1)
Test channel 0 transfer completed successfully
..transfer time in CPU cycles = 2141
Test channel 1 transfer completed successfully
..transfer time in CPU cycles = 3218
Test channel 2 transfer completed successfully
..transfer time in CPU cycles = 5074
Feature: AB type multi transfers (cCount != 1): Passed

Test#4..Mix of A and AB type multi transfers
Test channel 0 transfer completed successfully
..transfer time in CPU cycles = 1836
Test channel 1 transfer completed successfully
..transfer time in CPU cycles = 15822
Test channel 2 transfer completed successfully
..transfer time in CPU cycles = 17083
Test channel 3 transfer completed successfully
..transfer time in CPU cycles = 4800
Feature: Mix of A and AB type multi transfers: Passed

==================================================
Testing chained transfers
==================================================

Test#5..Chained Transfers of A type single transfer (bCount = 1 AND cCount = 1)
Transfers completed successfully
..transfer time in CPU cycles = 6093
Feature: Chained Transfers of A type single transfer (bCount = 1 AND cCount = 1): Passed

==================================================
Testing linked transfers
==================================================

Test#6..DMA Linked Transfers of A type single transfer (bCount = 1 AND cCount = 1)
Transfers completed successfully
..transfer time in CPU cycles = 7325
Feature: DMA Linked Transfers of A type single transfer (bCount = 1 AND cCount = 1): Passed

Test#7..QDMA Linked Transfers of A type single transfer (bCount = 1 AND cCount = 1)
Transfers completed successfully
..transfer time in CPU cycles = 4578
Feature: QDMA Linked Transfers of A type single transfer (bCount = 1 AND cCount = 1): Passed

==================================================
Testing Error Detection
==================================================

Test#8..Missed DMA events
All expected missed events detected and no false detection
Feature: Missed DMA events: Passed
All Tests of Instance 0 PASSED
edma test finished
All Tests PASSED
Value read from Global variable (MCPI_Result): 0
Test Failure Signature: 0
Test Log Messages: 
Feature tested: A type single transfer (bCount = 1 AND cCount = 1), mix QDMA and DMA: Passed
Feature tested: A type multi transfers (bCount != 1 AND cCount != 1): Passed
Feature tested: AB type multi transfers (cCount != 1): Passed
Feature tested: Mix of A and AB type multi transfers: Passed
Feature tested: Chained Transfers of A type single transfer (bCount = 1 AND cCount = 1): Passed
Feature tested: DMA Linked Transfers of A type single transfer (bCount = 1 AND cCount = 1): Passed
Feature tested: QDMA Linked Transfers of A type single transfer (bCount = 1 AND cCount = 1): Passed
Feature tested: Missed DMA events: Passed


shutting down py4j gw server.


**************************************************
Terminating the debug session and Shutting down gateway.
**************************************************

**************************************************
Test case execution completed
**************************************************

**************************************************
Testcase Result : PASS
**************************************************
