eth008 Board details:
IP address: 10.218.113.61
Port: 17494

connecting...
Relay states 8->1 : 00010001
1 off
2 off
Relay states 8->1 : 00010000
1 on
Relay states 8->1 : 00010001
3 on
Relay states 8->1 : 00010101
3 off
Relay states 8->1 : 00010001
exit
Disconnected
Pre-Script returned: Success

**************************************************
Testcase mods & parameters invoked:
**************************************************
TwoCoreTest:: slave_case: True, binary_file is xwr16xx_mmwave_full_mss.xer4f, local path is /home/a0216598/ti/mcpi_tf/mcpi_testframework_1_12_00_01/test/temp/mmWave_SDK___awr16xx_sdk02.00.00_Test_Plan___jenkins-67_2018_04_18_19_04_55, remote path is http://gtjenkins.itg.ti.com/nightly_builds/mmwave_sdk-rel2/67-2018-04-18_18-31-01/artifacts/test/mmwave_sdk/packages/ti/control/mmwave/test/xwr16xx/full, binary_params is gTestSelection(32)=7

**************************************************
Copying test case files from the Build server
**************************************************
amk: ARGS['TestcasePath']: http://gtjenkins.itg.ti.com/nightly_builds/mmwave_sdk-rel2/67-2018-04-18_18-31-01/artifacts/test/mmwave_sdk/packages/ti/control/mmwave/test/xwr16xx/full

amk: remote_datapath: http://gtjenkins.itg.ti.com/nightly_builds/mmwave_sdk-rel2/67-2018-04-18_18-31-01/artifacts/test/mmwave_sdk/packages/ti/control/mmwave/test/xwr16xx/testdata

A testdata directory was not found on build server for this testcase


amk: error logging: testcasepath = http://gtjenkins.itg.ti.com/nightly_builds/mmwave_sdk-rel2/67-2018-04-18_18-31-01/artifacts/test/mmwave_sdk/packages/ti/control/mmwave/test/xwr16xx/full
amk: error logging: binaryfile = xwr16xx_mmwave_full_dss.xe674
Copying testcase binary file from http://gtjenkins.itg.ti.com/nightly_builds/mmwave_sdk-rel2/67-2018-04-18_18-31-01/artifacts/test/mmwave_sdk/packages/ti/control/mmwave/test/xwr16xx/full/xwr16xx_mmwave_full_dss.xe674 to /home/a0216598/ti/mcpi_tf/mcpi_testframework_1_12_00_01/test/temp/mmWave_SDK___awr16xx_sdk02.00.00_Test_Plan___jenkins-67_2018_04_18_19_04_55 using command: 
wget -e robots=off --no-proxy -N -T 30 -t 2 -P /home/a0216598/ti/mcpi_tf/mcpi_testframework_1_12_00_01/test/temp/mmWave_SDK___awr16xx_sdk02.00.00_Test_Plan___jenkins-67_2018_04_18_19_04_55 http://gtjenkins.itg.ti.com/nightly_builds/mmwave_sdk-rel2/67-2018-04-18_18-31-01/artifacts/test/mmwave_sdk/packages/ti/control/mmwave/test/xwr16xx/full/xwr16xx_mmwave_full_dss.xe674
**************************************************
Executing Testcase:/home/a0216598/ti/mcpi_tf/mcpi_testframework_1_12_00_01/test/temp/mmWave_SDK___awr16xx_sdk02.00.00_Test_Plan___jenkins-67_2018_04_18_19_04_55/xwr16xx_mmwave_full_dss.xe674
**************************************************
amk: TwoCoreTest:: slave_case: True, binary_file is xwr16xx_mmwave_full_mss.xer4f, local path is /home/a0216598/ti/mcpi_tf/mcpi_testframework_1_12_00_01/test/temp/mmWave_SDK___awr16xx_sdk02.00.00_Test_Plan___jenkins-67_2018_04_18_19_04_55, remote path is http://gtjenkins.itg.ti.com/nightly_builds/mmwave_sdk-rel2/67-2018-04-18_18-31-01/artifacts/test/mmwave_sdk/packages/ti/control/mmwave/test/xwr16xx/full, binary_params is gTestSelection(32)=7

Checking if Py4J Gateway server has started...
Py4J Gateway Server is Started
Two-core test check: dss_execute_obj.two_core_test: True


amk: a path in detected cpuList is: Texas Instruments XDS110 USB Debug Probe_1/DEBUGSSM_0
amk: a path in detected cpuList is: Texas Instruments XDS110 USB Debug Probe_1/IcePick_M_0
amk: a path in detected cpuList is: Texas Instruments XDS110 USB Debug Probe_1/C674X_0
amk: a path in detected cpuList is: Texas Instruments XDS110 USB Debug Probe_1/CS_DAP_0
amk: a path in detected cpuList is: Texas Instruments XDS110 USB Debug Probe_1/CortexR4_0
Slave core now opening debug session.

amk: Loading slave core binary:/home/a0216598/ti/mcpi_tf/mcpi_testframework_1_12_00_01/test/temp/mmWave_SDK___awr16xx_sdk02.00.00_Test_Plan___jenkins-67_2018_04_18_19_04_55/xwr16xx_mmwave_full_mss.xer4f
amk: Updating slave binary parameters:/home/a0216598/ti/mcpi_tf/mcpi_testframework_1_12_00_01/test/temp/mmWave_SDK___awr16xx_sdk02.00.00_Test_Plan___jenkins-67_2018_04_18_19_04_55/xwr16xx_mmwave_full_mss.xer4f

**************************************************
 Parameters found in the Binary arguments : 
{'gTestSelection(32)': '7'}
**************************************************
Reading address of symbol: gTestSelection
Address of symbol obtained: 0x800da3c
Write value 7 to address 0x800da3c 
Value updated successfully
amk: a path in detected cpuList is Texas Instruments XDS110 USB Debug Probe_1/DEBUGSSM_0
amk: a path in detected cpuList is Texas Instruments XDS110 USB Debug Probe_1/IcePick_M_0
amk: a path in detected cpuList is Texas Instruments XDS110 USB Debug Probe_1/C674X_0
Master core now opening debug session.

Loading binary to the DUT:/home/a0216598/ti/mcpi_tf/mcpi_testframework_1_12_00_01/test/temp/mmWave_SDK___awr16xx_sdk02.00.00_Test_Plan___jenkins-67_2018_04_18_19_04_55/xwr16xx_mmwave_full_dss.xe674

**************************************************
 Parameters found in the Binary arguments : 
{'gTestSelection(32)': '7'}
**************************************************
Reading address of symbol: gTestSelection
Address of symbol obtained: 0x810fec
Write value 7 to address 0x810fec 
Value updated successfully
binary path = /home/a0216598/ti/mcpi_tf/mcpi_testframework_1_12_00_01/test/temp/mmWave_SDK___awr16xx_sdk02.00.00_Test_Plan___jenkins-67_2018_04_18_19_04_55/xwr16xx_mmwave_full_dss.xe674


**************************************************
CIO Log captured for the testcase
**************************************************
******************************************
Debug: Launching the mmwaveLink
******************************************
Debug: Launching BIOS
***************************************************
Waiting for the test selection to be entered by MSS
In CCS: Set the Global Variable 'gTestSelection'
***************************************************
Feature: MMWave DSS [Cooperative Mode] Initialization: Passed
Feature: MMWave DSS Synchronization: Passed
Feature: MMWave Add Profile: Passed
Feature: MMWave Add Profile: Passed
Feature: MMWave Add Chirp: Passed
Feature: MMWave Add Chirp: Passed
Feature: MMWave Add BPM Chirp: Passed
Debug: BSS Event MsgId: 128 [Sub Block Id: 4100 Sub Block Length: 20]
Feature: MMWave DSS Open: Passed
Feature: MMWave DSS Open Callback: Passed
Feature: MMWave DSS Configuration: Passed
Feature: MMWave DSS Configuration Callback: Passed
Debug: BSS Event MsgId: 128 [Sub Block Id: 4114 Sub Block Length: 20]
Feature: MMWave DSS Start: Passed
Debug: BSS Event MsgId: 128 [Sub Block Id: 4107 Sub Block Length: 0]
Feature: MMWave DSS Start Callback: Passed
Feature: MMWave DSS Stop: Passed
Feature: MMWave DSS Stop Callback: Passed
Feature: MMWave DSS Close: Passed
Feature: MMWave DSS Close Callback: Passed
Feature: MMWave DSS Deinitialized: Passed
Debug: mmWave Unit Tests completed successfully
Value read from Global variable (MCPI_Result): 0
Test Failure Signature: 0
Test Log Messages: 
Feature tested: MMWave DSS [Cooperative Mode] Initialization: Passed
Feature tested: MMWave DSS Synchronization: Passed
Feature tested: MMWave Add Profile: Passed
Feature tested: MMWave Add Profile: Passed
Feature tested: MMWave Add Chirp: Passed
Feature tested: MMWave Add Chirp: Passed
Feature tested: MMWave Add BPM Chirp: Passed
Feature tested: MMWave DSS Open: Passed
Feature tested: MMWave DSS Open Callback: Passed
Feature tested: MMWave DSS Configuration: Passed
Feature tested: MMWave DSS Configuration Callback: Passed
Feature tested: MMWave DSS Start: Passed
Feature tested: MMWave DSS Start Callback: Passed
Feature tested: MMWave DSS Stop: Passed
Feature tested: MMWave DSS Stop Callback: Passed
Feature tested: MMWave DSS Close: Passed
Feature tested: MMWave DSS Close Callback: Passed
Feature tested: MMWave DSS Deinitialized: Passed


shutting down py4j gw server.


**************************************************
Terminating the debug session and Shutting down gateway.
**************************************************

**************************************************
Test case execution completed
**************************************************

**************************************************
Testcase Result : PASS
**************************************************
Callback: Passed
Feature: MMWave DSS Deinitialized: Passed
Debug: mmWave Unit Tests completed successfully
