[
    {
    "name": "Release Notes",
    "resourceType": "file",
    "location": "../../docs/mmwave_sdk_release_notes.pdf",
    "categories": [["Documents"]],
    "mainCategories": [["Documents"]],
    "devices": ["IWR1642", "AWR1642"]
    },
    {
    "name": "User Guide",
    "resourceType": "file",
    "location": "../../docs/mmwave_sdk_user_guide.pdf",
    "categories": [["Documents"]],
    "mainCategories": [["Documents"]],
    "devices": ["IWR1642", "AWR1642"]
    },
    {
    "name": "Software Manifest",
    "resourceType": "file",
    "location": "../../docs/mmwave_sdk_software_manifest.html",
    "categories": [["Documents"]],
    "mainCategories": [["Documents"]],
    "devices": ["IWR1642", "AWR1642"]
    }
]

