eth008 Board details:
IP address: 10.218.113.59
Port: 17494

connecting...
Relay states 8->1 : 00010001
1 off
2 off
Relay states 8->1 : 00010000
1 on
Relay states 8->1 : 00010001
3 on
Relay states 8->1 : 00010101
3 off
Relay states 8->1 : 00010001
exit
Disconnected
Pre-Script returned: Success
**************************************************
Testcase mods & parameters invoked:
**************************************************
Two core test case: None (this is not a two core testcase)

**************************************************
Copying test case files from the Build server
**************************************************
amk: remote testcase data path: http://gtjenkins.itg.ti.com/nightly_builds/mmwave_sdk-rel2/67-2018-04-18_18-31-01/artifacts/test/mmwave_sdk/packages/ti/control/mmwavelink/test/testdata


Testdata directory was not found on build server for this testcase

Call to copy_testcase_binary:
TCP: http://gtjenkins.itg.ti.com/nightly_builds/mmwave_sdk-rel2/67-2018-04-18_18-31-01/artifacts/test/mmwave_sdk/packages/ti/control/mmwavelink/test/xwr16xx; /home/a0216598/ti/mcpi_tf/mcpi_testframework_1_12_00_01/test/temp/mmWave_SDK___hs_awr16xx_sdk02.00.00_Test_Plan___jenkins-67_2018_04_18_19_04_56

Copying testcase binary file from http://gtjenkins.itg.ti.com/nightly_builds/mmwave_sdk-rel2/67-2018-04-18_18-31-01/artifacts/test/mmwave_sdk/packages/ti/control/mmwavelink/test/xwr16xx/xwr16xx_link_dss.xe674 to /home/a0216598/ti/mcpi_tf/mcpi_testframework_1_12_00_01/test/temp/mmWave_SDK___hs_awr16xx_sdk02.00.00_Test_Plan___jenkins-67_2018_04_18_19_04_56 using command: 
wget -e robots=off --no-proxy -N -T 30 -t 2 -P /home/a0216598/ti/mcpi_tf/mcpi_testframework_1_12_00_01/test/temp/mmWave_SDK___hs_awr16xx_sdk02.00.00_Test_Plan___jenkins-67_2018_04_18_19_04_56 http://gtjenkins.itg.ti.com/nightly_builds/mmwave_sdk-rel2/67-2018-04-18_18-31-01/artifacts/test/mmwave_sdk/packages/ti/control/mmwavelink/test/xwr16xx/xwr16xx_link_dss.xe674
**************************************************
Executing Testcase:/home/a0216598/ti/mcpi_tf/mcpi_testframework_1_12_00_01/test/temp/mmWave_SDK___hs_awr16xx_sdk02.00.00_Test_Plan___jenkins-67_2018_04_18_19_04_56/xwr16xx_link_dss.xe674
**************************************************
Checking if Py4J Gateway server has started...
Py4J Gateway Server is Started
amk: a path in cpuList is Texas Instruments XDS110 USB Debug Probe_1/DEBUGSSM_0
amk: a path in cpuList is Texas Instruments XDS110 USB Debug Probe_1/IcePick_M_0
amk: a path in cpuList is Texas Instruments XDS110 USB Debug Probe_1/C674X_0
DSS test case opening debug session.

cr4ctl = 0x0

Loading binary to the DUT:/home/a0216598/ti/mcpi_tf/mcpi_testframework_1_12_00_01/test/temp/mmWave_SDK___hs_awr16xx_sdk02.00.00_Test_Plan___jenkins-67_2018_04_18_19_04_56/xwr16xx_link_dss.xe674

**************************************************
 Parameters found in the Binary arguments : 
{'gLinkAdvanceFrameTest(8)': '0', 'gLinkCalibTest(8)': '0', 'gLinkMonitoringTest(8)': '0', 'cqDataVerifyTest(8)': '1', 'gLinkProgFiltTest(8)': '0', 'gLinkSubFrameTrigTest(8)': '0', 'gDynamicChirpTest(8)': '0', 'gLinkContModeTest(8)': '0', 'gLinkBpmEnableTest(8)': '0'}
**************************************************
Reading address of symbol: gLinkAdvanceFrameTest
Address of symbol obtained: 0x814e22
Write value 0 to address 0x814e22 
Value updated successfully
Reading address of symbol: gLinkCalibTest
Address of symbol obtained: 0x814e21
Write value 0 to address 0x814e21 
Value updated successfully
Reading address of symbol: gLinkMonitoringTest
Address of symbol obtained: 0x814e20
Write value 0 to address 0x814e20 
Value updated successfully
Reading address of symbol: cqDataVerifyTest
Address of symbol obtained: 0x814e23
Write value 1 to address 0x814e23 
Value updated successfully
Reading address of symbol: gLinkProgFiltTest
Address of symbol obtained: 0x814e2f
Write value 0 to address 0x814e2f 
Value updated successfully
Reading address of symbol: gLinkSubFrameTrigTest
Address of symbol obtained: 0x814e32
Write value 0 to address 0x814e32 
Value updated successfully
Reading address of symbol: gDynamicChirpTest
Address of symbol obtained: 0x814e2d
Write value 0 to address 0x814e2d 
Value updated successfully
Reading address of symbol: gLinkContModeTest
Address of symbol obtained: 0x814e2c
Write value 0 to address 0x814e2c 
Value updated successfully
Reading address of symbol: gLinkBpmEnableTest
Address of symbol obtained: 0x814e2e
Write value 0 to address 0x814e2e 
Value updated successfully
binary path = /home/a0216598/ti/mcpi_tf/mcpi_testframework_1_12_00_01/test/temp/mmWave_SDK___hs_awr16xx_sdk02.00.00_Test_Plan___jenkins-67_2018_04_18_19_04_56/xwr16xx_link_dss.xe674


**************************************************
CIO Log captured for the testcase
**************************************************
Debug: ADCBUF Instance @00812988 has been reopened successfully
******************************************
Debug: Launching the mmwaveLink
******************************************
Debug: Launching BIOS
Debug: Launched the mmwaveLink Initialization Task
Debug: EDMA instance 0 has been initialized
Debug: CRC Channel @008012e0 has been opened successfully
Debug: Launched the mmwaveLink Management Task
Debug: BSS Mailbox Handle @00801bc0
Debug: Power on request successfully passed to the BSS
Feature: mmWave Link Initialization: Passed
Debug: Finished get radarSS bootup status to BSS
Feature: Get radarSS bootup status: Passed
RF H/W Version    : 02.00
RF F/W Version    : 02.00.00.01.17.10.05
RF F/W Patch Version : 01.01.00.02.18.04.10
mmWaveLink Version: 01.01.00.05
Feature: Get mmWave Link Version: Passed
Debug: Finished set channel configurations to BSS
Feature: Set mmWave Link Channel Config: Passed
Debug: Finished setAdcOutConfig to BSS
Feature: Set mmWave Link ADC Out Config: Passed
Debug: Finished setLowPowerMode
Feature: Set mmWave Link Low Power Mode config: Passed
Debug: Finished rlRfSetDeviceCfg
Feature: Set Async event config: Passed
Debug: Set HSI clock successfully
Feature: Set HSI clock: Passed
Debug: Init time calibration status [0x800007fe] 
Debug: RF start successfully
Feature: mmWave Link RF Calibration: Passed
Debug: Finished rlSetGpAdcConfig
Feature: mmWave Link Get GPAdc: Passed
Feature: mmWave Link Calib/Monitoring config: Passed
Debug: Finished rlSetProfileConfig
Feature: Set mmWave Link Profile config: Passed
Debug: Finished rlSetChirpConfig
Feature: Set mmWave Link Chirp config: Passed
Debug: Finished rlSetFrameConfig
Feature: Set mmWave Link Frame config: Passed
Debug: ADCbuf configuration is done!!
Debug: Finished rlRfAnaMonConfig configurations to BSS
Feature: Monitoring Enable for CQ test: Passed
Debug: Finished information related to  RX saturation detector monitoring configurations to BSS
Feature: Rx Saturation Monitoring configuration: Passed
Debug: Finished information related to signal and image band energy configurations to BSS
Feature: Rx Signal Image Monitoring configuration: Passed
Debug: Starting Sensor.. 
Debug:  Frame Stop Async Event 
Feature: All Frames Received: Passed
Feature: CQ test result : Passed
Feature: CP test result : Passed
-----------Debug: Infinite Frame mode test-----------
Debug: Finished rlSetFrameConfig
Feature: Set mmWave Link Frame config: Passed
Feature: Start sensor: Passed
Debug:  Frame Stop Async Event 
Debug: Sensor stop successfully
Feature: Stop sensor: Passed
******************************************
Debug: MmwaveLink Test completed
******************************************
Value read from Global variable (MCPI_Result): 0
Test Failure Signature: 0
Test Log Messages: 
Feature tested: mmWave Link Initialization: Passed
Feature tested: Get radarSS bootup status: Passed
Feature tested: Get mmWave Link Version: Passed
Feature tested: Set mmWave Link Channel Config: Passed
Feature tested: Set mmWave Link ADC Out Config: Passed
Feature tested: Set mmWave Link Low Power Mode config: Passed
Feature tested: Set Async event config: Passed
Feature tested: Set HSI clock: Passed
Feature tested: mmWave Link RF Calibration: Passed
Feature tested: mmWave Link Get GPAdc: Passed
Feature tested: mmWave Link Calib/Monitoring config: Passed
Feature tested: Set mmWave Link Profile config: Passed
Feature tested: Set mmWave Link Chirp config: Passed
Feature tested: Set mmWave Link Frame config: Passed
Feature tested: Monitoring Enable for CQ test: Passed
Feature tested: Rx Saturation Monitoring configuration: Passed
Feature tested: Rx Signal Image Monitoring configuration: Passed
Feature tested: All Frames Received: Passed
Feature tested: CQ test result : Passed
Feature tested: CP test result : Passed
Feature tested: Set mmWave Link Frame config: Passed
Feature tested: Start sensor: Passed
Feature tested: Stop sensor: Passed


shutting down py4j gw server.


**************************************************
Terminating the debug session and Shutting down gateway.
**************************************************

**************************************************
Test case execution completed
**************************************************

**************************************************
Testcase Result : PASS
**************************************************
