Id	comment
1	El departamento de Rivera, es el que tiene el IDH más bajo de Uruguay y el único donde gobierna el partido Colorado.
2	Me parece que mucho marketing en la televisión ,y poca acción ,le echan la culpa a la población,pero dejan hacer marchas abren pub en Montevideo ,apertura rural del prado ,elecciones y sigo ,es entendible que el país debe seguir su curso pero no quieran tapar el sol con el dedo. La culpa es generalizada de todos .aglomeraciones de todo tipo ,tan solo mirar al transporte colectivo,somos un poco inteligentes por estadísticas de otros países de lo que se pone hay que multiplicarlo x7 por lo menos .Es lo que pienso .
3	Y si cierran los Free Shops de Rivera así no entran buses brasileros?? Arriesgue gobierno a tomar medidas poco populares. Así se corta un poco la llegada de brasileros a comprar.
4	En el norte hay un gigantesco colador y la frontera peor para el Covid19: Brasil que es un descontrol peor que Argentina. Aquí nos mienten con las cifras y nos hacemos los suizos.
5	Rivera está lleno de anormales irresponsables, es el lugar en el que está la mayoría de los votantes de Manini.
6	En el link que les dejo, está el Indice de Desarrollo Humano, por departamentos en Uruguay. El departamento con peor IDH es Rivera. Justamente donde gobiernan desde hace 35 años ininterrumpidos los colorados. Votar colorado produce subdesarrollo y el subdesarrollo, genera votantes colorados. Un espiral de miseria que esperamos que algún día, la gente de Rivera logrará superar
