abismal	2.0
abismalmente	2.0
absolutamente	2.0
absoluto	2.0
adicional	1.5
adicionalmente	1.5
alianza	1.5
ampliamente	2.0
amplio	2.0
ancho	1.5
aumentar	1.5
aumento	1.5
auténtico	2.0
bastante	1.5
casi	-2.0
colosal	2.0
colosalmente	2.0
completamente	1.5
completo	1.5
craso	-2.0
creciente	1.5
crónico	-2.0
demasiado	2.0
descomunal	2.0
descomunalmente	2.0
desgraciadamente	-2.0
desmesuradamente	-2.0
desmesurado	-2.0
desorbitadamente	-2.0
desorbitado	-2.0
enorme	2.0
enormemente	2.0
esencial	2.0
esencialmente	1.5
eternamente	2.0
eterno	2.0
excesivamente	2.0
excesivo	2.0
extremadamente	2.0
extremo	2.0
finito	-2.0
flagrante	1.5
flagrantemente	1.5
frenesí	-2.0
freneticamente	-2.0
fuerte	1.5
fuertemente	2.0
global	1.5
gran	1.5
grande	1.5
inacabable	2.0
inagotable	2.0
incomparable	2.0
incontable	2.0
incontrolable	2.0
indescriptible	2.0
inferior	1.5
infimo	2.0
infinitamente	2.0
infinito	2.0
infructuosamente	-2.0
infructuoso	-2.0
inigualable	2.0
inmensamente	2.0
inmenso	2.0
innumerable	2.0
insuperable	2.0
ligeramente	-2.0
mal	-2.0
más	1.5
maximizar	1.5
máximo	2.0
mayor	1.5
mayoría	1.5
medianamente	-2.0
mediano	-2.0
mejor	2.0
menor	-2.0
menos	-2.0
mero	2.0
mínimo	-2.0
minúsculo	-2.0
monumental	2.0
mortalmente	-2.0
muchísimo	2.0
mucho	1.5
múltiple	1.5
muy	1.5
nada	-2.0
notable	1.5
notorio	1.5
numeroso	1.5
óptimo	1.5
particularmente	1.5
pequeño	-2.0
perfectamente	2.0
plenamente	2.0
pleno	2.0
poco	-2.0
poquito	-2.0
positivamente	1.5
positivo	1.5
premeditado	-2.0
principal	1.5
profundamente	2.0
profundo	2.0
realmente	2.0
reducir	1.5
singular	1.5
suficiente	1.5
superior	2.0
supremo	2.0
tan	1.5
tanto	1.5
todo	2.0
total	2.0
totalmente	2.0
varios	1.5
verdaderamente	2.0
verdadero	2.0