<svg xmlns="http://www.w3.org/2000/svg" width="19.932" height="19.932" viewBox="0 0 19.932 19.932">
  <g id="noun_User_2185446" transform="translate(-120.5 74.5)">
    <g id="Grupo_814" data-name="Grupo 814" transform="translate(120.5 -74.5)">
      <path id="Trazado_638" data-name="Trazado 638" d="M11.466,1.5a9.966,9.966,0,1,0,9.966,9.966A9.977,9.977,0,0,0,11.466,1.5Zm0,18.686a8.692,8.692,0,0,1-6.182-2.578,6.222,6.222,0,0,1,12.364,0A8.692,8.692,0,0,1,11.466,20.186ZM8.663,8.04a2.8,2.8,0,1,1,2.8,2.8A2.806,2.806,0,0,1,8.663,8.04Zm10.016,8.32a7.53,7.53,0,0,0-4.774-5.1,4.049,4.049,0,1,0-4.888-.008,7.41,7.41,0,0,0-4.762,5.1,8.72,8.72,0,1,1,14.424,0Z" transform="translate(-1.5 -1.5)" fill="#7ad400"/>
    </g>
  </g>
</svg>
