DATE       TIME  CODE        NAME                   PRICE    UNIT
2023-08-06 10:00 F001        Pad Thai               0100     2
2023-08-06 10:05 F002        Green Curry            0120     3
2023-08-06 10:10 F001        Pad Thai               0100     1
2023-08-06 10:15 F003        Fried Rice             0090     4
2023-08-06 10:20 F002        Green Curry            0120     2
2023-08-06 10:25 F003        Fried Rice             0090     3
2023-08-06 10:30 F002        Green Curry            0120     1
2023-08-06 10:35 F003        Fried Rice             0090     5
2023-08-06 10:40 F001        Pad Thai               0100     2
2023-08-06 10:45 F001        Pad Thai               0100     2
2023-08-06 10:50 F002        Green Curry            0120     3
2023-08-06 10:55 F002        Green Curry            0120     1
2023-08-06 11:00 F003        Fried Rice             0090     2
2023-08-06 11:05 F003        Fried Rice             0090     4
2023-08-06 11:10 F001        Pad Thai               0100     1
2023-08-06 11:15 F002        Green Curry            0120     5
2023-08-06 11:20 F001        Pad Thai               0100     2
2023-08-06 11:25 F003        Fried Rice             0090     2
2023-08-06 11:30 F001        Pad Thai               0100     3
2023-08-06 11:35 F002        Green Curry            0120     2
2023-08-06 11:40 F002        Green Curry            0120     1
2023-08-06 11:45 F003        Fried Rice             0090     2
2023-08-06 11:50 F001        Pad Thai               0100     4
2023-08-06 11:55 F003        Fried Rice             0090     3
2023-08-06 12:00 F002        Green Curry            0120     5
2023-08-06 12:05 F003        Fried Rice             0090     2
2023-08-06 12:10 F001        Pad Thai               0100     1
2023-08-06 12:15 F001        Pad Thai               0100     2
2023-08-06 12:20 F002        Green Curry            0120     3
2023-08-06 12:25 F003        Fried Rice             0090     4
2023-08-06 12:30 F002        Green Curry            0120     2
2023-08-06 12:35 F001        Pad Thai               0100     1
2023-08-06 12:40 F002        Green Curry            0120     3
2023-08-06 12:45 F003        Fried Rice             0090     2
2023-08-06 12:50 F002        Green Curry            0120     4
2023-08-06 12:55 F001        Pad Thai               0100     3
2023-08-06 13:00 F001        Pad Thai               0100     5
2023-08-06 13:05 F003        Fried Rice             0090     1
2023-08-06 13:10 F002        Green Curry            0120     2
2023-08-06 13:15 F003        Fried Rice             0090     1
2023-08-06 13:20 F003        Fried Rice             0090     2
2023-08-06 13:25 F001        Pad Thai               0100     1

BRANCH       TOTAL
A            00003950
B            00003320
C            00003500
