905
829 279
386 152
11 5
132 57
670 901
133 121
96 597
193 98
307 350
137 61
603 780
473 297
26 6
285 862
402 590
207 620
14 177
569 680
242 717
23 338
282 297
78 574
192 250
846 798
589 806
661 864
227 193
505 129
664 265
524 158
6 12
64 607
36 624
364 324
292 93
735 837
387 377
507 59
4 36
897 864
432 162
774 600
350 513
53 537
337 349
776 375
701 699
199 391
293 202
43 321
288 431
10 85
150 54
156 58
57 492
761 614
388 643
85 261
596 676
490 457
124 29
89 282
58 27
134 98
130 7
116 457
452 254
249 104
186 238
664 728
804 567
15 462
221 177
657 558
49 66
103 225
57 374
2 807
97 17
10 4
287 306
795 254
147 41
286 171
471 500
179 275
631 114
333 560
705 219
443 310
36 453
748 204
57 636
128 573
796 596
553 875
118 355
6 5
435 387
56 127
124 392
186 409
753 209
47 125
677 516
166 127
367 324
430 291
219 164
30 214
623 54
398 269
157 6
86 91
140 125
79 692
43 3
159 281
747 419
446 109
351 352
234 188
726 510
583 711
136 90
653 794
314 121
345 710
872 360
404 344
29 15
206 53
526 129
35 17
80 347
662 898
270 267
100 236
337 600
399 548
412 704
745 403
764 232
7 9
25 436
551 45
427 288
243 26
425 128
24 52
820 562
65 339
547 457
44 43
708 739
41 571
88 32
605 275
122 848
13 635
771 598
209 145
133 256
58 471
813 356
498 271
603 402
563 146
356 487
173 288
802 31
569 132
881 414
739 832
446 575
170 583
279 158
47 874
141 393
843 671
295 373
437 212
224 357
337 164
67 596
741 443
34 107
790 113
257 71
180 858
896 108
3 4
460 137
773 571
153 836
399 70
412 155
34 285
855 376
219 380
674 668
479 372
485 388
630 689
381 306
765 536
512 895
418 264
415 230
621 496
730 291
159 77
459 161
536 241
353 344
188 96
9 45
246 204
717 867
770 753
86 154
289 209
296 143
424 330
375 396
7 189
475 562
34 122
783 102
532 270
206 222
116 3
423 463
111 100
709 113
194 411
263 395
72 340
252 735
608 3
211 247
371 133
15 8
103 41
450 287
139 57
172 116
105 37
221 544
95 410
670 891
55 27
74 56
119 212
812 546
164 865
377 104
188 268
60 72
629 202
692 830
16 305
785 45
170 421
92 89
15 20
33 106
592 218
264 73
12 37
115 48
464 584
124 284
47 15
322 71
46 27
255 444
523 506
68 46
241 716
125 196
241 725
724 491
682 814
640 222
225 667
406 99
638 213
683 655
73 38
3 22
199 480
192 497
892 487
252 310
281 335
4 19
137 330
684 366
694 839
148 184
61 854
242 145
696 842
382 456
661 241
174 71
417 581
158 101
342 365
681 666
174 204
328 466
85 176
116 568
286 346
152 30
480 576
699 14
815 299
903 885
489 68
13 4
479 840
314 570
163 713
62 205
488 827
591 275
885 632
21 32
211 100
880 265
122 390
554 564
126 595
99 56
12 14
125 703
426 157
307 59
114 102
5 545
283 400
50 197
618 515
18 8
641 278
87 135
309 113
119 108
729 744
202 61
871 143
191 194
496 332
4 117
122 360
530 97
251 698
736 405
123 262
831 804
312 408
650 388
68 259
214 567
845 778
239 742
540 226
111 217
694 387
510 659
658 873
849 728
23 20
22 230
417 182
95 27
675 73
538 218
54 113
546 826
797 603
140 589
31 30
471 904
52 582
555 284
384 284
99 433
110 55
42 252
215 808
106 397
326 199
824 154
86 81
28 13
235 482
29 208
481 380
593 647
749 305
30 34
879 367
40 269
833 893
894 88
2 265
729 463
137 160
866 230
654 779
416 73
809 467
525 791
686 445
586 364
25 84
218 190
80 788
446 467
358 529
351 553
594 408
38 556
805 211
580 619
132 550
186 468
506 902
10 27
179 59
562 876
143 144
419 242
767 330
101 474
147 356
615 287
495 489
287 888
555 860
354 601
376 303
752 393
610 595
463 799
663 594
491 232
120 97
429 166
604 415
816 316
116 341
226 110
310 470
758 185
237 301
87 63
354 77
755 441
152 332
782 34
61 200
248 31
315 55
35 884
8 4
666 714
403 352
314 439
336 388
53 151
511 9
40 35
99 100
801 511
8 96
137 228
22 565
451 116
165 114
777 653
415 494
627 324
494 784
33 612
92 533
370 206
141 117
20 51
235 316
889 814
343 368
30 311
323 175
721 810
410 708
415 476
678 127
245 138
162 58
67 308
118 103
691 304
464 403
775 209
166 448
621 632
25 81
288 334
266 71
124 762
549 436
16 606
622 397
409 685
616 526
20 79
671 99
61 255
798 259
788 823
304 329
41 56
261 294
436 611
230 325
878 667
2 1
8 579
16 521
270 688
819 835
585 137
181 48
4 271
153 317
580 488
258 245
342 256
273 237
766 634
134 609
469 208
240 366
112 434
486 205
70 20
772 689
374 786
682 517
331 167
30 488
271 732
277 263
167 41
106 155
33 15
487 515
887 678
438 271
526 666
280 445
368 668
92 131
479 789
593 10
778 580
618 670
1 847
64 28
324 483
731 693
71 112
402 258
82 276
423 329
818 600
522 333
537 669
857 868
35 359
1 319
16 14
828 680
80 178
760 407
411 531
143 287
210 138
42 23
628 579
630 275
76 52
623 633
497 750
702 699
870 340
13 838
189 260
216 207
626 66
525 649
588 532
146 78
283 320
4 7
413 199
72 651
350 554
171 159
678 757
172 263
420 418
444 501
190 143
45 561
662 754
727 95
385 364
274 9
116 182
21 20
24 11
69 673
150 220
145 642
333 227
552 228
369 191
80 35
126 239
132 231
64 161
647 658
191 68
65 43
213 47
76 344
60 37
50 24
478 26
75 1
723 157
472 274
36 53
78 42
419 737
244 96
320 389
134 851
137 313
557 538
821 777
861 181
237 178
145 25
94 38
82 26
803 368
857 94
306 509
566 97
115 693
44 362
121 295
639 24
598 576
39 37
324 243
128 34
499 428
98 58
278 97
109 103
169 164
47 101
850 205
534 214
454 161
240 219
312 59
327 189
104 88
362 853
124 844
77 50
280 143
246 506
541 313
300 130
2 25
759 162
345 157
524 543
859 377
198 48
186 882
655 162
163 29
187 348
315 375
672 270
787 761
70 93
718 655
345 697
351 336
99 614
157 232
452 793
1 41
455 167
763 689
401 350
852 668
30 22
751 819
59 49
237 358
142 96
166 186
2 5
445 516
83 440
516 877
116 223
405 465
900 654
173 394
599 493
653 228
380 405
781 372
899 673
318 1
536 696
208 303
510 251
140 183
474 822
20 712
792 577
155 199
414 220
204 458
587 547
531 740
706 699
15 869
625 51
683 687
61 17
425 738
144 817
105 512
36 57
207 167
95 546
69 379
2 3
890 678
756 352
539 402
236 254
528 96
89 75
863 550
67 48
38 28
323 441
572 326
49 25
695 298
129 51
529 700
157 883
428 508
798 834
715 464
41 645
648 228
751 246
28 299
143 116
743 454
378 45
302 208
285 304
514 322
293 856
518 86
656 546
323 662
114 224
54 23
41 578
25 215
420 493
66 235
428 280
232 542
734 552
426 634
241 15
40 108
290 652
343 266
83 46
118 126
437 800
613 315
58 283
431 449
746 130
69 382
118 298
290 130
665 113
17 3
841 660
487 517
660 464
637 575
141 461
558 333
34 71
833 59
383 138
475 300
7 187
185 132
418 825
769 298
115 175
401 422
195 50
722 538
4 48
525 101
809 811
192 149
849 886
447 229
303 654
282 535
646 160
164 75
679 544
37 644
196 253
556 577
504 397
361 213
520 22
123 36
328 270
85 138
168 49
488 733
527 20
80 173
445 707
149 80
416 617
22 62
740 768
233 165
138 272
336 307
199 484
28 153
690 658
275 363
28 63
181 559
23 69
124 719
18 170
257 442
15 291
477 345
519 252
602 504
201 21
