888 1165
780 725
769 600
824 872
226 82
307 513
300 615
8 853
558 824
588 718
731 39
534 649
624 783
276 882
646 442
722 478
339 276
127 223
342 280
27 673
225 246
394 586
27 811
326 458
72 714
357 339
611 394
278 850
186 139
209 569
727 673
497 525
241 367
301 661
870 462
207 411
583 480
818 780
691 804
240 67
487 295
418 564
565 420
188 196
702 761
677 148
266 416
60 743
414 888
238 701
340 118
794 396
52 823
271 685
583 228
679 211
2 222
190 72
398 557
618 434
281 13
350 266
307 812
888 66
128 543
364 265
352 563
180 6
727 702
831 189
30 111
44 512
694 271
54 592
50 762
525 30
755 461
650 692
886 317
86 838
109 638
89 190
119 568
376 63
443 253
538 271
201 490
874 203
730 852
571 366
520 62
414 14
557 741
730 745
424 308
553 202
841 293
718 879
442 267
718 405
153 271
533 806
880 590
220 556
413 666
305 49
173 96
189 138
186 56
238 338
146 713
412 299
432 612
744 50
334 142
207 671
617 202
182 371
440 782
708 636
48 596
4 649
666 141
514 654
498 523
665 41
244 845
80 700
155 570
83 73
543 72
681 705
233 468
326 230
565 438
452 882
888 507
615 675
463 128
35 855
304 535
707 795
700 756
291 231
539 555
384 777
685 10
537 9
107 711
237 855
572 779
707 653
193 827
10 723
721 129
469 29
395 474
818 679
410 819
526 276
443 748
18 202
674 551
880 632
860 401
356 307
628 56
17 233
876 7
746 577
459 503
309 708
241 323
20 777
747 206
222 319
3 369
497 46
706 186
286 635
44 719
849 806
154 884
217 338
793 486
290 399
598 154
764 201
724 46
471 354
838 94
758 776
17 729
676 482
360 634
768 538
462 433
71 611
863 701
610 499
473 465
494 741
768 564
752 94
272 323
286 130
874 851
467 347
135 733
508 38
154 671
770 487
786 841
139 53
803 34
450 326
792 820
773 93
529 740
264 750
643 450
234 646
467 83
639 658
238 828
567 540
875 636
30 633
851 603
687 580
319 86
571 70
212 690
45 574
447 657
536 114
709 78
485 260
794 219
391 187
366 121
611 353
687 96
468 167
233 266
804 887
311 437
558 335
91 171
875 479
330 183
141 530
551 565
684 188
240 237
381 144
160 28
374 340
882 211
403 502
589 558
743 487
601 652
835 405
77 732
298 718
20 41
464 87
626 841
661 753
778 125
148 416
423 151
714 489
295 745
190 827
821 441
80 351
603 555
123 467
512 423
339 272
125 66
325 53
467 599
377 8
272 401
146 395
283 26
368 432
82 748
392 822
857 824
58 323
828 419
476 54
693 607
551 805
717 584
769 103
196 437
466 328
70 344
359 23
461 736
256 540
496 177
732 533
519 174
368 504
388 9
144 676
413 824
55 811
295 600
723 612
594 266
443 523
65 781
373 777
728 261
241 623
455 776
446 841
397 523
496 604
656 651
397 642
71 705
129 558
778 326
743 216
29 192
315 1
397 275
786 383
9 585
216 203
688 18
550 357
460 373
473 496
624 472
588 653
874 461
625 107
215 142
485 257
592 603
727 64
469 152
77 808
597 10
752 685
124 887
21 24
465 486
103 483
200 417
274 622
715 739
224 551
827 464
666 167
632 120
106 801
838 524
179 32
128 317
214 353
535 50
381 157
281 714
210 307
158 658
839 275
175 20
821 882
418 680
75 41
619 701
374 771
586 475
562 737
567 267
260 34
885 876
753 283
531 555
832 507
388 583
393 123
60 75
340 600
56 614
375 765
655 618
134 341
303 801
261 814
184 526
167 606
750 608
322 7
352 265
868 425
158 466
428 796
775 421
102 421
719 111
759 294
805 651
459 99
841 661
136 43
798 130
845 698
668 438
860 853
789 361
89 512
559 712
492 291
28 332
339 670
131 807
796 376
554 707
264 826
118 693
542 652
776 834
155 277
888 817
841 53
325 364
250 342
586 172
503 179
374 36
657 735
815 540
210 496
457 16
684 286
830 158
57 642
756 121
155 386
35 881
568 661
97 641
838 645
103 286
283 567
680 739
573 583
425 1
2 649
177 391
251 152
476 874
702 145
636 764
640 487
102 798
243 409
128 198
199 255
543 724
101 218
60 583
24 96
818 683
102 880
881 772
565 51
790 692
689 627
495 24
437 528
158 631
358 288
7 658
670 8
793 685
472 728
2 588
318 199
354 644
100 829
145 418
153 816
638 175
562 428
755 61
606 483
518 316
373 187
817 501
544 83
261 217
145 801
425 318
548 735
653 11
738 635
644 564
699 235
362 498
316 273
522 647
229 105
144 829
800 306
4 667
738 505
752 406
532 442
581 287
318 344
670 208
429 40
687 68
61 303
179 219
829 356
704 23
723 659
292 701
389 105
22 473
505 241
447 153
66 99
516 293
197 625
22 625
554 172
21 638
831 740
742 322
739 860
452 771
161 551
836 449
313 297
341 24
486 82
281 202
309 79
306 652
464 127
435 541
7 376
232 235
559 469
101 338
339 571
91 211
537 475
855 288
556 555
391 49
767 552
429 12
281 263
598 543
416 578
842 361
838 14
773 484
648 216
204 466
797 886
150 767
186 380
166 768
608 625
57 91
557 818
643 883
19 442
58 133
692 176
516 102
709 11
441 178
374 762
3 194
885 323
316 21
881 289
95 118
485 703
148 617
560 442
3 238
132 136
835 583
619 189
866 667
222 684
347 865
118 343
240 511
476 496
575 852
638 519
646 321
47 565
628 873
90 38
203 366
72 11
699 86
28 824
381 550
366 753
738 336
594 767
283 314
3 158
759 238
496 784
148 403
140 464
18 127
810 768
15 453
158 461
795 861
309 569
567 109
224 660
180 418
770 661
282 250
609 273
286 408
765 630
854 868
247 693
35 381
524 751
380 417
317 708
355 763
412 563
728 681
175 877
455 32
874 292
633 291
68 517
538 835
170 58
617 837
395 125
795 404
793 365
830 401
875 622
31 579
747 515
464 252
321 62
44 118
857 432
707 825
145 380
380 235
837 418
867 426
384 664
786 561
172 630
165 207
50 873
699 607
400 179
144 204
839 264
498 820
821 473
514 349
320 437
811 363
719 59
459 243
217 257
580 312
383 291
123 425
786 583
653 685
349 566
95 648
256 527
356 392
549 454
465 448
720 840
560 189
126 380
857 256
622 463
189 589
471 843
582 731
480 45
466 821
309 807
527 144
536 514
523 144
681 442
818 259
471 484
599 427
291 385
650 492
477 576
769 882
446 348
288 843
39 37
524 241
613 97
69 630
358 496
232 859
656 690
50 737
885 501
225 802
527 507
390 489
728 424
237 483
693 273
632 763
734 841
274 310
271 751
158 75
366 748
17 664
266 334
574 799
620 574
419 230
887 315
439 30
668 510
395 670
723 351
887 360
294 266
585 297
619 854
275 59
468 797
118 868
383 749
886 327
35 733
625 230
527 660
407 621
352 508
417 469
57 720
770 467
601 173
36 466
549 359
259 427
130 801
109 750
294 697
150 146
518 269
665 847
548 373
130 120
282 621
557 299
528 694
325 797
262 174
793 362
144 203
866 382
846 688
594 152
142 558
100 110
873 361
604 821
96 70
159 451
187 289
226 708
356 619
480 828
283 351
850 237
157 295
791 624
382 373
75 197
783 884
367 464
471 630
62 750
708 750
496 661
191 236
167 663
555 481
785 505
731 655
743 28
592 219
664 171
70 506
256 183
752 268
695 467
660 631
105 161
478 78
536 209
174 420
671 688
122 252
262 469
140 829
7 389
102 598
539 680
62 676
315 745
61 68
710 392
68 865
10 561
858 705
199 801
247 508
196 641
248 560
874 684
548 439
296 818
502 605
347 517
832 797
50 833
519 233
108 693
419 879
91 474
823 773
704 570
882 376
696 219
619 682
267 675
8 575
513 113
464 630
397 743
448 645
521 753
613 347
475 808
831 200
323 465
796 289
674 549
685 237
593 719
344 329
364 884
868 147
599 42
469 403
420 855
687 569
712 74
415 12
826 396
686 509
806 557
427 341
263 747
435 609
243 830
252 242
141 847
801 470
796 638
387 627
277 292
430 252
842 814
768 645
671 215
332 636
827 707
325 776
41 90
573 785
111 158
325 127
847 663
374 292
853 861
51 165
375 596
552 296
65 358
293 533
183 218
49 506
563 106
35 271
351 865
404 717
859 212
369 552
772 604
120 658
381 520
608 436
117 349
379 83
35 735
235 186
661 879
557 883
137 530
352 510
69 397
80 600
639 607
163 622
394 644
624 673
13 343
835 268
504 434
324 110
283 339
748 868
609 753
239 36
294 204
732 556
762 754
140 502
327 674
328 516
484 765
407 318
592 872
691 828
168 647
451 717
877 36
359 781
118 720
871 50
631 777
271 700
383 157
121 814
6 187
233 14
735 593
502 203
140 419
223 513
24 201
370 291
569 881
830 885
745 548
501 243
396 620
602 764
404 267
426 284
668 149
606 849
244 169
618 884
462 469
654 846
240 377
557 681
770 677
309 146
308 48
362 392
169 417
566 534
638 116
234 358
391 696
281 784
257 655
834 367
306 243
184 544
639 152
711 124
853 556
285 463
566 651
721 786
294 836
2 381
664 232
108 193
492 526
624 201
435 538
422 234
26 252
688 668
452 26
249 603
588 721
34 825
512 772
730 71
528 629
310 225
660 305
414 365
63 407
774 644
125 259
311 837
539 862
655 162
328 556
129 90
132 362
293 786
545 177
632 570
589 198
534 585
602 750
187 740
221 675
294 76
700 871
729 361
258 529
280 73
144 481
68 572
419 364
816 383
687 25
502 571
734 407
291 725
60 629
487 446
114 19
496 730
435 311
663 582
804 254
757 888
329 135
596 653
173 407
750 720
603 408
685 107
741 199
71 504
758 25
144 28
254 19
758 82
737 294
820 555
807 401
334 118
607 224
624 146
49 581
659 146
642 422
748 193
821 769
147 541
19 29
548 612
70 409
258 865
362 242
113 810
63 571
532 551
765 279
588 599
765 504
659 800
339 332
337 432
68 116
389 451
116 14
705 180
497 537
67 25
143 440
747 683
325 624
520 836
499 292
335 574
554 102
141 730
262 384
562 369
856 761
316 624
118 348
54 418
448 135
36 341
297 197
253 100
675 53
530 116
862 397
616 686
374 249
80 624
586 683
78 604
851 442
269 771
154 421
63 602
511 620
94 874
434 637
862 714
657 502
599 622
449 544
275 725
1 798
644 32
