840 1615
765 572
345 779
624 69
642 380
58 416
723 708
743 697
714 90
165 119
348 313
433 432
78 86
668 389
317 583
227 220
543 409
728 705
69 380
289 481
53 819
582 618
672 339
66 702
140 806
308 298
521 452
690 392
80 441
759 27
399 408
242 783
496 606
777 744
561 596
654 12
180 38
93 612
223 128
135 745
754 206
221 426
721 415
8 521
723 463
100 407
545 169
254 664
686 304
12 90
532 203
382 363
709 636
529 270
37 63
773 48
424 76
242 434
587 791
373 303
487 751
589 515
444 373
393 688
503 431
805 449
148 625
261 393
765 36
787 659
202 517
117 525
701 573
557 803
708 196
70 766
805 180
364 420
498 319
498 200
463 16
56 605
292 613
386 181
264 387
536 453
114 666
366 388
397 415
571 611
113 338
421 105
598 187
196 775
773 43
685 772
583 211
141 519
258 741
563 122
464 39
465 431
219 661
275 457
643 794
188 466
795 186
521 560
305 174
568 788
220 580
116 533
620 536
73 144
560 819
30 364
398 464
700 669
85 292
530 499
132 171
835 803
123 462
70 481
164 425
8 674
603 793
621 229
162 131
37 116
559 837
750 49
738 511
635 588
236 299
346 682
812 374
339 543
345 836
331 131
686 353
72 411
733 495
839 575
260 455
686 464
68 274
8 391
335 804
155 159
216 757
661 698
259 835
827 421
278 385
779 829
246 755
230 418
305 694
515 199
308 527
438 586
77 469
333 502
382 456
111 778
259 210
209 652
54 419
812 763
55 552
545 400
622 430
512 658
217 839
262 465
67 398
234 40
823 144
741 551
372 619
605 88
679 331
741 648
708 327
90 538
667 682
807 41
760 328
294 628
636 93
798 692
324 366
663 320
439 687
217 695
170 614
174 486
196 122
610 834
453 171
440 240
223 175
157 695
163 593
754 171
12 365
752 771
285 317
247 492
517 804
633 548
413 693
440 247
4 341
668 295
542 839
745 410
666 291
459 2
740 558
194 695
467 527
734 691
811 556
738 516
242 481
183 354
834 364
139 52
675 154
418 145
661 526
814 126
306 100
113 35
518 215
529 68
103 745
523 316
48 801
451 389
486 562
93 213
299 247
394 129
433 279
344 715
92 121
289 128
410 1
151 707
769 177
381 384
333 210
209 279
529 206
35 718
170 711
615 333
526 88
35 146
823 341
399 264
95 259
119 487
549 543
822 663
606 149
181 699
81 436
764 542
156 386
619 353
140 734
749 72
587 309
74 704
400 563
353 415
116 602
194 252
715 668
515 459
812 127
226 419
407 47
502 252
103 566
72 474
770 90
699 791
772 167
392 22
144 188
441 559
118 353
709 669
291 323
647 365
256 105
217 370
544 197
217 40
40 100
66 648
35 427
532 416
353 425
669 174
339 33
303 555
415 726
274 201
459 658
65 244
714 337
826 733
349 682
26 130
576 361
138 763
477 656
667 183
688 677
2 680
308 702
628 811
241 162
728 193
581 801
431 261
359 232
551 20
367 599
264 118
395 611
710 283
474 94
511 696
683 821
739 336
228 564
393 423
107 625
256 308
478 66
596 609
48 694
473 399
3 260
233 527
414 131
821 577
606 233
200 704
2 363
457 700
441 39
187 80
62 42
246 200
377 724
637 3
90 198
715 339
97 152
223 125
522 740
337 807
340 500
625 418
544 3
265 742
784 428
2 499
420 838
493 632
666 538
261 785
744 714
620 421
335 772
52 649
812 489
197 261
270 62
419 170
298 335
120 750
300 95
545 838
188 740
138 810
682 376
794 708
355 400
712 688
358 469
126 444
427 417
56 397
439 82
625 320
649 506
415 488
164 403
479 282
692 710
2 14
593 497
569 709
92 393
535 322
634 254
501 16
229 630
506 528
72 528
509 80
539 449
567 578
452 144
199 420
738 172
404 450
65 817
235 463
236 395
286 361
524 712
635 128
301 140
768 84
777 565
556 536
499 760
765 323
60 805
8 344
162 20
53 232
717 764
466 638
731 800
645 37
373 764
311 318
68 144
836 704
201 79
554 240
590 281
650 780
416 228
34 687
325 67
300 788
90 829
683 288
447 724
649 180
417 719
666 394
372 351
232 303
564 382
682 576
370 20
43 134
327 710
109 527
39 665
812 338
29 387
238 214
331 167
25 267
835 128
12 7
840 85
736 337
572 386
151 1
83 768
141 502
243 737
274 716
403 349
136 96
10 435
321 623
676 311
365 339
374 660
805 689
323 102
2 443
768 506
191 364
431 451
217 390
642 52
99 604
297 817
284 167
196 449
533 659
757 181
601 563
196 80
630 678
678 744
552 599
169 387
13 583
198 589
787 535
44 680
266 102
378 193
840 364
331 253
759 21
561 54
46 718
1 95
517 489
727 715
687 230
143 92
529 821
780 41
782 317
438 109
80 291
773 667
193 68
395 410
61 368
175 504
341 437
428 702
175 617
287 702
151 638
209 553
804 273
417 113
674 516
510 751
45 772
502 86
83 30
163 86
429 391
622 515
680 347
404 827
449 665
215 267
752 178
372 358
646 513
454 238
25 497
211 474
618 614
766 253
92 431
199 128
435 787
791 11
133 274
508 833
753 634
150 405
759 249
544 286
496 661
294 600
623 59
435 466
572 734
334 787
813 164
636 438
599 34
486 468
269 220
355 539
669 80
323 57
719 25
651 480
231 159
489 159
415 340
825 323
150 537
374 410
794 621
743 424
86 771
23 136
48 795
180 499
574 647
795 320
763 564
196 723
768 825
79 715
322 143
129 725
138 240
753 661
85 466
694 259
404 85
523 771
525 80
324 492
17 118
399 660
496 157
541 556
639 281
661 269
573 550
575 802
18 375
203 746
549 468
82 769
618 258
820 55
276 319
423 199
462 539
38 794
646 656
685 491
137 59
485 80
54 143
58 681
249 345
45 530
532 379
611 620
478 320
563 423
379 275
761 610
47 282
74 196
563 704
724 237
301 567
804 819
369 148
59 525
28 33
302 576
268 445
350 204
103 390
552 809
114 563
290 129
745 626
155 95
203 804
497 455
449 561
454 440
593 816
678 558
540 217
708 253
736 628
477 106
184 778
250 535
625 190
554 313
700 328
242 321
364 309
809 653
146 765
167 714
774 438
654 459
638 716
625 617
507 203
133 163
157 242
52 578
128 504
204 307
519 729
319 439
102 598
565 209
625 78
684 303
481 771
813 77
394 819
330 334
244 723
294 668
724 146
819 203
731 288
588 367
442 698
354 808
363 513
348 672
117 562
479 447
635 630
137 359
110 531
628 468
356 537
758 340
377 511
267 706
53 648
740 57
9 594
589 6
730 354
648 636
371 503
248 788
335 80
836 224
827 824
407 41
521 172
832 348
479 562
306 600
147 347
761 672
745 369
376 673
52 292
55 484
23 272
10 746
356 242
11 593
461 30
153 277
512 791
178 311
486 249
469 586
720 366
149 588
499 523
260 619
321 579
179 486
308 258
821 596
407 206
318 426
727 431
621 254
275 702
445 706
665 666
619 40
22 391
426 321
300 298
212 655
34 477
714 600
756 101
190 152
211 680
605 658
679 76
472 21
438 401
279 436
699 828
185 361
150 756
159 622
571 524
790 805
338 796
656 467
210 250
716 803
91 221
793 30
560 831
174 697
121 563
286 616
289 783
532 234
154 301
101 226
670 280
374 244
221 222
796 342
638 145
708 601
559 603
656 458
549 651
165 717
777 682
318 95
162 14
293 840
772 672
818 379
468 84
567 450
517 244
537 155
350 400
601 771
774 486
613 17
467 462
638 700
734 368
23 248
189 37
712 547
754 56
410 286
802 556
473 185
195 736
138 669
189 62
27 143
323 469
206 276
203 221
653 235
503 563
452 329
520 235
445 203
696 706
530 792
593 206
187 291
354 135
357 138
457 41
114 519
387 255
170 75
171 331
154 250
708 114
785 97
241 224
400 741
612 357
691 248
74 343
144 183
400 590
459 204
147 548
462 140
338 102
817 793
398 217
131 719
502 557
468 802
782 825
98 418
112 257
235 344
774 450
44 171
523 277
732 88
24 391
600 405
318 553
282 406
619 99
674 321
783 774
336 504
691 629
253 349
192 652
132 624
179 39
364 486
294 355
280 579
133 506
837 161
622 744
329 327
294 647
689 679
446 393
687 37
674 58
790 278
150 815
365 489
774 762
389 521
191 701
70 838
325 454
121 386
363 89
435 46
751 764
679 702
781 788
161 479
521 660
483 212
174 760
512 369
583 435
255 503
185 724
149 300
500 91
550 454
202 622
191 135
110 839
222 124
426 475
45 212
534 729
102 767
360 490
141 91
731 336
174 552
632 297
805 133
128 169
715 815
593 430
712 610
180 34
829 651
707 681
836 408
378 784
627 537
632 460
597 812
604 69
182 349
717 649
64 700
144 191
794 450
155 490
474 646
36 385
771 123
363 713
240 412
455 725
118 634
106 601
256 767
441 463
197 447
146 162
37 262
649 201
797 406
746 85
289 167
74 320
458 227
315 29
541 775
685 456
598 390
515 378
175 742
750 454
758 262
744 688
236 263
344 94
625 811
282 675
173 208
514 579
328 135
186 358
137 824
427 730
470 604
56 821
238 29
223 459
558 287
562 89
674 670
441 187
467 746
105 230
571 346
406 603
135 344
801 335
144 352
613 23
154 460
407 786
438 497
12 113
768 361
552 667
111 549
385 276
313 759
293 244
762 379
769 398
183 674
149 356
359 477
195 703
70 16
676 587
757 250
97 345
118 347
255 342
75 635
793 239
406 779
246 63
433 5
349 362
221 190
53 267
815 507
433 348
474 765
301 332
281 155
242 704
829 412
154 570
692 351
328 340
500 389
471 549
366 607
3 397
775 230
686 146
113 41
786 25
274 453
433 620
14 387
142 372
240 429
40 367
330 129
58 287
486 143
839 649
700 388
296 535
479 809
82 504
430 252
715 606
296 171
7 217
301 572
505 123
92 410
809 664
371 776
125 692
510 733
576 326
225 424
798 453
498 499
417 382
550 240
141 701
367 502
152 253
318 99
528 419
730 476
664 269
576 447
33 319
276 149
733 301
330 823
437 625
207 186
305 329
640 495
219 370
257 494
261 121
154 542
341 203
431 132
306 296
707 716
307 657
126 631
131 572
318 307
712 805
328 739
607 744
442 385
499 7
579 106
634 598
255 813
76 523
815 591
487 480
418 146
365 42
407 457
415 665
70 97
39 659
176 430
234 291
421 479
798 770
486 405
729 677
648 737
91 689
410 426
815 426
792 128
726 281
693 533
450 713
650 111
293 776
42 520
638 834
45 621
603 441
256 166
785 207
307 200
552 238
98 223
233 774
653 645
470 82
432 645
78 437
471 49
419 586
762 8
34 568
735 352
349 774
300 16
659 683
418 666
98 73
154 128
459 85
242 351
767 262
363 68
686 646
506 606
103 784
334 171
563 814
165 521
596 310
282 705
501 54
30 66
640 178
107 758
712 801
478 286
302 631
103 322
189 596
673 175
468 541
654 428
453 544
826 391
824 156
204 595
49 89
516 747
724 473
636 331
821 503
753 639
644 173
815 196
159 330
684 590
637 618
11 195
379 48
159 475
606 234
393 693
538 438
148 821
424 693
665 755
8 554
173 294
526 684
363 814
364 298
97 577
818 307
549 317
762 634
376 592
767 314
153 832
721 601
760 1
265 665
516 275
110 430
592 499
439 793
338 567
508 253
74 461
704 305
647 627
581 672
331 48
42 360
527 533
128 236
564 356
159 289
245 311
190 599
451 313
93 788
748 31
432 623
749 754
737 289
25 298
353 568
465 595
365 801
325 487
292 315
5 15
245 197
800 254
35 539
137 232
177 385
89 39
270 12
473 635
699 4
185 65
41 799
425 760
267 551
731 513
25 307
614 479
450 86
624 271
627 266
311 13
294 656
527 407
839 353
677 81
799 153
305 826
749 778
44 609
171 107
45 131
304 510
123 345
567 599
440 120
575 194
433 47
171 322
779 602
253 322
553 625
189 698
225 66
453 454
482 683
387 391
39 41
232 300
91 499
349 460
448 126
621 266
787 72
609 56
740 342
219 452
534 488
425 723
523 723
818 439
387 305
75 543
302 339
195 819
419 593
719 762
245 276
569 741
695 381
739 840
619 821
651 101
181 478
257 819
840 89
306 288
80 163
43 809
322 685
568 301
10 447
512 410
574 712
760 57
338 294
747 469
417 256
128 221
756 429
61 636
669 125
543 9
50 312
345 153
239 395
444 589
49 59
452 523
767 161
680 355
132 531
611 653
764 681
487 51
73 286
576 521
176 17
106 154
388 219
657 300
184 32
183 56
39 418
667 384
374 472
12 717
649 75
176 462
432 600
463 327
555 647
38 105
119 267
266 134
361 28
20 715
595 682
390 730
653 789
88 73
180 44
581 220
546 759
622 629
681 568
576 744
649 519
112 625
451 246
414 398
239 383
739 574
319 311
530 382
371 531
13 740
74 530
383 781
725 337
262 561
564 612
361 492
385 108
114 354
744 352
232 607
344 506
87 565
386 5
392 751
791 479
47 620
670 620
182 443
720 136
636 20
57 809
232 567
456 63
592 668
231 648
533 691
532 429
210 133
430 205
720 143
408 286
718 68
687 412
710 791
696 396
448 352
714 16
769 144
364 409
22 179
487 477
108 457
700 50
367 54
190 469
177 442
592 405
804 266
88 757
383 836
689 452
717 585
374 729
124 158
654 245
76 790
631 703
589 728
302 542
72 330
595 195
351 514
144 615
163 738
388 712
606 330
446 486
179 156
381 659
444 200
326 625
537 470
594 298
484 393
114 71
528 441
659 724
333 109
635 80
88 58
702 613
168 796
544 88
146 675
424 769
614 159
139 384
360 179
162 428
771 538
594 542
9 250
483 143
411 698
87 273
134 783
58 675
519 626
79 11
100 140
751 176
407 287
488 96
499 722
98 345
379 246
148 246
649 322
278 625
19 573
800 135
688 594
418 707
327 511
773 225
265 474
169 675
683 252
746 347
187 317
834 147
395 776
827 432
63 441
446 580
677 200
242 32
273 824
189 128
8 614
707 593
615 72
636 262
728 95
670 838
696 8
329 180
520 672
523 733
357 185
777 346
657 681
413 339
78 236
814 544
191 793
826 242
238 811
280 210
444 235
70 742
70 672
623 1
298 231
384 203
442 388
117 715
48 88
525 682
568 457
11 189
696 365
787 483
535 187
78 731
270 436
22 131
8 739
462 624
74 242
28 647
322 78
153 114
46 542
569 826
332 266
