<svg xmlns="http://www.w3.org/2000/svg" width="20.72" height="20.191" viewBox="0 0 20.72 20.191">
  <g id="Iconly_Curved_Folder" data-name="Iconly/Curved/Folder" transform="translate(0.75 0.741)">
    <g id="Folder" transform="translate(0 0)">
      <path id="Stroke_1" data-name="Stroke 1" d="M0,.476H9.593" transform="translate(4.806 11.598)" fill="none" stroke="#000" stroke-linecap="round" stroke-linejoin="round" stroke-width="1.5"/>
      <path id="Stroke_2" data-name="Stroke 2" d="M0,5.3C0,2.856,1.25.759,3.622.273a8.088,8.088,0,0,1,5.67.489c1.5.808,1.069,2,2.608,2.875s4.017-.44,5.635,1.306c1.694,1.828,1.685,4.633,1.685,6.422,0,6.8-3.807,7.335-9.61,7.335S0,18.229,0,11.364Z" transform="translate(0 0)" fill="none" stroke="#000" stroke-linecap="round" stroke-linejoin="round" stroke-width="1.5"/>
    </g>
  </g>
</svg>
