<svg xmlns="http://www.w3.org/2000/svg" width="20.488" height="19.5" viewBox="0 0 20.488 19.5">
  <g id="Iconly_Curved_Danger_Triangle" data-name="Iconly/Curved/Danger Triangle" transform="translate(0.744 0.75)">
    <g id="Danger_Triangle" data-name="Danger Triangle">
      <path id="Stroke_3" data-name="Stroke 3" d="M9.5,18C3.006,18,.457,17.539.044,15.2s2.23-6.726,3.045-8.175C5.813,2.184,7.664,0,9.5,0s3.687,2.184,6.412,7.028c.815,1.449,3.458,5.839,3.045,8.175S15.994,18,9.5,18Z" fill="none" stroke="#000" stroke-linecap="round" stroke-linejoin="round" stroke-width="1.5"/>
      <path id="Stroke_3-2" data-name="Stroke 3" d="M.5,0V3.895" transform="translate(9 5.5)" fill="none" stroke="#000" stroke-linecap="round" stroke-linejoin="round" stroke-width="1.5"/>
      <path id="Stroke_15" data-name="Stroke 15" d="M.5.5H.5" transform="translate(9 12.395)" fill="none" stroke="#000" stroke-linecap="round" stroke-linejoin="round" stroke-width="1.5"/>
    </g>
  </g>
</svg>
