<svg xmlns="http://www.w3.org/2000/svg" width="20" height="20" viewBox="0 0 20 20">
    <g id="Iconly_Curved_Info_Square" transform="translate(0.75 0.75)">
        <g id="Info_Square">
            <path id="Stroke_1"
                d="M0,9.25C0,2.313,2.313,0,9.25,0S18.5,2.313,18.5,9.25,16.187,18.5,9.25,18.5,0,16.187,0,9.25Z"
                transform="translate(18.5 18.5) rotate(180)" fill="none" stroke="#000"
                stroke-linecap="round" stroke-linejoin="round" stroke-width="1.5" />
            <path id="Stroke_3" d="M.5,0V3.895" transform="translate(9.75 13.145) rotate(180)"
                fill="none" stroke="#000" stroke-linecap="round" stroke-linejoin="round"
                stroke-width="1.5" />
            <path id="Stroke_15" d="M.5.5H.5" transform="translate(9.75 6.25) rotate(180)"
                fill="none" stroke="#000" stroke-linecap="round" stroke-linejoin="round"
                stroke-width="1.5" />
        </g>
    </g>
</svg>
