<svg xmlns="http://www.w3.org/2000/svg" width="18.282" height="20" viewBox="0 0 18.282 20">
  <g id="Iconly_Curved_Document" data-name="Iconly/Curved/Document" transform="translate(0.75 0.75)">
    <g id="Document" transform="translate(0)">
      <path id="Stroke_1" data-name="Stroke 1" d="M7.22.5H0" transform="translate(4.766 12.446)" fill="none" stroke="#000" stroke-linecap="round" stroke-linejoin="round" stroke-width="1.5"/>
      <path id="Stroke_2" data-name="Stroke 2" d="M7.22.5H0" transform="translate(4.766 8.686)" fill="none" stroke="#000" stroke-linecap="round" stroke-linejoin="round" stroke-width="1.5"/>
      <path id="Stroke_3" data-name="Stroke 3" d="M2.755.5H0" transform="translate(4.766 4.927)" fill="none" stroke="#000" stroke-linecap="round" stroke-linejoin="round" stroke-width="1.5"/>
      <path id="Stroke_4" data-name="Stroke 4" d="M0,9.25c0,6.937,2.1,9.25,8.391,9.25s8.391-2.313,8.391-9.25S14.685,0,8.391,0,0,2.313,0,9.25Z" transform="translate(0)" fill="none" stroke="#000" stroke-linecap="round" stroke-linejoin="round" stroke-width="1.5"/>
    </g>
  </g>
</svg>
