<svg xmlns="http://www.w3.org/2000/svg" width="16.821" height="20.117" viewBox="0 0 16.821 20.117">
  <g id="Iconly_Curved_Unlock" data-name="Iconly/Curved/Unlock" transform="translate(0.75 0.75)">
    <g id="Unlock" transform="translate(-0.75 -0.75)">
      <path id="Stroke_1" data-name="Stroke 1" d="M8.927,3.237A4.562,4.562,0,0,0,0,4.484V6.653" transform="translate(3.849 0.75)" fill="none" stroke="#000" stroke-linecap="round" stroke-linejoin="round" stroke-width="1.5"/>
      <path id="Stroke_3" data-name="Stroke 3" d="M.5,0V2.221" transform="translate(7.91 12.156)" fill="none" stroke="#000" stroke-linecap="round" stroke-linejoin="round" stroke-width="1.5"/>
      <path id="Stroke_5" data-name="Stroke 5" d="M7.66,0C1.915,0,0,1.568,0,6.271s1.915,6.272,7.66,6.272,7.661-1.568,7.661-6.272S13.406,0,7.66,0Z" transform="translate(0.75 6.824)" fill="none" stroke="#000" stroke-linecap="round" stroke-linejoin="round" stroke-width="1.5"/>
    </g>
  </g>
</svg>
