<svg width="828" height="810" viewBox="0 0 828 810" fill="none" xmlns="http://www.w3.org/2000/svg">
<g clip-path="url(#clip0_129_5069)">
<path d="M278.82 188.69C278.21 189.1 277.63 189.54 277.12 190.07C276.61 190.6 276.04 191.16 275.81 191.84C275.44 192.92 276.58 193.34 277.46 193.29C278.61 193.23 279.52 192.69 280.47 192.11C283.1 190.52 285.72 188.94 288.35 187.35C288.83 187.06 289.45 186.4 288.82 185.93C288.19 185.46 287.06 185.7 286.39 185.98C283.53 187.18 280.82 188.72 278.17 190.32L280.57 191.47C282.9 190.01 285.24 188.56 287.57 187.1C287.97 186.85 288.61 186.27 288.17 185.77C287.73 185.27 286.67 185.38 286.12 185.56C284.27 186.18 282.5 186.94 280.81 187.94C279.32 188.82 277.86 189.86 276.78 191.24C276.31 191.84 275.58 192.82 276.04 193.58C276.53 194.39 277.83 194.36 278.64 194.22C279.65 194.05 280.59 193.62 281.52 193.2C282.45 192.78 283.3 192.36 284.17 191.9C285.92 190.98 287.6 189.93 289.2 188.76L286.2 188.15C285.78 188.88 285.39 189.36 284.81 189.89C284.65 190.04 284.48 190.18 284.31 190.32C284.27 190.36 283.77 190.73 284 190.56C283.67 190.8 283.32 191.03 282.97 191.24C282.58 191.48 282.18 191.71 281.78 191.93C281.56 192.05 281.34 192.17 281.12 192.28C281.4 192.14 280.86 192.41 280.8 192.44C279.92 192.86 279.03 193.23 278.11 193.56C277.67 193.72 276.91 194.19 276.94 194.73C276.97 195.27 277.66 195.46 278.12 195.45C280.85 195.38 283.56 194.62 285.87 193.14C286.96 192.44 287.92 191.61 288.77 190.65C289.45 189.88 290.66 188.52 289.75 187.51C288.84 186.5 285.16 187.92 286.16 189.02C286.27 189.14 286.04 189.46 285.9 189.66C285.76 189.86 285.62 190.04 285.48 190.22C285.41 190.3 285.35 190.38 285.28 190.46C285.38 190.35 285.24 190.5 285.22 190.53C284.92 190.85 284.6 191.15 284.26 191.43C284.16 191.51 284.06 191.59 283.96 191.67C283.86 191.75 283.79 191.79 283.94 191.69C283.75 191.83 283.56 191.95 283.36 192.08C283.18 192.19 283 192.29 282.82 192.39C282.78 192.41 282.49 192.57 282.69 192.46C282.92 192.34 282.53 192.53 282.49 192.55C282.3 192.64 282.11 192.72 281.92 192.79C281.88 192.81 281.67 192.92 281.63 192.9C281.87 192.82 281.91 192.81 281.77 192.85C281.72 192.87 281.67 192.88 281.62 192.9C281.42 192.96 281.22 193.02 281.02 193.07C280.9 193.1 280.77 193.15 280.64 193.16C280.79 193.15 280.95 193.11 280.7 193.14C280.49 193.17 280.29 193.2 280.08 193.22C279.95 193.23 279.82 193.24 279.69 193.25C279.4 193.28 280.13 193.24 279.63 193.25V195.14C281.69 194.4 283.67 193.44 285.51 192.29C287.18 191.24 288.8 189.96 289.8 188.22C290.12 187.66 289.77 187.24 289.18 187.13C288.43 186.99 287.43 187.15 286.8 187.61C285.32 188.68 283.78 189.66 282.17 190.53C281.38 190.96 280.96 191.17 279.99 191.6C279.6 191.77 279.21 191.94 278.82 192.11C278.71 192.16 278.59 192.2 278.48 192.25C278.66 192.17 278.85 192.12 279.05 192.1C279.31 192.07 279.48 192.13 279.71 192.22C279.86 192.28 279.71 192.5 279.82 192.16C279.87 192.01 280.01 191.85 280.09 191.72C280.28 191.44 280.51 191.14 280.66 190.99C280.97 190.68 281.29 190.39 281.64 190.12C281.69 190.08 282.06 189.81 281.82 189.98C282 189.85 282.18 189.73 282.36 189.61C282.71 189.38 283.08 189.16 283.44 188.95C283.65 188.83 283.86 188.72 284.07 188.6C284.27 188.5 284.28 188.49 284.12 188.57C284.23 188.52 284.34 188.46 284.45 188.41C284.83 188.23 285.22 188.05 285.61 187.89C285.83 187.8 286.06 187.71 286.28 187.62C286.35 187.59 287.07 187.34 286.63 187.49L285.17 185.95C282.84 187.41 280.5 188.86 278.17 190.32C277.64 190.65 277.03 191.42 277.83 191.83C278.63 192.24 279.85 191.9 280.57 191.47C281.8 190.73 283.04 189.99 284.3 189.31C284.61 189.14 284.92 188.98 285.23 188.82C285.57 188.64 285.11 188.88 285.48 188.69C285.62 188.62 285.77 188.55 285.91 188.48C286.57 188.16 287.24 187.86 287.92 187.58L285.96 186.21C284.48 187.11 282.99 188 281.51 188.9C280.77 189.35 280.03 189.8 279.28 190.24C278.94 190.45 278.59 190.65 278.25 190.86C278.08 190.96 277.91 191.07 277.74 191.17C277.63 191.24 277.51 191.31 277.4 191.38C277.18 191.51 277.17 191.52 277.37 191.4L278.4 191.12L278.25 191.14L279.17 191.16L279.03 191.11L279.64 191.4C279.72 191.48 279.55 191.5 279.67 191.41C279.71 191.38 279.7 191.35 279.78 191.25C279.87 191.15 279.95 191.03 280.04 190.92C280.06 190.9 280.24 190.68 280.18 190.75C280.35 190.56 280.53 190.39 280.72 190.23C280.83 190.14 280.93 190.05 281.04 189.96C281.3 189.75 280.93 190.03 281.23 189.82C281.74 189.48 282.39 188.73 281.57 188.31C280.8 187.92 279.52 188.21 278.83 188.67L278.82 188.69Z" fill="#50FB60"/>
<path d="M297.07 195.38C293.44 197.11 289.41 199.11 287.44 202.82C286.78 204.06 288.8 204.04 289.5 203.83C291.85 203.12 293.94 201.91 295.99 200.59C296.91 200 297.83 199.4 298.78 198.86C298.89 198.8 299 198.74 299.11 198.68C299.15 198.66 299.56 198.45 299.39 198.53C299.24 198.6 299.56 198.45 299.59 198.44C299.7 198.39 299.81 198.34 299.93 198.29C300.18 198.18 300.44 198.08 300.7 197.98C301.06 197.84 300.59 198 300.81 197.94C300.96 197.9 301.11 197.85 301.26 197.81L299.2 196.8C297.91 198.5 296.14 199.38 294.19 200.41C293.22 200.93 292.24 201.44 291.31 202.03C290.2 202.74 289.07 203.58 288.67 204.89C288.47 205.54 289.44 205.72 289.85 205.74C291.88 205.83 293.81 205.16 295.59 204.22C297.12 203.42 298.63 202.48 299.99 201.42C301.26 200.43 302.35 199.17 302.9 197.64C303.13 196.99 303.4 196.01 302.92 195.41C302.09 194.39 300.23 194.93 299.31 195.46C298.92 195.68 298.25 196.32 298.71 196.79C299.35 197.44 299.47 198.36 299.26 199.23C299.01 200.22 298.28 200.95 297.51 201.57C297.12 201.88 296.82 202.1 296.33 202.41C296.1 202.56 295.87 202.7 295.64 202.83C295.52 202.9 295.4 202.96 295.29 203.03C294.72 203.34 295.43 202.97 295.09 203.13C294.85 203.25 294.6 203.35 294.35 203.45C294.24 203.49 293.92 203.61 294.19 203.52C294.06 203.56 293.94 203.6 293.81 203.64C293.68 203.68 293.55 203.71 293.42 203.74C293.29 203.77 293.14 203.79 293.36 203.75C293 203.8 292.83 203.82 292.65 203.83C291.78 203.85 290.61 204.1 290.1 204.88C289.59 205.66 290.51 206.03 291.15 206.02C294.62 205.94 297.76 204.43 300.46 202.32C301.59 201.44 302.65 200.31 303.08 198.9C303.46 197.65 303.23 196.22 302.3 195.27L301.7 196.6L301.82 196.53L300.36 197.03H300.5C300.19 197.01 299.89 197 299.58 197C299.3 196.76 299.2 196.76 299.3 197.02C299.29 197.11 299.27 197.21 299.26 197.3C299.22 197.55 299.15 197.8 299.07 198.04C298.92 198.49 298.68 198.9 298.41 199.28C297.85 200.07 297.08 200.69 296.3 201.21C295.36 201.84 294.38 202.44 293.39 202.97C293.19 203.08 293.17 203.09 292.87 203.22C292.74 203.28 292.61 203.33 292.48 203.38C292.25 203.47 292.22 203.48 292.39 203.41C292.26 203.45 292.12 203.49 291.99 203.52C292.18 203.49 292.15 203.49 291.9 203.53C291.67 203.55 291.63 203.56 291.77 203.55C291.63 203.55 291.49 203.55 291.35 203.54L292.53 204.39C292.81 203.49 293.68 203.15 294.49 202.68C295.44 202.12 296.43 201.63 297.4 201.1C299.43 200 301.39 198.72 302.8 196.86C303.08 196.49 302.93 196.08 302.54 195.88C302.02 195.61 301.29 195.7 300.74 195.85C298.38 196.5 296.28 197.7 294.23 199.01C293.31 199.6 292.39 200.21 291.44 200.75C291.2 200.89 290.95 201.02 290.7 201.16C290.42 201.31 290.92 201.05 290.64 201.19C290.53 201.24 290.42 201.3 290.3 201.35C290.05 201.47 289.79 201.58 289.53 201.68C289.49 201.7 289.02 201.87 289.26 201.79C289.5 201.71 288.97 201.88 288.98 201.88L291.04 202.89C291.43 202.16 291.93 201.42 292.47 200.86C292.76 200.56 293.07 200.28 293.39 200.01C293.53 199.89 293.67 199.78 293.81 199.67C293.91 199.6 294 199.52 294.1 199.45C294 199.53 294.03 199.51 294.19 199.39C294.9 198.91 295.63 198.46 296.39 198.05C296.61 197.93 296.83 197.82 297.04 197.7C297.42 197.5 296.91 197.76 297.26 197.59C297.7 197.38 298.14 197.16 298.58 196.95C299.05 196.72 300.2 196.06 299.61 195.4C299.06 194.79 297.67 195.07 297.05 195.36L297.07 195.38Z" fill="#50FB60"/>
<path d="M314.28 208.24L314.45 207.53C314.66 206.67 313.25 206.65 312.78 206.7C308.55 207.13 304.5 209.29 301.97 212.72C301.79 212.96 301.77 213.29 301.97 213.52C302.95 214.6 304.88 213.96 305.99 213.46C307.1 212.96 308.11 212.41 309.16 211.87C309.84 211.52 310.91 211 311.85 210.64C312.48 210.4 313.37 210.19 314.01 210.17L313.56 208.5C312.85 208.96 312.31 209.2 311.42 209.53C311.23 209.6 311.03 209.67 310.84 209.74C311.14 209.63 310.54 209.84 310.46 209.87C309.93 210.05 309.4 210.22 308.88 210.41C307.21 211 305.52 211.79 304.22 213.02C303.67 213.54 302.65 214.48 302.95 215.34C303.27 216.29 304.76 216.25 305.54 216.15C307.58 215.89 309.62 214.88 311.4 213.9C312.28 213.42 313.12 212.88 313.96 212.32C314.36 212.05 314.76 211.78 315.16 211.5C315.39 211.34 315.61 211.18 315.84 211.03C315.92 210.97 316.01 210.91 316.09 210.85C316.39 210.64 316.58 210.69 315.86 210.86L314.42 210.94C314.18 210.9 314.05 210.79 314.04 210.62C314.01 210.76 314 210.79 314 210.72C314.04 210.68 314.09 210.64 314.15 210.62C314.04 210.7 313.93 210.77 313.82 210.84C313.76 210.88 313.18 211.21 313.39 211.1C313.16 211.22 312.91 211.32 312.66 211.42C312.01 211.68 311.01 211.9 310.19 212.03C309.08 212.2 307.97 212.31 306.91 212.71C305.93 213.08 304.66 213.81 304.42 214.94C304.09 216.49 306.51 216.48 307.45 216.41C308.75 216.31 310.01 215.88 311.2 215.37C313.4 214.44 315.43 213.14 317.21 211.55C317.81 211.01 317.62 210.35 316.84 210.18C315.95 209.99 314.78 210.31 314.11 210.91C313.59 211.38 313.05 211.82 312.51 212.2C312.17 212.44 311.82 212.66 311.46 212.87C311.34 212.94 311.22 213.01 311.1 213.08C310.98 213.15 310.86 213.21 310.74 213.28C310.53 213.39 310.49 213.41 310.62 213.34C310.31 213.5 309.99 213.64 309.68 213.77C309.29 213.94 308.98 214.06 308.77 214.12C308.63 214.16 308.48 214.21 308.34 214.23C308.66 214.17 308.03 214.26 308.26 214.23C308.13 214.25 307.78 214.14 308.26 214.33C309.17 214.69 307.14 214.15 308.36 214.3L308.3 214.35C308.45 214.22 308.45 214.22 308.3 214.33L308.14 214.41C308.35 214.32 308.34 214.33 308.09 214.41C308.2 214.38 308.3 214.35 308.41 214.33C307.94 214.46 308.45 214.33 308.54 214.31C309.42 214.18 310.3 214.06 311.17 213.88C312.81 213.55 314.41 213.01 315.87 212.18C316.53 211.8 317.28 211.35 317.66 210.67C318.12 209.86 317.89 209.09 316.93 208.86C314.94 208.39 313.23 210.03 311.71 211.05C310.44 211.91 309.06 212.76 307.85 213.31C307.14 213.63 306.66 213.81 306.14 213.95C306 213.99 305.77 214 305.64 214.08C306.13 213.78 306.3 214.08 306.71 214.15C306.87 214.18 306.69 214.34 306.92 214.05C307.01 213.94 307.06 213.88 307.16 213.78C307.29 213.65 307.43 213.53 307.57 213.41C307.75 213.26 307.82 213.21 307.88 213.17C308.01 213.08 308.14 213 308.27 212.92C308.33 212.89 308.94 212.56 308.66 212.7C309 212.54 309.34 212.39 309.69 212.25C309.86 212.18 310.04 212.12 310.21 212.05C310.22 212.05 310.79 211.85 310.47 211.96C312.35 211.31 314.26 210.74 315.94 209.64C316.28 209.42 316.8 209.03 316.67 208.55C316.54 208.07 315.88 207.96 315.49 207.97C313.22 208.03 311.06 208.64 309.01 209.59C308.06 210.03 307.13 210.51 306.2 210.99C305.72 211.24 305.66 211.27 305.18 211.51C304.94 211.63 304.69 211.74 304.45 211.86C304.33 211.92 304.2 211.97 304.08 212.02C304.54 211.84 305.03 211.83 305.55 212V212.8C306 212.2 306.48 211.66 307.04 211.16C307.64 210.63 307.99 210.37 308.71 209.95C308.77 209.91 309.19 209.68 309.06 209.75C308.95 209.8 308.99 209.78 309.17 209.69C309.28 209.64 309.39 209.59 309.51 209.54C309.68 209.47 309.85 209.39 310.02 209.33C310.1 209.3 310.62 209.13 310.21 209.25C310.56 209.14 310.92 209.05 311.28 208.96C311.74 208.85 311.05 208.98 311.48 208.92C311.73 208.89 311.97 208.85 312.22 208.83L310.55 208L310.38 208.71C310.04 210.12 313.92 209.55 314.24 208.23L314.28 208.24Z" fill="#50FB60"/>
<path d="M280.03 219.35C277.73 220.23 275.59 221.58 273.83 223.29C273.46 223.65 273.21 224.27 273.84 224.54C275.98 225.45 278.2 223.91 280.04 222.96C280.41 222.77 280.78 222.58 281.15 222.39C281.35 222.29 281.55 222.18 281.75 222.08C281.75 222.08 282.31 221.8 281.98 221.96C282.17 221.87 282.36 221.77 282.56 221.69C282.65 221.65 283.24 221.45 282.82 221.57C282.88 221.55 283.44 221.43 282.99 221.51C283.21 221.49 283.22 221.48 283.03 221.51C282.89 221.48 282.92 221.48 283.12 221.52L283.1 219.9C282.28 220.39 281.46 220.85 280.62 221.29C280.56 221.32 279.94 221.64 280.21 221.5C279.98 221.61 279.76 221.73 279.53 221.84C279.1 222.05 278.67 222.25 278.24 222.44C276.56 223.19 274.54 223.8 273.51 225.45C273.36 225.68 273.28 226.03 273.51 226.25C274.48 227.14 275.9 227.03 277.1 226.77C278.17 226.53 279.2 226.03 280.18 225.56C281.16 225.09 282.21 224.53 283.19 223.96C283.41 223.83 283.64 223.7 283.86 223.58C283.99 223.51 284.06 223.48 283.88 223.56C283.98 223.51 284.09 223.46 284.19 223.42C284.29 223.38 284.4 223.33 284.5 223.29L284.31 223.36C284.5 223.31 284.52 223.3 284.37 223.34C284.04 223.41 284.63 223.33 284.35 223.34C284.12 223.35 284.61 223.36 284.6 223.36L283.55 222.22C283.51 222.27 283.27 222.58 283.37 222.46C283.47 222.34 283.24 222.58 283.2 222.62C283.08 222.73 282.86 222.88 283.14 222.69C283.02 222.77 282.91 222.84 282.79 222.91C282.4 223.15 283.05 222.81 282.75 222.94C282.64 222.99 282.53 223.04 282.42 223.09C282.29 223.14 282.15 223.19 282.02 223.24C281.82 223.32 282.24 223.17 282.23 223.17C282.13 223.17 282.02 223.24 281.93 223.27C280.7 223.65 279.45 223.93 278.25 224.41C277.41 224.75 274.29 226.19 275.29 227.43C275.83 228.1 277 228.07 277.77 227.95C278.75 227.8 279.7 227.38 280.62 227C282.47 226.24 284.26 225.33 285.98 224.32C286.52 224 287.11 223.22 286.32 222.81C285.53 222.4 284.31 222.74 283.58 223.17C283 223.51 282.41 223.84 281.82 224.15C281.77 224.18 281.32 224.41 281.6 224.26C281.44 224.34 281.27 224.42 281.11 224.5C280.81 224.65 280.5 224.79 280.19 224.93C279.58 225.21 278.95 225.47 278.33 225.71C278.19 225.77 278.04 225.82 277.9 225.87C277.45 226.05 278.2 225.82 278.24 225.81C278.08 225.83 278.08 225.83 278.24 225.81C278.44 225.78 278.64 225.81 278.84 225.89C278.92 225.95 279 226.14 278.95 225.94L278.57 226.77C278.71 226.62 278.86 226.49 279.02 226.35C279.25 226.15 278.84 226.43 279.02 226.35C279.11 226.31 279.2 226.24 279.28 226.19C279.3 226.19 279.49 226.07 279.49 226.07C279.49 226.07 279.11 226.24 279.44 226.1C279.63 226.02 279.82 225.94 280.02 225.86C280.23 225.78 280.3 225.88 279.93 225.89C280 225.89 280.1 225.83 280.17 225.81C280.37 225.75 280.58 225.69 280.78 225.63C281.19 225.51 281.61 225.4 282.02 225.29C283.95 224.74 285.95 223.96 287.15 222.26C287.69 221.49 286.68 221.17 286.1 221.12C283.77 220.92 281.82 222.2 279.89 223.27C279.07 223.72 278.58 223.97 277.59 224.4C277.36 224.5 277.12 224.6 276.89 224.7C276.8 224.74 276.71 224.77 276.62 224.8C276.89 224.71 276.92 224.69 276.7 224.76C276.99 224.71 277.02 224.7 276.8 224.74C276.92 224.72 277.05 224.73 277.17 224.76C276.9 224.74 277.29 224.9 277.08 224.7V225.5C277.12 225.44 277.44 225.07 277.3 225.2C277.37 225.13 277.65 224.92 277.41 225.09C277.58 224.98 277.75 224.88 277.93 224.78C277.54 224.98 277.96 224.78 278.05 224.74C278.84 224.39 279.65 224.06 280.43 223.69C282.15 222.88 283.84 222 285.47 221.02C285.8 220.83 286.22 220.49 286.2 220.07C286.18 219.65 285.82 219.47 285.45 219.4C283.3 219.02 281.36 219.87 279.49 220.83C278.75 221.21 278 221.59 277.26 221.97C276.92 222.15 276.57 222.32 276.23 222.5C276.18 222.53 275.7 222.76 276 222.62C275.9 222.67 275.79 222.72 275.68 222.76C276.06 222.6 276.46 222.56 276.87 222.65V223.9C277.25 223.54 277.63 223.2 278.03 222.88C278.12 222.81 278.21 222.74 278.3 222.67L278.44 222.57C278.34 222.64 278.34 222.64 278.44 222.57C278.65 222.42 278.86 222.28 279.08 222.14C279.27 222.02 279.47 221.9 279.66 221.79C279.78 221.72 279.91 221.65 280.03 221.58C280.06 221.56 280.37 221.4 280.19 221.49C279.98 221.6 280.39 221.39 280.43 221.37C280.53 221.32 280.64 221.27 280.74 221.23C281 221.11 281.26 221.01 281.53 220.91C282.03 220.72 283.13 220 282.56 219.36C281.99 218.72 280.65 219.07 280 219.32L280.03 219.35Z" fill="#50FB60"/>
<path d="M264.39 206.09C261.97 207.25 259.87 209 258.57 211.38C258.26 211.95 258.6 212.34 259.19 212.47C259.95 212.64 260.93 212.42 261.57 211.99C262.84 211.15 264.09 210.29 265.39 209.49C265.68 209.31 265.97 209.14 266.26 208.97C266.41 208.89 266.55 208.81 266.7 208.73C266.47 208.85 266.99 208.59 266.98 208.59C267.28 208.45 267.59 208.32 267.9 208.21C267.54 208.33 268.14 208.15 268.16 208.14C268.35 208.09 268.55 208.04 268.75 208L266.69 206.99C266.64 207.06 266.35 207.41 266.46 207.28C266.31 207.44 266.15 207.6 265.98 207.74C265.83 207.87 265.68 208 265.52 208.12C265.47 208.16 265.19 208.36 265.45 208.18C265.37 208.24 265.29 208.3 265.2 208.35C264.49 208.84 263.74 209.26 263 209.72C261.47 210.67 259.88 211.79 259.07 213.46C258.83 213.95 258.96 214.3 259.51 214.49C260.21 214.73 260.97 214.52 261.63 214.29C263.49 213.65 265.2 212.66 266.91 211.69C267.32 211.46 267.74 211.22 268.15 211C268.32 210.91 268.48 210.82 268.65 210.73C268.85 210.63 268.87 210.61 268.72 210.69C268.83 210.63 268.95 210.58 269.06 210.52C269.46 210.33 269.86 210.15 270.27 209.99C270.39 209.94 270.5 209.9 270.62 209.86C270.41 209.93 270.42 209.92 270.65 209.86C270.89 209.79 271.13 209.72 271.38 209.65L269.32 208.64C269.13 209.01 268.99 209.18 268.72 209.4C268.93 209.23 268.53 209.53 268.51 209.54C268.36 209.63 268.21 209.72 268.06 209.8C267.28 210.24 266.48 210.65 265.7 211.09C264.07 212.02 262.47 213.01 260.91 214.05C260.67 214.21 259.94 214.73 260.18 215.14C260.81 216.25 262.13 216.36 263.3 216.17C264.59 215.96 265.78 215.4 266.95 214.84C269.24 213.74 271.39 212.44 273.44 210.93C274.11 210.44 273.79 209.72 273.07 209.56C272.11 209.35 271.1 209.74 270.34 210.29C269.06 211.23 267.56 212.13 266.11 212.9C265.66 213.14 264.77 213.55 264.1 213.84C263.91 213.92 263.71 214 263.52 214.08C263.12 214.26 263.87 214.01 263.46 214.09C263.7 214.04 263.84 214.06 264.08 214.09C264.18 214.1 264 213.99 264.06 214.09L263.33 215.18C265.01 214.06 266.73 212.99 268.5 212.01C270.05 211.14 272.09 210.38 272.95 208.71C273.6 207.45 271.6 207.52 270.89 207.7C268.81 208.24 266.91 209.2 265.04 210.24C263.17 211.28 262.03 212.02 260.14 212.67L262.7 213.5C262.88 213.13 263.1 212.78 263.36 212.46C263.54 212.23 263.38 212.41 263.59 212.2C263.75 212.05 263.91 211.9 264.07 211.76C264.22 211.63 264.37 211.51 264.53 211.4C264.27 211.59 264.75 211.26 264.85 211.19C265.21 210.95 265.58 210.73 265.94 210.51C267.54 209.54 269.15 208.54 270.3 207.03C270.58 206.66 270.43 206.25 270.04 206.05C269.49 205.77 268.81 205.9 268.24 206.02C264.86 206.72 262.01 208.92 259.18 210.78L262.18 211.39C262.65 210.54 263.21 209.73 263.89 209.08C264.06 208.91 264.24 208.75 264.43 208.59C264.52 208.51 264.62 208.44 264.71 208.36C264.74 208.33 264.93 208.19 264.8 208.29C265.02 208.13 265.25 207.99 265.49 207.85C265.59 207.79 265.7 207.73 265.81 207.67C266.1 207.51 265.42 207.85 265.94 207.6C266.41 207.37 267.56 206.71 266.97 206.05C266.42 205.44 265.03 205.72 264.41 206.01L264.39 206.09Z" fill="#50FB60"/>
<path d="M267.6 208.99L267.96 209.71C268 209.86 268.09 209.97 268.23 210.04C268.37 210.15 268.53 210.22 268.71 210.24C268.93 210.29 269.16 210.3 269.39 210.27C269.65 210.27 269.91 210.23 270.16 210.15L270.66 209.98C270.95 209.86 271.21 209.7 271.45 209.5L271.7 209.22C271.83 209.05 271.87 208.87 271.83 208.66L271.47 207.94C271.43 207.79 271.34 207.68 271.2 207.61C271.06 207.5 270.9 207.43 270.72 207.41C270.5 207.36 270.27 207.35 270.04 207.38C269.78 207.38 269.52 207.42 269.27 207.5L268.77 207.67C268.48 207.79 268.22 207.95 267.98 208.15L267.73 208.43C267.6 208.6 267.56 208.78 267.6 208.99Z" fill="#50FB60"/>
<path d="M283.34 112.87C284.17 83.7498 285 54.6399 285.83 25.5198C286.06 17.3098 286.3 9.09985 286.53 0.879849C286.58 -0.700151 282.7 0.0798488 282.67 1.35985C281.84 30.4798 281.01 59.5898 280.18 88.7098C279.95 96.9198 279.71 105.13 279.48 113.35C279.43 114.93 283.31 114.15 283.34 112.87Z" fill="#50FB60"/>
<path d="M297.31 104.99C300.11 95.67 303.29 86.47 306.86 77.41C307.19 76.58 305.61 76.54 305.19 76.58C304.37 76.67 303.32 77.06 302.99 77.89C299.42 86.95 296.24 96.15 293.44 105.47C293.03 106.82 296.91 106.3 297.3 104.99H297.31Z" fill="#50FB60"/>
<path d="M413.43 203.57C442.04 196.76 470.84 190.75 499.79 185.58C508.04 184.1 516.31 182.7 524.58 181.35C525.25 181.24 526.67 180.89 526.78 180.04C526.89 179.19 525.67 179.12 525.11 179.21C495.73 183.98 466.49 189.58 437.43 196.01C429.25 197.82 421.08 199.7 412.92 201.64C412.35 201.77 411.04 202.33 411.25 203.12C411.46 203.91 412.91 203.69 413.44 203.57H413.43Z" fill="#50FB60"/>
<path d="M504.33 218.24C510.35 219.3 516.38 220.36 522.4 221.42C523.31 221.58 524.44 221.32 525.13 220.69C525.71 220.16 525.59 219.47 524.76 219.32C518.74 218.26 512.71 217.2 506.69 216.14C505.78 215.98 504.65 216.24 503.96 216.87C503.38 217.4 503.5 218.09 504.33 218.24Z" fill="#50FB60"/>
<path d="M139.81 286.88C123.81 293.25 107.81 299.61 91.8005 305.98C91.2605 306.2 90.2505 306.85 90.7705 307.53C91.2905 308.21 92.7405 307.8 93.3305 307.57C109.33 301.2 125.33 294.84 141.34 288.47C141.88 288.25 142.89 287.6 142.37 286.92C141.85 286.24 140.4 286.65 139.81 286.88Z" fill="#50FB60"/>
<path d="M149.58 236.76C121.29 239.33 92.9901 241.91 64.7001 244.48C56.7601 245.2 48.8201 245.92 40.8701 246.65C40.2101 246.71 38.7801 247.15 38.6701 247.96C38.5601 248.83 39.7801 248.84 40.3401 248.79C68.6301 246.22 96.9301 243.64 125.22 241.07C133.16 240.35 141.1 239.63 149.05 238.9C149.71 238.84 151.14 238.4 151.25 237.59C151.36 236.72 150.14 236.71 149.58 236.76Z" fill="#50FB60"/>
<path d="M182.06 173.1C174.58 169.41 167.1 165.72 159.61 162.03C158.8 161.63 157.6 161.93 156.87 162.39C156.35 162.72 155.7 163.49 156.53 163.9C164.01 167.59 171.49 171.28 178.98 174.97C179.79 175.37 180.99 175.07 181.72 174.61C182.24 174.28 182.89 173.51 182.06 173.1Z" fill="#50FB60"/>
<path d="M207.49 348.79C179.26 361.79 151.03 374.78 122.8 387.78C128.27 391.87 133.74 395.96 139.2 400.05C131.02 405.63 122.84 411.22 114.66 416.8C101.5 425.78 88.2801 434.82 76.6201 445.68C110.1 433.72 143.83 421.64 174.36 403.42C165.25 399.87 156.48 395.44 148.21 390.2C167.78 376.67 187.36 363.14 206.93 349.6" fill="#50FB60"/>
<path d="M206.73 347.99C184.69 358.14 162.65 368.28 140.61 378.43C134.42 381.28 128.23 384.13 122.04 386.98C121.7 387.14 120.28 387.99 121.01 388.53C126.48 392.62 131.95 396.71 137.41 400.8L138.01 399.47C129.32 405.4 120.63 411.33 111.94 417.27C103.77 422.85 95.6099 428.47 87.8099 434.56C83.4199 437.99 79.1599 441.57 75.0799 445.35C74.6399 445.76 74.5199 446.27 75.0899 446.6C75.7499 446.98 76.7399 446.69 77.3899 446.46C103.62 437.09 129.93 427.68 154.89 415.23C161.91 411.73 168.82 408 175.56 403.98C176.03 403.7 176.78 402.82 175.9 402.47C166.78 398.9 158.03 394.48 149.75 389.25L149.41 390.76C164.67 380.21 179.93 369.66 195.2 359.11C199.51 356.13 203.82 353.15 208.14 350.17C208.69 349.79 209.25 349.13 208.48 348.66C207.77 348.23 206.37 348.59 205.74 349.02C190.48 359.57 175.22 370.12 159.95 380.67C155.64 383.65 151.33 386.63 147.01 389.61C146.45 390 145.89 390.63 146.67 391.12C154.95 396.34 163.7 400.77 172.82 404.34L173.16 402.83C149.47 416.95 123.85 427.36 98.0299 436.87C90.6599 439.59 83.2499 442.23 75.8499 444.87L78.1599 445.98C92.6499 432.52 109.39 421.77 125.67 410.66C130.58 407.31 135.49 403.96 140.39 400.61C140.68 400.41 141.54 399.69 140.99 399.28C135.52 395.19 130.05 391.1 124.59 387.01L123.56 388.56C145.6 378.41 167.64 368.27 189.68 358.12L208.25 349.57C208.78 349.33 209.81 348.71 209.28 348.02C208.79 347.38 207.29 347.72 206.72 347.98L206.73 347.99Z" fill="#50FB60"/>
<path d="M561.551 311.11C533.921 291.78 505.471 273.61 476.321 256.66C475.871 263.01 475.421 269.36 474.981 275.72C449.431 266.74 423.771 257.74 397.221 252.41C426.081 274.12 456.031 294.37 486.921 313.06C487.111 301.77 487.301 290.48 487.491 279.2C510.741 291.14 534.831 301.43 559.531 309.97" fill="#50FB60"/>
<path d="M563.341 310.36C541.741 295.26 519.651 280.84 497.121 267.17C490.741 263.3 484.31 259.48 477.86 255.73C477.08 255.28 474.471 255.75 474.391 256.91C473.941 263.26 473.49 269.61 473.05 275.97L476.521 274.79C456.521 267.77 436.491 260.73 415.961 255.41C410.151 253.91 404.291 252.55 398.411 251.36C397.641 251.21 396.691 251.42 396.031 251.84C395.711 252.05 394.891 252.76 395.431 253.17C418.021 270.15 441.27 286.26 465.11 301.42C471.82 305.69 478.581 309.88 485.391 314C486.131 314.45 488.84 313.97 488.86 312.82C489.05 301.53 489.241 290.24 489.431 278.96L485.961 280.14C504.071 289.43 522.681 297.74 541.701 304.99C547.101 307.05 552.541 309.02 558.001 310.91C558.881 311.22 559.951 311.05 560.741 310.55C561.171 310.27 561.991 309.36 561.081 309.04C541.851 302.38 522.981 294.68 504.591 285.95C499.371 283.47 494.191 280.91 489.041 278.27C488.281 277.88 485.591 278.26 485.571 279.45C485.381 290.74 485.191 302.03 485.001 313.31L488.471 312.13C464.471 297.6 441.041 282.15 418.251 265.79C411.791 261.15 405.381 256.44 399.021 251.66L396.041 253.46C416.671 257.62 436.761 263.96 456.641 270.8C462.251 272.73 467.851 274.69 473.451 276.66C474.271 276.95 476.831 276.75 476.921 275.48C477.371 269.13 477.821 262.78 478.261 256.42L474.791 257.6C497.411 270.76 519.621 284.65 541.341 299.25C547.521 303.4 553.661 307.61 559.761 311.87C560.501 312.39 561.521 312.25 562.321 311.91C562.651 311.77 564.09 310.87 563.35 310.36H563.341Z" fill="#50FB60"/>
<path d="M590.41 637.78C606.96 627.96 623.42 617.98 639.78 607.85C656.21 597.68 672.54 587.35 688.78 576.86C697.89 570.98 706.97 565.05 716.02 559.07C716.58 558.7 717.12 558.03 716.36 557.56C715.64 557.12 714.26 557.5 713.62 557.92C697.56 568.53 681.41 578.99 665.16 589.29C648.91 599.59 632.42 609.83 615.91 619.87C606.64 625.5 597.35 631.09 588.02 636.62C587.43 636.97 586.94 637.67 587.68 638.13C588.42 638.59 589.74 638.17 590.42 637.77L590.41 637.78Z" fill="#50FB60"/>
<path d="M728.3 552.74C731.28 551.12 734.25 549.49 737.23 547.87C737.76 547.58 738.38 546.73 737.57 546.36C736.71 545.97 735.61 546.3 734.83 546.72C731.85 548.34 728.88 549.97 725.9 551.59C725.37 551.88 724.75 552.73 725.56 553.1C726.42 553.49 727.52 553.16 728.3 552.74Z" fill="#50FB60"/>
<path d="M747.75 544.02C751.54 542.4 755.33 540.77 759.12 539.15C759.61 538.94 760.73 538.25 760.15 537.6C759.57 536.95 758.23 537.29 757.59 537.56C753.8 539.18 750.01 540.81 746.22 542.43C745.73 542.64 744.61 543.33 745.19 543.98C745.77 544.63 747.11 544.29 747.75 544.02Z" fill="#50FB60"/>
<path d="M352.14 601.79C346.75 629.81 341.36 657.85 337.56 686.13C335.68 700.08 334.2 714.09 333.3 728.14C332.45 741.37 331.39 755.12 333.03 768.32C334.41 779.38 338.86 790.63 348.35 797.16C357.84 803.69 370.59 802.16 381.31 798.49C402.91 791.09 423.29 779.11 441.14 764.97C478.62 735.27 505.28 693.42 516.32 646.88C519.2 634.76 521.02 622.39 521.74 609.96C522.09 603.93 522.18 597.89 522.02 591.86C521.89 586.88 521.71 581.65 519.64 577.03C517.78 572.87 514.34 569.91 509.68 569.55C504.4 569.14 499.3 571.8 495.34 575.08C487.68 581.41 482.62 590.45 480.19 600C475.15 619.78 479.83 643.94 493.19 659.61C509.15 678.32 535.96 676.72 556.81 668.24C568.43 663.51 579.28 656.94 590.01 650.48C600.72 644.03 611.27 637.32 621.74 630.49C642.6 616.89 663.15 602.82 684.13 589.41C704.92 576.12 726.15 563.44 748.38 552.71C759.4 547.39 770.65 542.55 782.15 538.36C791.64 534.9 802.54 530.32 812.85 532.57C817.63 533.61 821.65 536.61 823.17 541.4C825.02 547.22 823.17 553.81 821.39 559.43C817.7 571.13 811.17 581.71 803.6 591.29C789.64 608.96 772.45 624.15 755.11 638.4C721.15 666.31 684.15 690.68 652.75 721.63C637.49 736.67 623.33 753.39 612.84 772.15C608.6 779.72 604.7 790.12 607.95 798.74C612.07 809.68 625.88 809.22 635.54 808.98C648.37 808.66 661 806.31 673.14 802.17C673.73 801.97 674.64 801.3 674.17 800.62C673.7 799.94 672.18 800.39 671.61 800.58C658.74 804.98 645.12 807.09 631.52 806.8C625.79 806.68 619.17 806.61 614.8 802.32C611.5 799.08 610.51 794.39 610.76 789.92C611.33 779.87 616.83 771.03 622.17 762.83C627.91 754.01 634.33 745.65 641.24 737.72C669.12 705.74 704.23 681.21 737.58 655.4C754.37 642.41 770.92 629.03 786.16 614.22C802.01 598.8 817.74 581.45 824.86 560.09C827.86 551.07 830.64 538.57 820.9 532.65C813.6 528.21 803.52 529.64 795.71 531.74C784.73 534.69 773.96 539.09 763.52 543.54C752.63 548.18 741.97 553.35 731.51 558.89C689.29 581.2 650.58 609.35 610.46 635.09C600.42 641.53 590.29 647.83 580 653.86C569.16 660.2 558.05 666.51 545.88 669.91C534.44 673.11 521.76 673.44 510.72 668.58C500.17 663.94 492.94 654.79 488.39 644.44C480.43 626.29 479.03 603.13 489.77 585.76C494.29 578.44 507.19 564.62 514.72 576.16C517.24 580.02 517.8 585.03 518.01 589.52C518.32 595.93 518.26 602.36 517.94 608.77C515.56 656.24 497.09 702.41 465.69 738.12C450.95 754.88 433.52 769.27 414.31 780.63C404.6 786.38 394.41 791.36 383.88 795.42C372.33 799.87 359.18 802.42 349.06 793.46C340.1 785.53 337.06 773.51 336.38 762C335.58 748.56 336.54 734.86 337.56 721.45C339.64 694.13 343.83 667.03 348.67 640.08C351 627.14 353.48 614.23 355.96 601.32C356.24 599.86 352.35 600.48 352.1 601.8L352.14 601.79Z" fill="white"/>
<path d="M384.06 397.36C375.61 393.44 366.5 391.65 357.28 390.73C348.06 389.81 339.51 389.46 330.63 389.65C313.68 390.01 296.38 392.77 281.37 401.03C277.84 402.97 273.98 405.18 271.14 408.08C268.47 410.81 267.67 414.39 270.02 417.59C272.37 420.79 276.09 422.24 279.62 423.36C284.1 424.79 288.74 425.64 293.41 426.14C302.76 427.14 312.2 426.71 321.57 426.29C330.25 425.9 338.95 425.37 347.52 423.93C356.09 422.49 364.49 420.22 372.24 416.33C375.95 414.47 379.77 412.33 382.85 409.52C385.49 407.11 387.85 403.27 386.09 399.67C385.31 398.06 383.99 397.12 382.31 396.62C381.47 396.37 380.2 396.75 379.58 397.35C378.96 397.95 379.16 398.48 379.95 398.72C383.71 399.83 383.12 404.73 381.31 407.19C379.09 410.21 375.32 412.25 372.1 414.02C365.34 417.71 357.85 419.98 350.31 421.4C342.77 422.82 334.42 423.54 326.42 423.95C317.92 424.39 309.36 424.83 300.85 424.41C296.43 424.2 292.03 423.71 287.71 422.78C283.91 421.96 279.88 420.97 276.59 418.82C273.91 417.07 271.42 413.99 272.89 410.64C273.65 408.91 275.3 407.66 276.78 406.58C278.26 405.5 279.88 404.44 281.5 403.47C294.74 395.52 310.36 392.59 325.62 391.94C333.64 391.6 341.67 391.87 349.68 392.41C358.26 392.99 366.93 394 375.1 396.83C377.1 397.52 379.07 398.33 380.99 399.22C381.81 399.6 382.99 399.33 383.73 398.86C384.23 398.54 384.92 397.75 384.07 397.35L384.06 397.36Z" fill="white"/>
<path d="M276.4 420.92C273.92 422.37 271.59 424.1 269.53 426.11C267.63 427.96 265.72 430.05 264.73 432.54C262.68 437.74 266.77 442.48 271.13 444.73C276.26 447.37 282.32 448.73 287.97 449.69C293.62 450.65 299.66 451.08 305.54 451.04C317.7 450.95 329.76 449.07 341.66 446.69C353.27 444.37 365.54 442.03 375.84 435.89C378.42 434.35 380.88 432.52 382.96 430.34C384.89 428.32 387.16 425.73 386.78 422.73C386.44 420 383.79 418.23 381.51 417.16C378.46 415.73 375.18 414.96 371.84 414.7C371.04 414.64 369.72 415.01 369.29 415.75C368.83 416.55 369.69 416.84 370.34 416.89C373.07 417.1 375.75 417.79 378.24 418.93C380.18 419.82 382.39 421.16 382.86 423.41C383.38 425.89 381.31 428.22 379.72 429.85C378 431.61 376.06 433.12 373.97 434.42C364.9 440.03 353.92 442.13 343.62 444.25C322.64 448.58 300.08 451.74 279.27 444.88C274.48 443.3 267.87 440.43 268.09 434.34C268.19 431.64 270.1 429.36 271.88 427.5C273.93 425.36 276.25 423.55 278.81 422.06C279.4 421.72 279.89 421.01 279.15 420.55C278.41 420.09 277.09 420.52 276.41 420.91L276.4 420.92Z" fill="white"/>
<path d="M367.47 440.1C370.16 440.32 372.81 440.95 375.3 441.97C377.31 442.79 379.54 443.8 380.91 445.57C384.06 449.64 378.54 454.73 375.56 457.06C371.92 459.9 367.59 461.75 363.28 463.31C358.28 465.12 353.14 466.56 347.95 467.74C337.46 470.12 326.69 471.27 315.95 471.55C310.54 471.69 305.12 471.61 299.71 471.35C294.3 471.09 288.96 471.01 283.83 469.74C279 468.55 274.02 465.43 272.9 460.23C271.71 454.71 275.82 449.84 279.72 446.52C280.36 445.98 280.1 445.35 279.35 445.15C278.47 444.92 277.3 445.31 276.62 445.88C272.85 449.08 268.97 453.48 268.82 458.69C268.68 463.63 272.05 467.69 276.25 469.92C281.23 472.56 287.15 472.81 292.66 473.2C298.68 473.62 304.71 473.83 310.74 473.79C322.73 473.7 334.71 472.59 346.45 470.1C352.27 468.87 358.01 467.26 363.63 465.31C368.56 463.59 373.45 461.51 377.69 458.42C381.34 455.76 387.96 449.97 385.05 444.87C383.68 442.46 380.85 441.11 378.39 440.1C375.38 438.87 372.22 438.17 368.98 437.9C368.18 437.83 366.86 438.21 366.43 438.95C365.97 439.75 366.83 440.03 367.48 440.09L367.47 440.1Z" fill="white"/>
<path d="M277.42 470.23C273.72 473.41 270.72 477.73 270.66 482.77C270.61 487.53 273.32 491.34 277.54 493.37C281.76 495.4 286.9 495.83 291.63 496.25C297.67 496.79 303.73 497 309.79 496.93C321.78 496.79 333.74 495.6 345.57 493.7C351.36 492.77 357.21 491.82 362.89 490.34C367.96 489.01 372.95 486.99 376.97 483.56C380.99 480.13 384.46 474.66 383.07 469.23C381.85 464.47 377.18 461.22 372.47 460.62C371.56 460.5 370.43 460.68 369.74 461.35C369.21 461.87 369.24 462.6 370.11 462.72C374.01 463.22 377.72 465.81 379.02 469.62C380.5 473.96 378.21 478.69 375.15 481.76C371.83 485.09 367.52 487.01 363.04 488.24C358.05 489.62 352.89 490.45 347.78 491.3C337 493.09 326.11 494.34 315.18 494.67C309.77 494.84 304.35 494.79 298.94 494.49C294.14 494.23 289.19 493.99 284.51 492.86C279.83 491.73 275.79 489.25 274.77 484.4C273.66 479.1 276.64 474.21 280.53 470.87C281.16 470.33 280.91 469.7 280.16 469.5C279.28 469.27 278.1 469.65 277.43 470.23H277.42Z" fill="white"/>
<path d="M355.15 605.07C357.79 590.8 356.72 576.17 356.06 561.77C355.4 547.37 354.62 532.21 353.21 517.48C352.41 509.14 351.39 500.82 350.07 492.55C349.86 491.25 345.98 492.15 346.21 493.59C348.53 508.12 349.89 522.77 350.85 537.45C351.81 552.13 352.66 566.7 352.93 581.31C353.08 589.43 352.77 597.57 351.29 605.56C351.02 607.03 354.91 606.4 355.15 605.08V605.07Z" fill="white"/>
<path d="M363.08 490.07C362.77 504.08 362.59 518.09 362.13 532.09C361.67 546.09 360.29 559.41 357.76 572.88C356.34 580.47 354.58 587.99 352.49 595.43C352.11 596.8 355.99 596.26 356.35 594.95C360.04 581.78 362.71 568.34 364.3 554.76C365.89 541.18 366.11 527.24 366.42 513.44C366.59 505.49 366.77 497.54 366.94 489.59C366.97 488 363.1 488.8 363.08 490.07V490.07Z" fill="white"/>
<path d="M353.03 558.76C332.43 564.53 311.39 568.59 290.12 570.88C284.76 571.46 279.39 571.92 274.01 572.28C271.36 572.45 268.71 572.6 266.06 572.72C263.71 572.82 261.01 572.55 258.8 573.49C257.9 573.87 257.04 574.47 256.65 575.41C256.26 576.35 256.5 577.54 256.6 578.56C256.89 581.33 257.14 584.1 257.35 586.88C257.76 592.27 258.04 597.67 258.17 603.07C258.47 615.42 258.02 627.78 256.86 640.08C256.74 641.33 258.93 640.93 259.55 640.63C282.42 629.66 306.12 620.43 330.4 613.12C337.3 611.04 344.25 609.12 351.23 607.34C351.79 607.2 353.12 606.65 352.9 605.86C352.68 605.07 351.24 605.28 350.71 605.41C325.79 611.75 301.35 620.01 277.71 630.12C271.08 632.95 264.52 635.93 258.02 639.05L260.71 639.6C261.7 629.15 262.16 618.67 262.11 608.18C262.06 597.59 261.26 587.1 260.35 576.56C260.31 576.07 260.51 575.49 260.45 575.05C260.47 575.22 259.81 575.09 260.46 575.09C260.68 575.09 260.95 575.06 261.16 575.06C262.45 575.01 263.73 574.96 265.02 574.91C267.67 574.79 270.33 574.65 272.98 574.47C278.2 574.13 283.41 573.69 288.61 573.14C298.85 572.06 309.05 570.58 319.17 568.69C330.73 566.54 342.2 563.88 353.53 560.7C354.09 560.54 355.42 560.02 355.2 559.22C354.98 558.42 353.53 558.62 353.01 558.77L353.03 558.76Z" fill="white"/>
<path d="M354.62 606.36C375.61 601.21 396.81 596.99 418.17 593.72C424.22 592.8 430.28 591.95 436.35 591.17C437.15 591.07 438.58 590.6 438.55 589.58C437.85 570.6 439.11 551.57 442.26 532.84C442.47 531.59 440.12 532.01 439.57 532.29C420.87 541.63 401.21 549.02 380.97 554.24C375.24 555.72 369.46 557.03 363.65 558.16C362.98 558.29 361.57 558.61 361.45 559.47C361.33 560.33 362.56 560.41 363.12 560.3C384.24 556.2 404.92 549.92 424.71 541.47C430.25 539.11 435.71 536.57 441.1 533.88L438.41 533.33C435.23 552.25 434 571.46 434.7 590.63L436.9 589.04C415.2 591.81 393.62 595.55 372.24 600.22C366.18 601.55 360.14 602.95 354.12 604.43C353.55 604.57 352.23 605.12 352.45 605.91C352.67 606.7 354.11 606.49 354.64 606.36H354.62Z" fill="white"/>
<path d="M276.55 593.15C274.34 595.21 273.75 598.55 275.64 601.03C277.85 603.94 281.97 603.83 285.03 602.5C286.63 601.8 288.3 600.79 289.4 599.42C290.4 598.18 290.58 596.5 290.11 595C289.22 592.15 286.44 590.34 283.54 590.15C279.93 589.92 276.07 592.02 274.75 595.45C274.44 596.27 275.99 596.34 276.42 596.28C277.24 596.16 278.29 595.81 278.62 594.97C278.78 594.55 279 594.17 279.27 593.8C279.43 593.58 279.55 593.45 279.67 593.33C279.75 593.25 279.83 593.18 279.91 593.11C279.91 593.11 280.32 592.78 280.08 592.96C280.28 592.81 280.5 592.69 280.71 592.57C280.97 592.41 280.32 592.71 280.8 592.54C280.9 592.5 281.01 592.46 281.11 592.42C280.73 592.58 280.98 592.46 281.08 592.44C281.08 592.44 281.62 592.32 281.3 592.38C280.98 592.44 281.52 592.36 281.53 592.35C281.91 592.29 281.28 592.32 281.7 592.35C281.81 592.35 281.92 592.35 282.03 592.36C281.78 592.34 282.05 592.36 282.09 592.37C282.23 592.4 282.36 592.42 282.5 592.45C282.53 592.45 282.86 592.54 282.7 592.49C283.19 592.64 283.69 592.89 284.11 593.18C284.86 593.7 285.54 594.45 285.94 595.27C286.43 596.29 286.7 597.57 286.24 598.65C285.82 599.66 284.81 600.2 283.95 600.7C283.62 600.89 283.77 600.8 283.85 600.76C283.7 600.84 283.55 600.9 283.39 600.97C283.31 601 282.91 601.16 283.24 601.04C283.12 601.08 282.99 601.12 282.86 601.15C282.49 601.26 282.71 601.2 282.81 601.18C282.65 601.21 282.49 601.23 282.33 601.25C281.97 601.28 282.75 601.26 282.14 601.25C281.91 601.25 282.03 601.26 281.79 601.22C281.33 601.14 281.03 601.02 280.58 600.77C280.16 600.53 279.8 600.21 279.48 599.86C277.95 598.15 278.01 595.32 279.64 593.81C280.23 593.27 280.07 592.62 279.27 592.44C278.4 592.25 277.2 592.56 276.54 593.17L276.55 593.15Z" fill="white"/>
<path d="M286.49 571.6C287.22 566.47 287.45 561.3 287.21 556.12L284.53 557.73C302.5 557.36 320.41 554.66 337.68 549.63C342.59 548.2 347.44 546.58 352.24 544.79C352.79 544.59 353.78 543.91 353.27 543.24C352.76 542.57 351.31 542.98 350.71 543.2C334.59 549.21 317.69 553.07 300.56 554.7C295.73 555.16 290.88 555.43 286.03 555.54C285.13 555.56 283.29 555.95 283.35 557.15C283.58 562.14 283.33 567.13 282.63 572.08C282.42 573.59 286.31 572.91 286.49 571.6Z" fill="white"/>
<path d="M366.48 540.67C382.8 535.61 398.76 529.43 414.2 522.12C418.59 520.04 422.94 517.87 427.24 515.62L424.11 515.29C422.67 523.66 421.39 532.07 420.94 540.56C420.86 542.13 424.73 541.37 424.8 540.08C425.25 531.59 426.54 523.18 427.97 514.81C428.22 513.33 425.38 514.2 424.84 514.48C410.14 522.16 394.9 528.79 379.27 534.33C374.86 535.89 370.43 537.36 365.96 538.74C365.4 538.91 364.07 539.41 364.29 540.22C364.51 541.03 365.96 540.83 366.48 540.67V540.67Z" fill="white"/>
<path d="M269.69 635.2C268.47 659.61 267.1 684.02 265.57 708.42C265.13 715.39 264.68 722.36 264.22 729.33C264.12 730.89 268 730.14 268.08 728.85C269.7 704.46 271.16 680.06 272.46 655.65C272.83 648.68 273.19 641.7 273.54 634.73C273.62 633.16 269.74 633.92 269.68 635.21L269.69 635.2Z" fill="white"/>
<path d="M426.83 593.61C427.74 613.72 428.66 633.82 429.57 653.93L430.34 670.88C430.4 672.11 434.27 671.33 434.2 669.84C433.29 649.73 432.37 629.63 431.46 609.52L430.69 592.57C430.63 591.34 426.76 592.12 426.83 593.61Z" fill="white"/>
<path d="M293.54 555.29C293.03 535.15 292.08 515.01 290.67 494.91C290.58 493.66 286.7 494.47 286.81 495.95C288.21 516.05 289.17 536.18 289.68 556.33C289.71 557.54 293.58 556.79 293.54 555.29V555.29Z" fill="white"/>
<path d="M381.48 396.23C381.43 379.77 383.67 363.23 388.07 347.37C389.15 343.48 390.37 339.63 391.74 335.83C392.42 333.96 393.07 332.04 393.93 330.25C394.54 328.99 395.58 326.98 397.1 326.66C398.79 326.32 400.1 328.5 400.77 329.72C401.78 331.56 402.65 333.48 403.44 335.42C405 339.28 406.19 343.28 407.13 347.33C411.17 364.68 412.08 382.77 412.98 400.51C413.91 418.85 414.77 437.2 415.66 455.55C416.55 473.85 417.44 492.14 418.33 510.44C418.44 512.77 418.56 515.1 418.67 517.43C418.73 518.66 422.61 517.88 422.53 516.39C421.6 497.26 420.67 478.13 419.74 459C418.81 439.81 417.9 420.62 416.94 401.44C416.47 392.01 415.94 382.58 415.03 373.18C414.12 363.78 413.03 354.96 410.93 346.07C409.94 341.88 408.7 337.74 407.03 333.76C406.22 331.82 405.33 329.89 404.27 328.07C403.38 326.53 402.23 325.15 400.45 324.66C396.55 323.57 392.52 326.11 390.67 329.45C388.82 332.79 387.58 336.91 386.35 340.65C381.02 356.9 378.17 374.05 377.66 391.14C377.6 393.18 377.58 395.22 377.58 397.27C377.58 398.46 381.45 397.73 381.44 396.23H381.48Z" fill="white"/>
<path d="M308.63 170.48C288.68 171.95 269.36 179.43 253.09 190.97C244.95 196.75 237.55 203.49 231.07 211.08C224.59 218.67 218.72 227.69 220.26 237.96C220.92 242.36 223.05 246.64 226.68 249.32C230.56 252.19 235.41 253.15 240.15 253.19C245.14 253.24 250.11 252.4 254.99 251.42C259.87 250.44 265.04 249.07 269.92 247.41C289.28 240.85 307.27 229.57 321.04 214.39C328.01 206.7 334.08 196.6 331.8 185.79C329.93 176.92 321.8 170.81 312.97 170.09C310.75 169.91 308.52 170.14 306.35 170.64C305.78 170.77 304.47 171.34 304.68 172.12C304.89 172.9 306.34 172.69 306.87 172.57C314.55 170.79 323.14 175.64 326.5 182.56C331.08 192 326.74 202.73 320.75 210.39C314.76 218.05 307.33 224.48 299.54 230C291.75 235.52 283.31 240.1 274.43 243.61C265.55 247.12 256.53 249.53 247.24 250.65C242.86 251.18 238.16 251.32 233.96 249.75C229.76 248.18 226.7 245.06 225.14 240.93C221.71 231.82 225.86 222.53 231.36 215.24C236.86 207.95 243.85 201.1 251.2 195.32C265.69 183.92 283.07 175.93 301.38 173.33C303.61 173.01 305.85 172.78 308.09 172.61C308.75 172.56 310.18 172.11 310.29 171.3C310.4 170.42 309.18 170.43 308.62 170.47L308.63 170.48Z" fill="white"/>
<path d="M282.25 185.65C279.16 186.56 275.55 187.77 274.2 190.99C273.68 192.24 273.63 193.7 274.33 194.88C275.03 196.06 276.41 196.72 277.78 196.89C281.37 197.35 285.08 195.74 288.04 193.83C290.41 192.3 293.48 189.3 291.78 186.2C290.91 184.62 289.07 183.98 287.35 183.91C285.14 183.82 283.04 184.68 281.09 185.61C280.62 185.84 279.47 186.5 280.06 187.16C280.61 187.77 282 187.49 282.62 187.2C283.24 186.91 283.81 186.64 284.42 186.4C284.81 186.25 285.4 186.1 285.71 186.1C285.9 186.1 286.3 186.15 286.67 186.29C287.14 186.47 287.53 186.76 287.85 187.16C289.27 188.99 287.63 191.3 286.1 192.38C285.1 193.09 284.02 193.68 282.89 194.15C282.32 194.38 281.99 194.48 281.37 194.65C281.35 194.65 281.05 194.73 281.26 194.68C281.49 194.63 281.1 194.71 281.05 194.71C280.92 194.73 280.8 194.74 280.67 194.76C280.49 194.78 280.79 194.77 280.49 194.77C279.72 194.77 278.92 194.6 278.3 193.88C277.68 193.16 277.6 192.11 277.83 191.21C278.09 190.2 278.73 189.37 279.56 188.84C279.85 188.65 280.04 188.55 280.24 188.46C280.53 188.33 280.83 188.21 281.13 188.09C281.23 188.05 281.33 188.02 281.43 187.98C281.14 188.08 281.75 187.88 281.74 187.88C282.08 187.77 282.42 187.67 282.77 187.57C283.33 187.4 284.66 186.9 284.44 186.09C284.22 185.28 282.77 185.49 282.25 185.64V185.65Z" fill="white"/>
<path d="M295.71 194.91C292.2 195.67 288.1 197.7 286.26 200.95C285.46 202.37 285.11 204.03 286.03 205.48C286.81 206.72 288.31 207.3 289.71 207.5C293.38 208.01 297.43 206.66 300.5 204.7C303.01 203.1 306.96 199.77 305.33 196.35C304.55 194.71 302.8 193.72 301.06 193.45C298.66 193.07 296.28 193.7 294 194.43C293.43 194.61 292.13 195.09 292.33 195.91C292.52 196.69 294.02 196.52 294.52 196.36C296.75 195.64 299.38 194.78 301.14 196.9C303 199.14 300.55 201.77 298.78 203.09C297.79 203.82 296.68 204.42 295.52 204.82C294.62 205.14 293.41 205.4 292.61 205.4C291.73 205.4 290.77 205.23 290.11 204.58C289.26 203.75 289.21 202.56 289.63 201.5C290.66 198.92 293.68 197.39 296.23 196.83C296.82 196.7 298.09 196.14 297.9 195.35C297.71 194.56 296.22 194.79 295.71 194.9V194.91Z" fill="white"/>
<path d="M309.92 205.84C306.57 206.51 302.86 208.39 300.92 211.32C300.12 212.53 299.49 214.17 299.98 215.62C300.52 217.21 302.12 217.95 303.68 218.15C307.35 218.6 311.4 217.29 314.51 215.41C317.09 213.86 320.9 210.79 318.35 207.58C315.48 203.97 310.34 205.88 306.66 206.62C306.07 206.74 304.8 207.32 304.99 208.1C305.18 208.92 306.67 208.65 307.18 208.55C309.4 208.1 312.11 206.8 314.13 208.44C314.89 209.06 315.5 209.99 315.29 211.01C315.05 212.17 313.95 213 313.04 213.66C311.05 215.09 308.81 215.96 306.45 216.04C305.68 216.07 304.57 215.85 304.04 215C303.47 214.08 303.73 212.87 304.19 211.97C305.4 209.59 308.09 208.24 310.44 207.77C311.03 207.65 312.3 207.07 312.11 206.29C311.91 205.47 310.43 205.74 309.92 205.84V205.84Z" fill="white"/>
<path d="M265 204.46C261.96 205.92 258.34 207.7 257.22 211.16C256.81 212.44 256.78 213.99 257.36 215.22C258.16 216.9 259.75 217.69 261.55 217.85C263.56 218.03 265.62 217.48 267.47 216.74C269.32 216 270.92 215.01 272.36 213.75C273.72 212.56 275.16 210.9 274.97 208.96C274.79 207.2 273.07 206.09 271.64 205.37C269.69 204.38 267.45 203.88 265.27 204.24C263.09 204.6 260.8 205.66 259.66 207.63C259.21 208.4 260.05 208.75 260.71 208.77C261.51 208.79 262.82 208.48 263.26 207.72C263.39 207.5 263.52 207.28 263.69 207.09C263.85 206.91 264.07 206.74 264.15 206.69C264.21 206.65 264.56 206.45 264.3 206.58C264.41 206.52 264.54 206.48 264.65 206.43C264.33 206.56 264.65 206.44 264.7 206.42C265.09 206.25 264.55 206.41 264.93 206.36C265.98 206.24 267.33 206.64 268.46 207.2C269.52 207.73 270.78 208.45 271.05 209.7C271.32 210.95 270.37 212.12 269.5 212.91C268.58 213.76 267.46 214.5 266.45 214.95C266.15 215.08 265.84 215.21 265.53 215.32C265.8 215.22 265.37 215.37 265.31 215.39C265.13 215.44 264.96 215.49 264.78 215.54C264.64 215.58 264.51 215.61 264.37 215.64C264.65 215.58 264.3 215.64 264.26 215.65C263.86 215.7 263.73 215.75 263.26 215.69C261.09 215.43 260.51 212.85 260.98 211.02C261.29 209.81 262.06 208.86 263.02 208.08C264.09 207.21 265.33 206.63 266.52 206.06C266.99 205.83 268.14 205.17 267.55 204.51C267 203.9 265.61 204.18 264.99 204.47L265 204.46Z" fill="white"/>
<path d="M279.55 217.74C276.73 218.88 273.96 220.72 272.12 223.18C271.22 224.38 270.86 225.84 271.77 227.14C272.68 228.44 274.42 228.96 275.93 229.08C277.54 229.21 279.18 228.89 280.71 228.38C282.24 227.87 283.7 227.27 285.05 226.44C287.24 225.1 289.49 222.52 288.38 219.76C286.9 216.08 281.87 217.56 279.23 218.84C278.76 219.07 277.6 219.73 278.2 220.39C278.75 221 280.14 220.73 280.76 220.43C281.22 220.21 281.68 220 282.16 219.81C282.48 219.69 281.91 219.88 282.24 219.78C282.37 219.74 282.5 219.7 282.63 219.67C282.86 219.61 282.64 219.66 282.6 219.67C282.6 219.67 283.19 219.6 282.89 219.62C283.12 219.61 283.41 219.65 283.72 219.84C284.06 220.04 284.33 220.37 284.49 220.72C285.23 222.39 284.31 224.18 283 225.07C282.11 225.67 281.46 225.94 280.41 226.35C280.33 226.38 279.77 226.58 279.99 226.51C279.71 226.6 279.44 226.68 279.15 226.75C278.75 226.85 278.43 226.91 278.06 226.91C277.19 226.91 276.25 226.63 275.6 225.92C274.87 225.11 275.06 224.16 275.66 223.34C276.34 222.4 277.27 221.58 278.2 220.9C279.13 220.22 280.02 219.75 281.08 219.32C281.57 219.12 282.69 218.41 282.11 217.77C281.53 217.13 280.2 217.47 279.55 217.73V217.74Z" fill="white"/>
<path d="M224.41 246.87C230.3 257.11 236.19 267.35 242.08 277.6C247.63 287.26 252.95 297 260.24 305.49C263.7 309.52 267.42 313.32 271.24 317C275.06 320.68 278.99 324.1 282.6 327.92C286.21 331.74 289.15 335.87 291.25 340.66C293.47 345.75 295.08 351.11 296.99 356.33C301.37 368.31 306.31 380.08 311.77 391.61C312.4 392.94 316.18 391.72 315.63 390.57C310.75 380.27 306.29 369.77 302.27 359.1C300.31 353.9 298.57 348.62 296.63 343.41C294.8 338.5 292.49 333.88 289.17 329.79C285.85 325.7 282.14 322.36 278.41 318.87C274.48 315.19 270.61 311.44 266.96 307.48C263.31 303.52 260.07 299.58 257.12 295.25C253.82 290.41 250.97 285.27 248.05 280.2C241.46 268.74 234.87 257.28 228.28 245.82C227.54 244.53 223.82 245.82 224.42 246.86L224.41 246.87Z" fill="white"/>
<path d="M327.05 183.85C338.45 206.07 350.85 227.82 365.09 248.36C368.49 253.26 372.26 258.01 374.96 263.34C377.66 268.67 378.67 274.63 379.09 280.66C380.01 293.68 379.83 306.74 379.95 319.78C380.08 334.07 380.61 348.35 380.64 362.64C380.64 363.83 384.51 363.11 384.5 361.6C384.47 348.89 384.05 336.18 383.86 323.47C383.67 310.76 383.91 297.31 383.23 284.24C382.91 278.07 382.62 271.71 380.41 265.87C378.38 260.52 375.02 255.81 371.73 251.19C364.54 241.07 357.78 230.65 351.41 219.99C344.14 207.84 337.37 195.4 330.9 182.81C330.22 181.49 326.47 182.74 327.04 183.85H327.05Z" fill="white"/>
<path d="M285.78 328.39C300.68 326.31 315.411 322.64 329.321 316.85C343.001 311.16 356.091 303.37 366.911 293.17C372.871 287.54 378.09 281.07 381.65 273.65C382.45 271.99 378.6 272.42 378.05 273.57C371.89 286.4 360.92 296.29 349.18 303.99C337.44 311.69 323.89 317.51 310.11 321.35C302.3 323.53 294.34 325.13 286.31 326.25C285.64 326.34 284.22 326.72 284.11 327.56C284 328.4 285.22 328.46 285.78 328.39Z" fill="white"/>
<path d="M250.48 287.4C266.4 285.33 281.97 280.71 296.47 273.84C310.97 266.97 324.37 257.96 336.1 247.06C342.68 240.95 348.71 234.25 354.1 227.06C354.66 226.32 353.62 225.95 353.05 225.92C352.17 225.87 351.04 226.25 350.5 226.97C341.25 239.31 330.03 250.18 317.43 259.07C304.83 267.96 291.01 274.93 276.38 279.59C268.1 282.23 259.62 284.13 251 285.25C250.33 285.34 248.91 285.73 248.8 286.56C248.69 287.39 249.91 287.46 250.47 287.39L250.48 287.4Z" fill="white"/>
<path d="M175.03 489.49C174.37 492.12 175.74 494.98 178.16 496.18C181 497.59 185.06 496.68 187.26 494.47C189.07 492.65 189.53 489.97 188.37 487.66C187.8 486.53 186.99 485.62 185.9 484.98C184.61 484.22 183.02 484.06 181.56 484.24C178.36 484.65 174.91 486.86 174.36 490.26C174.12 491.75 178.01 491.09 178.22 489.78C178.26 489.51 178.32 489.25 178.4 489C178.43 488.89 178.47 488.79 178.51 488.69C178.52 488.66 178.64 488.41 178.57 488.55C178.68 488.33 178.81 488.12 178.94 487.92C179 487.83 179.07 487.74 179.14 487.65C179.19 487.58 179.25 487.51 179.31 487.44C179.21 487.55 179.21 487.54 179.33 487.42C179.49 487.26 179.65 487.11 179.82 486.97C179.88 486.92 180.24 486.68 179.9 486.9C179.99 486.84 180.09 486.78 180.18 486.72C180.26 486.67 180.38 486.57 180.47 486.55L180.27 486.65C180.35 486.61 180.43 486.57 180.51 486.54C180.53 486.53 180.88 486.38 180.88 486.39C180.88 486.38 180.39 486.56 180.88 486.41C181.32 486.27 180.42 486.46 180.88 486.41C180.98 486.4 181.11 486.4 181.21 486.37C181.46 486.31 180.76 486.35 181.18 486.37C181.31 486.37 181.44 486.37 181.58 486.38C181.17 486.36 181.6 486.38 181.67 486.4C181.76 486.42 181.84 486.44 181.93 486.46C182.33 486.53 181.72 486.35 182.07 486.5C182.21 486.55 182.34 486.61 182.47 486.67C182.56 486.72 182.65 486.76 182.74 486.81C182.74 486.81 183.08 487.02 182.9 486.9C183.07 487.02 183.23 487.15 183.38 487.29C183.75 487.63 184.07 488.01 184.33 488.44C184.74 489.09 185.03 490.06 185.09 490.9C185.15 491.69 184.89 492.73 184.52 493.31C184.4 493.5 184.26 493.69 184.11 493.86C184.31 493.64 184 493.96 183.98 493.98C183.91 494.04 183.84 494.1 183.77 494.16C183.45 494.46 184.05 494 183.68 494.23C183.56 494.3 183.45 494.37 183.33 494.44C183.02 494.63 183.38 494.44 183.4 494.41C183.32 494.45 183.23 494.49 183.15 494.52C182.94 494.6 182.98 494.59 183.27 494.49C183.2 494.56 182.96 494.58 182.87 494.6C182.48 494.71 182.99 494.57 182.99 494.58C182.97 494.62 182.63 494.63 182.58 494.63C182.13 494.69 182.98 494.65 182.52 494.63C182.43 494.63 182.34 494.63 182.25 494.63C181.82 494.63 182.56 494.71 182.14 494.61C182.01 494.58 181.87 494.55 181.74 494.52C181.43 494.46 181.84 494.58 181.57 494.47C179.55 493.59 178.27 491.27 178.85 488.99C179.2 487.59 175.32 488.16 174.99 489.47L175.03 489.49Z" fill="white"/>
<path d="M222.51 337.95C206.05 344.35 189.66 350.9 173.33 357.61C165.13 360.98 156.94 364.39 148.77 367.84C140.6 371.29 132.52 374.56 124.54 378.21C123.11 378.86 121 380.18 122.14 381.99C122.65 382.81 123.62 383.29 124.41 383.8C125.45 384.47 126.5 385.14 127.54 385.81C131.78 388.54 136.03 391.26 140.27 393.99L140.61 392.48C122.52 404.98 104.42 417.47 86.3896 430.05C82.1796 432.99 77.9596 436.07 75.1096 440.43C74.3196 441.63 76.5696 441.63 77.1696 441.44C105.43 432.41 132.8 420.71 158.84 406.48C166.21 402.45 173.47 398.22 180.61 393.8C181.45 393.28 181.65 392.5 180.59 392.18C172.36 389.62 164.27 386.64 156.34 383.28L156 384.79C174.29 373.93 192.26 362.53 209.87 350.6C214.85 347.22 219.81 343.81 224.74 340.35C225.29 339.97 225.85 339.32 225.08 338.84C224.37 338.41 222.97 338.76 222.34 339.2C204.93 351.42 187.16 363.12 169.05 374.29C163.93 377.45 158.77 380.56 153.6 383.64C153.11 383.93 152.4 384.78 153.26 385.15C161.42 388.61 169.75 391.65 178.21 394.28L178.19 392.66C153.4 408.01 127.16 420.99 99.9096 431.37C92.2296 434.3 84.4696 437.01 76.6396 439.51L78.6996 440.52C81.1696 436.74 84.7796 434 88.4396 431.44C92.8096 428.38 97.1996 425.35 101.58 422.31C110.39 416.2 119.21 410.09 128.03 403.99C133.02 400.54 138.01 397.09 143 393.63C143.56 393.24 144.11 392.62 143.34 392.12C139.79 389.84 136.24 387.56 132.69 385.28C130.88 384.12 129.07 382.96 127.26 381.79C126.82 381.51 125.46 380.82 125.69 380.11C125.87 379.56 127.34 379.23 127.85 379.01C135.54 375.68 143.24 372.39 150.96 369.13C166.47 362.58 182.04 356.18 197.67 349.92C206.44 346.41 215.22 342.94 224.02 339.52C224.57 339.31 225.57 338.64 225.05 337.97C224.53 337.3 223.09 337.7 222.49 337.93L222.51 337.95Z" fill="white"/>
<path d="M112.39 353.2C110.21 354.05 108.42 356.16 108.88 358.61C109.06 359.59 109.64 360.57 110.44 361.17C111.53 361.98 112.82 362.31 114.16 362.38C116.79 362.52 119.84 361.57 120.92 358.96C121.59 357.32 121.18 355.27 119.84 354.08C117.77 352.23 114.51 352.29 112.09 353.36C111.73 353.52 111.28 353.77 111.05 354.11C110.9 354.34 110.82 354.68 111.05 354.91C111.66 355.5 112.93 355.25 113.61 354.95C113.7 354.91 113.82 354.88 113.91 354.83C113.55 355.04 113.53 354.95 113.71 354.9C113.81 354.87 113.92 354.84 114.02 354.82C114.34 354.73 113.82 354.86 113.82 354.86C113.9 354.82 114.05 354.83 114.14 354.82C114.44 354.78 114.01 354.83 113.98 354.82C114.01 354.82 114.63 354.82 114.63 354.84C114.63 354.87 114.23 354.79 114.57 354.84C114.66 354.85 114.75 354.87 114.83 354.89C114.91 354.91 115 354.93 115.09 354.95C115.22 354.99 115.36 354.95 115.09 354.95C115.22 354.95 115.46 355.1 115.58 355.16C115.66 355.2 115.74 355.24 115.81 355.29C115.86 355.32 116.16 355.53 115.95 355.37C116.23 355.59 116.49 355.83 116.71 356.11C116.75 356.16 116.79 356.21 116.82 356.26C116.84 356.28 116.99 356.55 116.88 356.35C116.96 356.5 117.03 356.66 117.09 356.83C117.2 357.13 117.27 357.44 117.3 357.76C117.3 357.82 117.32 358.22 117.32 358.01C117.32 358.2 117.3 358.39 117.27 358.58C117.22 358.9 117.12 359.19 117.01 359.49C117.12 359.21 116.93 359.63 116.88 359.7C116.83 359.77 116.78 359.86 116.72 359.93L116.66 360C116.56 360.12 116.58 360.1 116.72 359.93C116.72 359.93 116.57 360.07 116.55 360.09C116.43 360.22 116.3 360.18 116.64 360.04C116.6 360.06 116.52 360.11 116.48 360.14C116.2 360.34 116.88 359.99 116.48 360.14C116.11 360.28 116.61 360.1 116.61 360.1L116.48 360.14C116.26 360.19 116.31 360.19 116.61 360.12C116.53 360.12 116.43 360.15 116.34 360.16C116.25 360.17 116.16 360.18 116.07 360.19C116.33 360.18 116.36 360.18 116.15 360.19C115.93 360.19 115.72 360.19 115.5 360.17C115.4 360.17 115.22 360.2 115.55 360.17C115.43 360.17 115.28 360.13 115.17 360.11C115.09 360.09 115 360.08 114.92 360.05C114.92 360.05 114.53 359.93 114.73 360C114.93 360.07 114.54 359.92 114.55 359.93C114.43 359.88 114.32 359.83 114.21 359.77C114.1 359.71 113.99 359.65 113.88 359.57C114.03 359.68 113.88 359.56 113.85 359.54C113.71 359.41 113.57 359.29 113.44 359.14C113.14 358.79 113.04 358.63 112.88 358.21C112.8 358 112.74 357.78 112.7 357.55C112.69 357.48 112.67 357.4 112.67 357.33C112.67 357.28 112.65 356.92 112.64 357.04C112.64 356.62 112.76 356.23 112.9 355.85C113.01 355.53 112.78 356.02 112.96 355.73C113.02 355.63 113.07 355.54 113.13 355.45C113.18 355.37 113.24 355.3 113.29 355.23C113.52 354.94 113.16 355.33 113.37 355.13C113.42 355.08 113.48 355.03 113.53 354.98C113.59 354.93 113.64 354.88 113.7 354.84C113.5 354.98 113.47 355.01 113.62 354.9C113.68 354.87 113.76 354.82 113.81 354.79C113.54 354.92 113.49 354.95 113.67 354.86C113.74 354.83 113.81 354.8 113.88 354.78C114.33 354.6 115.54 353.83 114.91 353.23C114.28 352.63 113.05 352.92 112.35 353.19L112.39 353.2Z" fill="white"/>
<path d="M155.44 114.2C145.72 109.08 136 103.96 126.29 98.84C125.5 98.42 124.26 98.75 123.55 99.2C123.01 99.54 122.4 100.28 123.21 100.71C132.93 105.83 142.65 110.95 152.36 116.07C153.15 116.49 154.39 116.16 155.1 115.71C155.64 115.37 156.25 114.63 155.44 114.2Z" fill="white"/>
<path d="M137.58 90.7499C133.73 101.06 137.68 112.15 135.81 122.73C135.55 124.21 139.44 123.57 139.67 122.25C141.54 111.67 137.59 100.56 141.44 90.2699C141.75 89.4399 140.2 89.3999 139.77 89.4399C138.96 89.5299 137.88 89.9199 137.57 90.7499H137.58Z" fill="white"/>
<path d="M148.6 101.15C141.13 104.6 133.66 108.05 126.19 111.51C125.66 111.75 124.63 112.37 125.16 113.06C125.65 113.7 127.15 113.36 127.72 113.1C135.19 109.65 142.66 106.2 150.13 102.74C150.66 102.5 151.69 101.88 151.16 101.19C150.67 100.55 149.17 100.89 148.6 101.15Z" fill="white"/>
<path d="M627.06 198.57C617.4 203.75 607.74 208.93 598.08 214.1C597.47 214.43 597.02 215.16 597.74 215.61C598.51 216.08 599.78 215.62 600.48 215.25C610.14 210.07 619.8 204.89 629.46 199.72C630.07 199.39 630.52 198.66 629.8 198.21C629.03 197.74 627.76 198.2 627.06 198.57Z" fill="white"/>
<path d="M601.22 194.57C608.11 202.54 615.861 209.73 624.341 215.98C625.071 216.51 626.111 216.35 626.901 216.02C627.251 215.87 628.651 215 627.931 214.47C619.451 208.21 611.691 201.03 604.811 193.06C603.941 192.05 600.24 193.43 601.22 194.57V194.57Z" fill="white"/>
<path d="M617.03 192.79C615.08 201.61 613.45 210.5 612.16 219.44C611.94 220.95 615.83 220.27 616.02 218.96C617.31 210.02 618.94 201.13 620.89 192.31C621.21 190.88 617.32 191.47 617.03 192.79Z" fill="white"/>
<path d="M1.57999 146.84C-0.510009 149.36 -0.460009 153.11 1.32999 155.76C3.38999 158.81 7.56999 159.3 10.85 158.28C12.71 157.7 14.42 156.69 15.64 155.16C16.69 153.84 17.13 152.19 17.1 150.53C17.04 147.17 14.78 144.25 11.56 143.33C7.59999 142.2 2.42999 144 0.329991 147.62C-0.110009 148.38 0.709991 148.75 1.37999 148.76C2.17999 148.76 3.47999 148.48 3.92999 147.71C4.25999 147.14 4.56999 146.75 4.95999 146.38C5.07999 146.27 5.19999 146.17 5.31999 146.07C5.69999 145.75 5.05999 146.21 5.47999 145.95C5.61999 145.87 5.74999 145.79 5.88999 145.7C6.07999 145.6 6.07999 145.6 5.87999 145.7C5.97999 145.65 6.06999 145.61 6.16999 145.57C6.31999 145.51 6.45999 145.45 6.60999 145.39C6.12999 145.58 6.61999 145.39 6.70999 145.37C6.85999 145.33 7.01999 145.29 7.16999 145.26C6.65999 145.37 7.18999 145.26 7.27999 145.26C7.33999 145.26 7.86999 145.21 7.42999 145.23C7.58999 145.23 7.74999 145.23 7.90999 145.23C8.06999 145.23 8.22999 145.24 8.37999 145.26C8.05999 145.23 8.66999 145.32 8.72999 145.33C9.78999 145.55 10.89 146.23 11.68 147.19C12.47 148.15 12.98 149.38 13.16 150.64C13.33 151.82 13.18 153.11 12.64 154.17C12.35 154.74 12.03 155.15 11.65 155.5C11.54 155.61 11.41 155.7 11.3 155.81C10.93 156.13 11.56 155.67 11.15 155.92C11.02 156 10.88 156.08 10.75 156.16C10.56 156.26 10.57 156.26 10.77 156.16C10.68 156.21 10.58 156.25 10.49 156.29C10.35 156.35 10.2 156.41 10.05 156.46C10.54 156.28 10.05 156.46 9.94999 156.47C9.84999 156.48 9.33999 156.59 9.85999 156.5C9.69999 156.53 9.54999 156.55 9.38999 156.57C9.31999 156.57 8.80999 156.59 9.24999 156.59C9.08999 156.59 8.93999 156.59 8.77999 156.59C8.74999 156.59 8.23999 156.54 8.58999 156.59C8.37999 156.56 8.17999 156.53 7.97999 156.48C6.95999 156.25 5.87999 155.55 5.12999 154.58C3.44999 152.4 3.40999 149.05 5.15999 146.94C5.74999 146.23 4.65999 145.81 4.10999 145.8C3.17999 145.8 2.16999 146.12 1.55999 146.85L1.57999 146.84Z" fill="white"/>
<path d="M200.03 233.04C189.49 232.47 178.98 231.47 168.52 230.04C167.61 229.92 166.47 230.11 165.79 230.77C165.25 231.29 165.29 232.02 166.16 232.14C176.9 233.61 187.7 234.65 198.53 235.23C199.34 235.27 200.64 234.93 201.08 234.18C201.52 233.43 200.69 233.08 200.03 233.04V233.04Z" fill="white"/>
<path d="M146.99 195.43C131.09 191.97 115.19 188.5 99.2899 185.04C98.4199 184.85 97.2099 185.14 96.5599 185.77C95.9799 186.33 96.0999 186.96 96.9299 187.14C112.83 190.6 128.73 194.07 144.63 197.53C145.5 197.72 146.71 197.43 147.36 196.8C147.94 196.24 147.82 195.61 146.99 195.43V195.43Z" fill="white"/>
<path d="M201.14 250.39C182.62 254.7 164.04 258.74 145.4 262.52C126.76 266.3 108.26 269.76 89.6103 272.98C79.0303 274.81 68.4303 276.55 57.8203 278.2C57.1503 278.3 55.7303 278.67 55.6203 279.51C55.5103 280.35 56.7303 280.42 57.2903 280.34C76.1603 277.39 94.9903 274.18 113.76 270.69C132.55 267.2 151.29 263.44 169.97 259.42C180.55 257.14 191.1 254.77 201.64 252.32C202.21 252.19 203.52 251.62 203.31 250.84C203.1 250.06 201.65 250.27 201.12 250.39H201.14Z" fill="white"/>
<path d="M201.25 276.77C194.56 279.8 187.88 282.84 181.19 285.87C180.66 286.11 179.63 286.73 180.16 287.42C180.66 288.06 182.14 287.72 182.72 287.46C189.41 284.43 196.09 281.39 202.78 278.36C203.31 278.12 204.34 277.5 203.81 276.81C203.31 276.17 201.83 276.51 201.25 276.77Z" fill="white"/>
<path d="M259.76 340.24C251.42 345.84 243.51 352.05 236.1 358.84C235.49 359.4 235.7 360.01 236.47 360.21C237.33 360.43 238.56 360.07 239.2 359.48C246.39 352.89 254.06 346.84 262.15 341.39C262.71 341.02 263.26 340.35 262.49 339.88C261.77 339.44 260.39 339.81 259.75 340.24H259.76Z" fill="white"/>
<path d="M252.8 146.2C248.96 137.89 245.11 129.58 241.27 121.28C240.65 119.95 236.87 121.16 237.41 122.32C241.25 130.63 245.1 138.94 248.94 147.24C249.56 148.57 253.34 147.36 252.8 146.2V146.2Z" fill="white"/>
<path d="M268.61 133.41C268.17 110.79 267.73 88.16 267.29 65.54L266.92 46.4C266.9 45.19 263.03 45.94 263.06 47.44C263.5 70.06 263.94 92.69 264.38 115.31C264.5 121.69 264.63 128.07 264.75 134.45C264.77 135.66 268.64 134.91 268.61 133.41Z" fill="white"/>
<path d="M310.85 135.04C312.21 127.62 313.58 120.21 314.94 112.79C315.21 111.32 311.32 111.95 311.08 113.27C309.72 120.69 308.35 128.1 306.99 135.52C306.72 136.99 310.61 136.36 310.85 135.04Z" fill="white"/>
<path d="M365.95 147.99C388.81 125.31 412 102.96 435.51 80.9502C442.19 74.6902 448.9 68.4702 455.64 62.2702C456.25 61.7102 456.04 61.1002 455.27 60.9002C454.42 60.6802 453.18 61.0402 452.54 61.6302C428.85 83.4402 405.48 105.6 382.43 128.09C375.88 134.48 369.36 140.91 362.86 147.35C362.28 147.92 362.43 148.51 363.23 148.72C364.03 148.93 365.35 148.6 365.96 147.99H365.95Z" fill="white"/>
<path d="M381.5 160.08C389.6 155.59 397.7 151.11 405.8 146.62C406.4 146.29 406.87 145.56 406.14 145.11C405.41 144.66 404.09 145.09 403.4 145.47C395.3 149.96 387.2 154.44 379.1 158.93C378.5 159.26 378.03 159.99 378.76 160.44C379.49 160.89 380.81 160.46 381.5 160.08Z" fill="white"/>
<path d="M408.74 163.04L417.51 159.67C418.01 159.48 419.11 158.76 418.54 158.12C417.97 157.48 416.63 157.83 415.98 158.08L407.21 161.45C406.71 161.64 405.61 162.36 406.18 163C406.75 163.64 408.09 163.29 408.74 163.04Z" fill="white"/>
<path d="M393.36 181.95C423.83 175.06 454.44 168.82 485.17 163.26C493.75 161.71 502.33 160.21 510.93 158.76C511.6 158.65 513.01 158.3 513.13 157.45C513.25 156.6 512.02 156.53 511.46 156.62C480.47 161.85 449.6 167.74 418.86 174.3C410.17 176.15 401.5 178.06 392.84 180.02C392.27 180.15 390.96 180.72 391.17 181.5C391.38 182.28 392.83 182.07 393.36 181.95V181.95Z" fill="white"/>
<path d="M490.85 207.9C500.45 208.92 510 210.41 519.47 212.33C520.35 212.51 521.55 212.23 522.2 211.6C522.77 211.05 522.67 210.4 521.83 210.23C512.08 208.26 502.24 206.76 492.35 205.71C491.55 205.63 490.22 206.03 489.8 206.76C489.33 207.57 490.21 207.83 490.85 207.9Z" fill="white"/>
<path d="M617.46 298.19C632.28 303.67 646.9 309.65 661.3 316.14C662.13 316.51 663.29 316.25 664.04 315.78C664.53 315.46 665.23 314.66 664.38 314.27C649.98 307.78 635.35 301.8 620.54 296.32C619.67 296 618.58 296.18 617.8 296.68C617.35 296.97 616.56 297.86 617.46 298.19Z" fill="white"/>
<path d="M584.76 318.32C568.66 307.03 552.48 295.83 536.24 284.75C528.09 279.19 519.92 273.66 511.74 268.15C507.65 265.4 503.55 262.65 499.45 259.91C497.4 258.54 495.35 257.17 493.29 255.81C492.26 255.13 491.24 254.44 490.21 253.76C489.35 253.19 488.52 252.54 487.48 252.36C485.46 252.01 482.96 253.16 482.99 255.42C483 256.53 483.36 257.63 483.57 258.71C483.83 260.03 484.04 261.37 484.22 262.7C484.95 268.13 485.01 273.61 484.45 279.05L487.92 277.87C468.68 270.1 449.12 263.13 429.3 256.97C423.71 255.23 418.09 253.56 412.46 251.95C411.63 251.71 409.11 252.27 409.35 253.52C409.6 254.87 410.48 255.87 411.52 256.71C412.9 257.8 414.41 258.75 415.85 259.75C418.88 261.85 421.92 263.93 424.98 266C431.08 270.14 437.22 274.23 443.39 278.26C455.6 286.24 467.96 294 480.44 301.55C487.57 305.86 494.75 310.1 501.97 314.27C502.88 314.8 505.15 314.22 505.44 313.09C508.42 301.6 501.04 290.75 500.62 279.4L497.15 280.85C519.04 291.98 540.9 303.17 562.81 314.25C568.4 317.08 574.19 319.78 580.47 320.53C581.38 320.64 582.51 320.47 583.2 319.8C583.73 319.29 583.71 318.54 582.83 318.43C577.23 317.76 572.09 315.48 567.09 312.99C561.74 310.32 556.44 307.58 551.11 304.87L518.66 288.36C512.51 285.23 506.36 282.1 500.21 278.98C499.23 278.48 496.69 279.07 496.74 280.43C497.15 291.57 504.48 302.32 501.56 313.57L505.03 312.39C480.04 297.96 455.55 282.67 431.62 266.55C428.3 264.31 424.98 262.06 421.68 259.79C419.96 258.61 418.25 257.43 416.54 256.23C415.15 255.26 413.53 254.27 413.2 252.48L410.09 254.05C429.88 259.7 449.44 266.16 468.7 273.43C474.11 275.47 479.49 277.58 484.85 279.74C485.69 280.08 488.19 279.8 488.32 278.56C488.77 274.13 488.83 269.65 488.47 265.21C488.29 263 488 260.79 487.61 258.6C487.43 257.58 487.2 256.58 487 255.57C486.93 255.24 486.95 254.84 486.87 254.52C486.72 253.97 487.51 253.89 486.19 254.32C485.17 254.65 485.42 254.52 485.95 254.84C489.93 257.26 493.73 260.01 497.6 262.6C501.47 265.19 505.25 267.72 509.07 270.29C524.48 280.66 539.83 291.13 555.12 301.69C563.83 307.71 572.51 313.75 581.17 319.83C581.91 320.35 582.93 320.21 583.73 319.87C584.06 319.73 585.49 318.83 584.76 318.32V318.32Z" fill="white"/>
<path d="M536.13 82.69C533.16 84.18 530.36 86.97 530.44 90.52C530.52 94.07 534.15 96.21 537.39 96.1C541.35 95.96 545.18 93.66 546.71 89.93C547.87 87.09 547.3 83.58 544.55 81.91C541.59 80.12 536.6 80.86 534.75 83.93C534.3 84.68 535.14 85.06 535.8 85.07C536.62 85.07 537.88 84.79 538.35 84.02C538.42 83.9 538.49 83.79 538.57 83.68C538.59 83.65 538.88 83.35 538.67 83.56C538.73 83.5 538.8 83.44 538.86 83.38C539.15 83.09 538.57 83.52 538.93 83.33C539.03 83.27 539.41 83.11 538.95 83.3C538.93 83.3 539.19 83.2 539.19 83.2C539.19 83.2 538.72 83.36 539.19 83.2C539.53 83.09 538.75 83.29 539.32 83.18C539.42 83.16 539.67 83.17 539.24 83.18C539.38 83.18 539.51 83.18 539.65 83.18C539.65 83.18 540.1 83.22 539.84 83.18C539.58 83.14 540.03 83.22 540.03 83.22C540.17 83.25 540.3 83.28 540.43 83.31C540.85 83.4 540.3 83.25 540.54 83.34C540.82 83.44 541.09 83.57 541.35 83.71C542.13 84.15 542.8 85.03 543.11 85.99C543.49 87.13 543.47 88.31 543.16 89.46C542.88 90.54 542.26 91.67 541.57 92.38C541.05 92.91 540.72 93.14 540.13 93.49C539.64 93.78 540.42 93.39 539.9 93.61C539.78 93.66 539.67 93.71 539.55 93.75C539.01 93.97 539.91 93.69 539.35 93.81C539.23 93.84 539.11 93.87 538.99 93.9C539.18 93.86 539.2 93.85 539.05 93.88C538.9 93.88 538.74 93.92 538.59 93.93C538.95 93.92 538.34 93.91 538.33 93.91C537.81 93.91 538.48 93.94 538.18 93.9C538.04 93.88 537.91 93.85 537.77 93.82C537.3 93.71 536.74 93.48 536.26 93.15C535.27 92.48 534.59 91.45 534.38 90.28C534.15 89.03 534.53 87.73 535.19 86.67C535.54 86.11 535.91 85.66 536.35 85.25C536.48 85.13 536.6 85.02 536.74 84.91C536.74 84.91 537.15 84.59 536.93 84.75C537.07 84.65 537.21 84.56 537.35 84.47C537.41 84.43 538.02 84.1 537.65 84.28C538.12 84.05 539.28 83.39 538.68 82.73C538.14 82.13 536.73 82.39 536.12 82.69H536.13Z" fill="white"/>
<path d="M686.28 139C684.56 140.79 682.33 143.64 684.39 146.04C686.45 148.44 690.5 147.7 693.04 146.51C695.26 145.47 698.23 143.5 697.65 140.63C697.16 138.21 694.62 137.04 692.37 136.98C689.8 136.92 686.6 138.05 685.41 140.5C684.6 142.16 688.45 141.72 689.01 140.58C689.16 140.26 689.35 139.97 689.58 139.71C689.36 139.97 689.71 139.61 689.78 139.54C689.83 139.5 690 139.32 689.83 139.49C689.66 139.66 689.92 139.43 689.99 139.39C690.05 139.35 690.21 139.3 690.24 139.25C690.22 139.29 689.82 139.43 690.12 139.32C690.19 139.29 690.26 139.26 690.33 139.23C690.63 139.1 690.19 139.29 690.16 139.29C690.24 139.29 690.36 139.23 690.44 139.21C690.66 139.14 690.72 139.26 690.32 139.23C690.38 139.23 690.49 139.2 690.55 139.19H690.67C690.87 139.16 690.83 139.16 690.53 139.18C690.64 139.23 690.87 139.18 691 139.18C691.04 139.18 691.4 139.24 691.13 139.18C690.89 139.13 691.14 139.18 691.2 139.2C691.37 139.24 691.54 139.27 691.71 139.32C691.43 139.25 691.62 139.29 691.68 139.32C691.79 139.36 691.89 139.4 692 139.45C692.16 139.52 692.31 139.61 692.45 139.69C692.63 139.8 692.24 139.52 692.52 139.74C692.58 139.79 692.64 139.84 692.7 139.89C693.01 140.16 693.3 140.48 693.49 140.84C693.9 141.61 693.93 142.57 693.53 143.24C693.28 143.65 693.16 143.78 692.88 144.03C692.79 144.11 692.69 144.19 692.59 144.28C692.55 144.32 692.33 144.47 692.57 144.3C692.36 144.45 692.15 144.58 691.93 144.71C691.85 144.76 691.34 145.02 691.67 144.86C691.39 144.99 691.11 145.11 690.82 145.24C690.76 145.27 690.45 145.38 690.8 145.26C690.68 145.3 690.57 145.33 690.45 145.37C690.33 145.41 690.21 145.43 690.09 145.46C690.51 145.37 689.98 145.46 689.89 145.47C690.21 145.44 689.82 145.47 689.74 145.47C689.64 145.47 689.26 145.41 689.61 145.47C689.52 145.45 689.09 145.35 689.26 145.41C688.84 145.28 688.5 145.08 688.21 144.82C686.43 143.18 688.17 140.92 689.36 139.68C689.56 139.47 689.83 139.18 689.74 138.85C689.66 138.54 689.27 138.37 688.99 138.32C688.14 138.16 686.88 138.4 686.26 139.05L686.28 139Z" fill="white"/>
<path d="M479.82 394.51C478.37 394.99 477.03 395.79 476.3 397.18C475.76 398.22 475.55 399.43 475.9 400.57C476.77 403.4 479.89 404.54 482.6 404.36C485.62 404.16 489.27 402.42 490.56 399.53C491.74 396.9 489.73 394.07 487.26 393.15C483.97 391.92 479.59 393.24 477.81 396.36C477.38 397.12 478.19 397.49 478.86 397.5C479.66 397.5 480.97 397.22 481.41 396.45C481.6 396.11 481.87 395.74 482.06 395.55C482.14 395.47 482.23 395.4 482.31 395.33C482.68 394.99 482.18 395.4 482.42 395.24C482.51 395.18 482.61 395.13 482.7 395.06C482.86 394.94 482.46 395.15 482.78 395.02C482.88 394.98 482.98 394.94 483.09 394.9C482.7 395.06 482.96 394.94 483.06 394.92C483.44 394.84 483.09 394.92 483.02 394.92C483.13 394.91 483.24 394.89 483.35 394.88C483.01 394.92 483.28 394.88 483.35 394.88C483.46 394.88 483.57 394.88 483.68 394.9C483.42 394.87 483.7 394.91 483.74 394.92C483.9 394.96 484.06 394.99 484.22 395.04C484.4 395.1 484.94 395.36 485.22 395.54C485.59 395.79 485.91 396.12 486.19 396.46C486.79 397.21 487.16 398.25 486.97 399.2C486.78 400.15 486.2 400.77 485.51 401.33C485.5 401.33 485.27 401.51 485.42 401.4C485.32 401.47 485.22 401.54 485.11 401.6C485 401.66 484.9 401.73 484.79 401.79C484.75 401.82 484.47 401.95 484.73 401.82C484.51 401.93 484.28 402.02 484.05 402.1C484.53 401.93 483.32 402.21 483.84 402.15C483.72 402.16 483.6 402.18 483.48 402.2C483.42 402.2 483.13 402.2 483.42 402.2C483.3 402.2 483.18 402.2 483.06 402.2C483.04 402.2 482.75 402.17 482.95 402.2C482.46 402.13 482.3 402.08 481.88 401.88C481.15 401.54 480.49 400.98 480.08 400.28C479.62 399.51 479.52 398.6 479.75 397.74C479.87 397.31 480.01 397.06 480.28 396.67C480.43 396.45 480.36 396.57 480.31 396.62C480.41 396.52 480.52 396.42 480.63 396.34C480.58 396.38 480.37 396.55 480.63 396.36L480.45 396.45C480.66 396.36 480.62 396.37 480.35 396.47C480.9 396.29 482.24 395.81 482.02 394.99C481.81 394.21 480.35 394.37 479.83 394.54L479.82 394.51Z" fill="white"/>
</g>
<defs>
<clipPath id="clip0_129_5069">
<rect width="827.69" height="809.06" fill="white"/>
</clipPath>
</defs>
</svg>
