<svg width="200" height="67" viewBox="0 0 200 67" fill="none" xmlns="http://www.w3.org/2000/svg">
<path d="M183.261 0.254123H15.8654C15.2552 0.254123 14.6524 0.254123 14.0438 0.25745C13.5344 0.260778 13.029 0.270446 12.5147 0.278583C11.3974 0.291731 10.2827 0.390029 9.18027 0.572622C8.07943 0.759191 7.01308 1.11093 6.01727 1.61593C5.02268 2.12521 4.1139 2.78696 3.32389 3.57718C2.52973 4.36518 1.86774 5.276 1.36337 6.27462C0.857609 7.27125 0.506912 8.33924 0.323392 9.44168C0.138127 10.5427 0.0384349 11.6565 0.0252091 12.7729C0.00976749 13.2831 0.0081368 13.795 0 14.3052V52.7666C0.0081368 53.2832 0.00976749 53.7838 0.0252091 54.3006C0.038439 55.417 0.138132 56.5307 0.323392 57.6317C0.506405 58.7348 0.857123 59.8034 1.36337 60.8004C1.86751 61.7958 2.5296 62.7029 3.32389 63.4865C4.11091 64.2803 5.02028 64.9425 6.01727 65.4478C7.01307 65.9542 8.07931 66.308 9.18027 66.4975C10.2828 66.6786 11.3974 66.7769 12.5147 66.7917C13.029 66.803 13.5344 66.8095 14.0438 66.8095C14.6523 66.8128 15.2553 66.8128 15.8654 66.8128H183.261C183.859 66.8128 184.466 66.8128 185.064 66.8095C185.571 66.8095 186.091 66.803 186.598 66.7917C187.714 66.7777 188.826 66.6794 189.926 66.4975C191.031 66.3067 192.101 65.953 193.102 65.4478C194.098 64.9422 195.006 64.28 195.792 63.4865C196.585 62.6998 197.248 61.7934 197.759 60.8004C198.261 59.8027 198.608 58.7341 198.789 57.6317C198.974 56.5305 199.078 55.4171 199.098 54.3006C199.104 53.7838 199.104 53.2832 199.104 52.7666C199.117 52.1621 199.117 51.5609 199.117 50.9465V16.1219C199.117 15.5126 199.117 14.9081 199.104 14.3052C199.104 13.795 199.104 13.2831 199.098 12.7729C199.078 11.6563 198.974 10.5428 198.789 9.44162C198.608 8.33981 198.261 7.27191 197.759 6.27455C196.731 4.27293 195.103 2.64362 193.102 1.61578C192.101 1.11201 191.031 0.760369 189.926 0.572473C188.826 0.389075 187.714 0.290743 186.598 0.27835C186.091 0.27023 185.571 0.260479 185.064 0.257234C184.466 0.253906 183.859 0.253906 183.261 0.253906V0.254123Z" fill="black"/>
<path d="M14.0524 65.3569C13.5454 65.3569 13.0507 65.3505 12.5477 65.3391C11.5057 65.3256 10.4661 65.2349 9.43749 65.0677C8.47836 64.9026 7.54923 64.5953 6.68073 64.1561C5.82019 63.7205 5.03532 63.1493 4.35617 62.4645C3.66718 61.7877 3.09357 61.0028 2.65807 60.1407C2.21777 59.2731 1.91305 58.3432 1.75454 57.3832C1.58335 56.3517 1.49074 55.3088 1.47749 54.2633C1.46694 53.9123 1.45312 52.7439 1.45312 52.7439V14.3053C1.45312 14.3053 1.46783 13.1549 1.47757 12.8169C1.49026 11.773 1.58234 10.7317 1.75301 9.70179C1.91181 8.73922 2.21676 7.80656 2.6573 6.93611C3.09121 6.0747 3.66163 5.28917 4.34646 4.60997C5.03053 3.92432 5.81791 3.35022 6.67991 2.90861C7.54641 2.47079 8.47379 2.16569 9.43098 2.00351C10.463 1.83473 11.5062 1.74348 12.5518 1.73052L14.0532 1.71021H185.057L186.576 1.73134C187.612 1.74365 188.646 1.83409 189.668 2.00188C190.635 2.16609 191.572 2.47333 192.449 2.91349C194.176 3.80345 195.581 5.21146 196.467 6.94017C196.901 7.80461 197.201 8.72966 197.358 9.68392C197.53 10.7222 197.627 11.7718 197.647 12.8242C197.652 13.2954 197.652 13.8016 197.652 14.3053C197.665 14.9293 197.665 15.5232 197.665 16.122V50.9467C197.665 51.5512 197.665 52.1411 197.652 52.7358C197.652 53.2769 197.652 53.7726 197.645 54.2827C197.626 55.3164 197.531 56.3472 197.361 57.3669C197.206 58.3338 196.903 59.271 196.462 60.1457C196.024 60.9984 195.453 61.7765 194.772 62.4515C194.093 63.14 193.306 63.7145 192.444 64.1529C191.57 64.5955 190.634 64.9039 189.668 65.0677C188.64 65.2357 187.6 65.3265 186.558 65.3391C186.071 65.3505 185.56 65.3569 185.065 65.3569L183.261 65.3603L14.0524 65.3569Z" fill="white"/>
<path d="M41.5938 33.35C41.6124 31.9057 41.996 30.4896 42.709 29.2335C43.422 27.9773 44.4411 26.9219 45.6715 26.1655C44.8898 25.0491 43.8586 24.1304 42.6598 23.4823C41.461 22.8342 40.1275 22.4745 38.7654 22.4319C35.8597 22.1269 33.0428 24.1706 31.5621 24.1706C30.0527 24.1706 27.773 22.4622 25.3181 22.5127C23.7302 22.564 22.1827 23.0258 20.8263 23.853C19.4699 24.6802 18.3509 25.8446 17.5784 27.2329C14.2319 33.0268 16.7281 41.542 19.9337 46.2254C21.5376 48.5187 23.412 51.0804 25.8647 50.9896C28.2648 50.89 29.1612 49.4591 32.0584 49.4591C34.9286 49.4591 35.7696 50.9896 38.2721 50.9318C40.8475 50.89 42.4701 48.6283 44.0177 46.3133C45.1701 44.6792 46.0569 42.8732 46.6451 40.9621C45.1489 40.3293 43.872 39.27 42.9737 37.9163C42.0755 36.5627 41.5956 34.9746 41.5938 33.35Z" fill="black"/>
<path d="M36.8667 19.3513C38.2709 17.6656 38.9627 15.4989 38.7952 13.3113C36.6499 13.5366 34.6682 14.5619 33.245 16.183C32.5491 16.9749 32.0162 17.8962 31.6766 18.8942C31.337 19.8922 31.1975 20.9474 31.266 21.9994C32.339 22.0104 33.4006 21.7778 34.3707 21.3192C35.3409 20.8605 36.1943 20.1876 36.8667 19.3513Z" fill="black"/>
<path d="M70.3889 45.4141H62.5127L60.6212 50.9991H57.2852L64.7454 30.3359H68.2114L75.6717 50.9991H72.2787L70.3889 45.4141ZM63.3284 42.8369H69.5716L66.4939 33.7728H66.4077L63.3284 42.8369Z" fill="black"/>
<path d="M91.7837 43.467C91.7837 48.1485 89.278 51.1563 85.4967 51.1563C84.5388 51.2064 83.5862 50.9858 82.7479 50.5196C81.9096 50.0535 81.2195 49.3607 80.7566 48.5206H80.6851V55.9824H77.5928V35.9336H80.586V38.4393H80.6428C81.127 37.6032 81.8287 36.914 82.6734 36.445C83.5181 35.976 84.4741 35.7448 85.4397 35.776C89.2633 35.776 91.7837 38.7984 91.7837 43.467ZM88.6052 43.467C88.6052 40.4169 87.029 38.4117 84.624 38.4117C82.2613 38.4117 80.6721 40.4591 80.6721 43.467C80.6721 46.5024 82.2613 48.5352 84.624 48.5352C87.029 48.5352 88.6052 46.5446 88.6052 43.467H88.6052Z" fill="black"/>
<path d="M108.366 43.467C108.366 48.1485 105.859 51.1563 102.078 51.1563C101.12 51.2064 100.167 50.9858 99.3289 50.5196C98.4906 50.0535 97.8006 49.3607 97.3377 48.5206H97.2661V55.9824H94.1738V35.9336H97.167V38.4393H97.2239C97.708 37.6032 98.4098 36.914 99.2545 36.445C100.099 35.976 101.055 35.7448 102.021 35.776C105.844 35.776 108.366 38.7984 108.366 43.467ZM105.186 43.467C105.186 40.4169 103.61 38.4117 101.205 38.4117C98.8424 38.4117 97.2532 40.4591 97.2532 43.467C97.2532 46.5024 98.8424 48.5352 101.205 48.5352C103.61 48.5352 105.186 46.5446 105.186 43.467Z" fill="black"/>
<path d="M119.323 45.2416C119.552 47.2907 121.542 48.6361 124.263 48.6361C126.869 48.6361 128.744 47.2906 128.744 45.443C128.744 43.8392 127.613 42.8789 124.935 42.2207L122.257 41.5756C118.463 40.6591 116.702 38.8847 116.702 36.0052C116.702 32.44 119.809 29.9912 124.219 29.9912C128.587 29.9912 131.58 32.44 131.681 36.0052H128.559C128.372 33.9431 126.668 32.6984 124.177 32.6984C121.685 32.6984 119.981 33.9578 119.981 35.7907C119.981 37.2516 121.07 38.1112 123.733 38.7692L126.009 39.3282C130.249 40.3308 132.009 42.0338 132.009 45.0562C132.009 48.922 128.931 51.3432 124.033 51.3432C119.451 51.3432 116.357 48.9789 116.157 45.2415L119.323 45.2416Z" fill="black"/>
<path d="M138.686 32.3684V35.9336H141.551V38.3824H138.686V46.6876C138.686 47.9778 139.26 48.5791 140.519 48.5791C140.859 48.5732 141.199 48.5493 141.536 48.5075V50.9417C140.97 51.0475 140.395 51.0954 139.819 51.0847C136.769 51.0847 135.579 49.9391 135.579 47.0174V38.3824H133.389V35.9336H135.579V32.3684H138.686Z" fill="black"/>
<path d="M143.208 43.4671C143.208 38.7271 146 35.7485 150.353 35.7485C154.721 35.7485 157.5 38.727 157.5 43.4671C157.5 48.2202 154.736 51.1857 150.353 51.1857C145.972 51.1857 143.208 48.2202 143.208 43.4671ZM154.349 43.4671C154.349 40.2156 152.859 38.2965 150.353 38.2965C147.847 38.2965 146.357 40.2302 146.357 43.4671C146.357 46.7317 147.847 48.6362 150.353 48.6362C152.859 48.6362 154.349 46.7317 154.349 43.4671H154.349Z" fill="black"/>
<path d="M160.049 35.9339H162.998V38.4981H163.07C163.269 37.6973 163.738 36.9895 164.398 36.4939C165.058 35.9982 165.869 35.7448 166.693 35.7763C167.05 35.7751 167.405 35.8138 167.753 35.8917V38.7841C167.303 38.6467 166.834 38.5835 166.363 38.5973C165.914 38.579 165.466 38.6582 165.051 38.8294C164.635 39.0006 164.261 39.2598 163.955 39.5891C163.649 39.9183 163.418 40.31 163.277 40.7371C163.137 41.1642 163.09 41.6166 163.141 42.0633V50.999H160.049L160.049 35.9339Z" fill="black"/>
<path d="M182.011 46.5741C181.595 49.3089 178.931 51.1857 175.524 51.1857C171.141 51.1857 168.421 48.2494 168.421 43.5386C168.421 38.8132 171.156 35.7485 175.394 35.7485C179.562 35.7485 182.183 38.6117 182.183 43.1795V44.239H171.542V44.4259C171.493 44.9803 171.563 45.5388 171.746 46.0644C171.929 46.5899 172.222 47.0705 172.606 47.474C172.989 47.8776 173.454 48.1951 173.969 48.4052C174.485 48.6154 175.039 48.7135 175.595 48.693C176.326 48.7615 177.059 48.5922 177.686 48.2105C178.313 47.8287 178.8 47.2548 179.074 46.5741L182.011 46.5741ZM171.557 42.0778H179.089C179.117 41.5793 179.041 41.0804 178.867 40.6125C178.693 40.1445 178.424 39.7177 178.077 39.3586C177.73 38.9996 177.312 38.7162 176.851 38.5261C176.389 38.3361 175.893 38.2435 175.394 38.2542C174.89 38.2512 174.391 38.348 173.925 38.5389C173.459 38.7298 173.035 39.0112 172.679 39.3666C172.322 39.7221 172.039 40.1447 171.847 40.61C171.654 41.0754 171.556 41.5742 171.557 42.0778V42.0778Z" fill="black"/>
<path d="M62.9418 14.7825C63.5901 14.736 64.2406 14.8339 64.8465 15.0693C65.4524 15.3046 65.9985 15.6715 66.4454 16.1434C66.8923 16.6154 67.2289 17.1806 67.4309 17.7984C67.6329 18.4162 67.6953 19.0711 67.6136 19.7159C67.6136 22.8878 65.8992 24.7111 62.9418 24.7111H59.3555V14.7825H62.9418ZM60.8976 23.307H62.7695C63.2328 23.3347 63.6964 23.2587 64.1266 23.0847C64.5568 22.9106 64.9427 22.6428 65.2564 22.3007C65.57 21.9587 65.8035 21.551 65.9397 21.1073C66.0759 20.6637 66.1115 20.1953 66.0438 19.7361C66.1066 19.2788 66.0674 18.8133 65.9291 18.3729C65.7908 17.9325 65.5568 17.5282 65.2438 17.1888C64.9309 16.8495 64.5468 16.5836 64.119 16.4101C63.6912 16.2367 63.2304 16.16 62.7695 16.1856H60.8976V23.307Z" fill="black"/>
<path d="M69.3556 20.9614C69.3085 20.469 69.3648 19.9722 69.521 19.5028C69.6771 19.0335 69.9296 18.6019 70.2623 18.2359C70.595 17.8699 71.0005 17.5774 71.4529 17.3772C71.9052 17.1771 72.3944 17.0737 72.8891 17.0737C73.3837 17.0737 73.8729 17.1771 74.3253 17.3772C74.7776 17.5774 75.1831 17.8699 75.5158 18.2359C75.8485 18.6019 76.1011 19.0335 76.2572 19.5028C76.4133 19.9722 76.4697 20.469 76.4226 20.9614C76.4706 21.4543 76.4149 21.9518 76.2592 22.4219C76.1034 22.892 75.8511 23.3243 75.5183 23.6911C75.1855 24.0579 74.7797 24.3509 74.3269 24.5515C73.8741 24.7521 73.3843 24.8557 72.8891 24.8557C72.3938 24.8557 71.9041 24.7521 71.4513 24.5515C70.9985 24.3509 70.5926 24.0579 70.2599 23.6911C69.9271 23.3243 69.6747 22.892 69.519 22.4219C69.3632 21.9518 69.3076 21.4543 69.3556 20.9614ZM74.9016 20.9614C74.9016 19.3372 74.172 18.3874 72.8915 18.3874C71.6062 18.3874 70.8831 19.3372 70.8831 20.9614C70.8831 22.5986 71.6062 23.541 72.8915 23.541C74.172 23.541 74.9016 22.592 74.9016 20.9614H74.9016Z" fill="black"/>
<path d="M85.8166 24.711H84.2826L82.734 19.1926H82.617L81.0749 24.711H79.5556L77.4902 17.2183H78.9901L80.3323 22.9357H80.4428L81.9833 17.2183H83.4019L84.9423 22.9357H85.0593L86.3951 17.2183H87.8738L85.8166 24.711Z" fill="black"/>
<path d="M89.6104 17.2184H91.0338V18.4087H91.1443C91.3318 17.9812 91.6479 17.6228 92.0487 17.3835C92.4495 17.1442 92.915 17.036 93.3803 17.0738C93.7449 17.0464 94.1109 17.1013 94.4514 17.2346C94.7918 17.3679 95.0979 17.5761 95.347 17.8437C95.596 18.1113 95.7817 18.4316 95.8902 18.7807C95.9987 19.1299 96.0272 19.4989 95.9737 19.8606V24.7111H94.495V20.2319C94.495 19.0278 93.9718 18.429 92.8782 18.429C92.6306 18.4175 92.3835 18.4596 92.1538 18.5525C91.9241 18.6454 91.7172 18.7869 91.5472 18.9672C91.3773 19.1476 91.2484 19.3625 91.1693 19.5974C91.0902 19.8322 91.0628 20.0814 91.0891 20.3278V24.7111H89.6104L89.6104 17.2184Z" fill="black"/>
<path d="M98.3301 14.2935H99.8088V24.7111H98.3301V14.2935Z" fill="black"/>
<path d="M101.864 20.9615C101.817 20.4691 101.874 19.9723 102.03 19.5029C102.186 19.0335 102.439 18.602 102.771 18.2359C103.104 17.8699 103.51 17.5774 103.962 17.3773C104.414 17.1771 104.904 17.0737 105.398 17.0737C105.893 17.0737 106.382 17.1771 106.835 17.3773C107.287 17.5774 107.692 17.8699 108.025 18.2359C108.358 18.602 108.61 19.0335 108.767 19.5029C108.923 19.9723 108.979 20.4691 108.932 20.9615C108.98 21.4545 108.924 21.952 108.769 22.4221C108.613 22.8922 108.36 23.3245 108.028 23.6912C107.695 24.058 107.289 24.3511 106.836 24.5516C106.383 24.7522 105.893 24.8558 105.398 24.8558C104.903 24.8558 104.413 24.7522 103.96 24.5516C103.508 24.3511 103.102 24.058 102.769 23.6912C102.436 23.3245 102.184 22.8922 102.028 22.4221C101.872 21.952 101.816 21.4545 101.864 20.9615ZM107.41 20.9615C107.41 19.3374 106.681 18.3876 105.4 18.3876C104.115 18.3876 103.392 19.3374 103.392 20.9615C103.392 22.5987 104.115 23.5412 105.4 23.5412C106.681 23.5412 107.41 22.5922 107.41 20.9615H107.41Z" fill="black"/>
<path d="M110.489 22.5921C110.489 21.2434 111.493 20.4658 113.276 20.3553L115.306 20.2383V19.5916C115.306 18.8002 114.782 18.3534 113.772 18.3534C112.946 18.3534 112.374 18.6564 112.21 19.1862H110.779C110.93 17.8992 112.14 17.0737 113.84 17.0737C115.718 17.0737 116.778 18.0089 116.778 19.5916V24.7111H115.354V23.6581H115.237C115 24.0358 114.666 24.3437 114.271 24.5504C113.876 24.7571 113.433 24.8551 112.987 24.8345C112.672 24.8672 112.354 24.8337 112.054 24.736C111.753 24.6383 111.476 24.4787 111.241 24.2674C111.005 24.0562 110.817 23.7979 110.687 23.5094C110.558 23.2208 110.49 22.9084 110.489 22.5921ZM115.306 21.9519V21.3254L113.476 21.4424C112.444 21.5115 111.976 21.8625 111.976 22.523C111.976 23.1974 112.561 23.5898 113.366 23.5898C113.601 23.6137 113.839 23.5899 114.066 23.5198C114.292 23.4498 114.502 23.335 114.683 23.1821C114.864 23.0293 115.012 22.8417 115.119 22.6303C115.226 22.4189 115.29 22.1882 115.306 21.9519Z" fill="black"/>
<path d="M118.722 20.9615C118.722 18.594 119.939 17.0941 121.832 17.0941C122.3 17.0725 122.765 17.1847 123.172 17.4175C123.579 17.6503 123.911 17.994 124.13 18.4086H124.24V14.2935H125.719V24.7111H124.302V23.5273H124.185C123.949 23.9391 123.605 24.2786 123.191 24.5091C122.776 24.7395 122.306 24.8521 121.832 24.8346C119.926 24.8347 118.722 23.3348 118.722 20.9615ZM120.249 20.9615C120.249 22.5508 120.998 23.5071 122.251 23.5071C123.497 23.5071 124.268 22.537 124.268 20.968C124.268 19.4064 123.489 18.4225 122.251 18.4225C121.006 18.4225 120.249 19.3853 120.249 20.9615H120.249Z" fill="black"/>
<path d="M131.836 20.9614C131.789 20.469 131.845 19.9722 132.001 19.5028C132.158 19.0335 132.41 18.6019 132.743 18.2359C133.075 17.8699 133.481 17.5774 133.933 17.3772C134.386 17.1771 134.875 17.0737 135.37 17.0737C135.864 17.0737 136.353 17.1771 136.806 17.3772C137.258 17.5774 137.664 17.8699 137.996 18.2359C138.329 18.6019 138.582 19.0335 138.738 19.5028C138.894 19.9722 138.95 20.469 138.903 20.9614C138.951 21.4543 138.895 21.9518 138.74 22.4219C138.584 22.892 138.332 23.3243 137.999 23.6911C137.666 24.0579 137.26 24.3509 136.807 24.5515C136.355 24.7521 135.865 24.8557 135.37 24.8557C134.874 24.8557 134.385 24.7521 133.932 24.5515C133.479 24.3509 133.073 24.0579 132.74 23.6911C132.408 23.3243 132.155 22.892 131.999 22.4219C131.844 21.9518 131.788 21.4543 131.836 20.9614ZM137.382 20.9614C137.382 19.3372 136.652 18.3874 135.372 18.3874C134.087 18.3874 133.364 19.3372 133.364 20.9614C133.364 22.5986 134.087 23.541 135.372 23.541C136.652 23.541 137.382 22.592 137.382 20.9614Z" fill="black"/>
<path d="M140.888 17.2184H142.311V18.4087H142.422C142.609 17.9812 142.925 17.6228 143.326 17.3835C143.727 17.1442 144.192 17.036 144.658 17.0738C145.022 17.0464 145.388 17.1013 145.729 17.2346C146.069 17.3679 146.375 17.5761 146.624 17.8437C146.873 18.1113 147.059 18.4316 147.168 18.7807C147.276 19.1299 147.305 19.4989 147.251 19.8606V24.7111H145.772V20.2319C145.772 19.0278 145.249 18.429 144.156 18.429C143.908 18.4175 143.661 18.4596 143.431 18.5525C143.201 18.6454 142.995 18.7869 142.825 18.9672C142.655 19.1476 142.526 19.3625 142.447 19.5974C142.368 19.8322 142.34 20.0814 142.366 20.3278V24.7111H140.888V17.2184Z" fill="black"/>
<path d="M155.606 15.3528V17.2524H157.23V18.4979H155.606V22.3507C155.606 23.1356 155.93 23.4792 156.666 23.4792C156.854 23.4786 157.043 23.4672 157.23 23.4451V24.6768C156.964 24.7243 156.695 24.7496 156.425 24.7524C154.781 24.7524 154.126 24.1739 154.126 22.7293V18.4978H152.937V17.2523H154.126V15.3528H155.606Z" fill="black"/>
<path d="M159.25 14.2935H160.716V18.4225H160.833C161.029 17.991 161.354 17.6306 161.763 17.3904C162.172 17.1502 162.645 17.0419 163.117 17.0803C163.48 17.0606 163.843 17.1211 164.179 17.2576C164.516 17.3941 164.818 17.6032 165.065 17.87C165.311 18.1368 165.496 18.4547 165.605 18.8011C165.714 19.1474 165.746 19.5136 165.698 19.8736V24.7111H164.218V20.2384C164.218 19.0416 163.66 18.4355 162.615 18.4355C162.361 18.4146 162.106 18.4496 161.866 18.5379C161.627 18.6261 161.41 18.7656 161.23 18.9466C161.051 19.1275 160.913 19.3455 160.826 19.5854C160.739 19.8252 160.706 20.0811 160.729 20.3351V24.7111H159.25L159.25 14.2935Z" fill="black"/>
<path d="M174.32 22.6881C174.119 23.3729 173.684 23.9652 173.09 24.3615C172.497 24.7578 171.783 24.9328 171.073 24.8558C170.58 24.8688 170.089 24.7743 169.636 24.5787C169.182 24.3832 168.777 24.0913 168.447 23.7233C168.118 23.3553 167.873 22.9201 167.729 22.4479C167.584 21.9756 167.545 21.4776 167.612 20.9884C167.546 20.4977 167.587 19.9986 167.731 19.525C167.875 19.0513 168.119 18.614 168.446 18.2429C168.774 17.8717 169.177 17.5752 169.629 17.3735C170.081 17.1718 170.572 17.0696 171.067 17.0739C173.152 17.0739 174.409 18.4982 174.409 20.8511V21.367H169.118V21.4499C169.095 21.7249 169.13 22.0016 169.22 22.2625C169.31 22.5233 169.453 22.7624 169.641 22.9645C169.829 23.1666 170.057 23.3272 170.311 23.436C170.564 23.5449 170.838 23.5995 171.114 23.5964C171.468 23.6389 171.826 23.5752 172.143 23.4134C172.461 23.2517 172.723 22.9992 172.896 22.6881L174.32 22.6881ZM169.118 20.2734H172.903C172.922 20.0219 172.887 19.7694 172.803 19.5319C172.718 19.2944 172.584 19.0773 172.411 18.8945C172.237 18.7117 172.027 18.5672 171.794 18.4704C171.561 18.3736 171.311 18.3266 171.059 18.3324C170.803 18.3292 170.549 18.3772 170.312 18.4736C170.075 18.57 169.86 18.7129 169.679 18.8938C169.498 19.0747 169.356 19.29 169.259 19.5269C169.163 19.7638 169.115 20.0177 169.118 20.2734H169.118Z" fill="black"/>
</svg>
