{
	"process_id" : 26716,
	"version" : "2021.3.16f1",
	"app_path" : "C:/Program Files/Unity/Hub/Editor/2021.3.16f1/Editor/Unity.exe",
	"app_contents_path" : "C:/Program Files/Unity/Hub/Editor/2021.3.16f1/Editor/Data"
}