%YAML 1.1
%TAG !u! tag:unity3d.com,2011:
--- !u!114 &11400000
MonoBehaviour:
  m_ObjectHideFlags: 0
  m_CorrespondingSourceObject: {fileID: 0}
  m_PrefabInstance: {fileID: 0}
  m_PrefabAsset: {fileID: 0}
  m_GameObject: {fileID: 0}
  m_Enabled: 1
  m_EditorHideFlags: 0
  m_Script: {fileID: 11500000, guid: 9d1514134bc4fbd41bb739b1b9a49231, type: 3}
  m_Name: Node
  m_EditorClassIdentifier: 
  m_DefaultSprite: {fileID: 21300000, guid: 73ec44e4741057941bfbfd484bd0ff60, type: 3}
  m_DefaultGameObject: {fileID: 461601946045963208, guid: 21d48c01e32526b43b71415c145f1611, type: 3}
  m_DefaultColliderType: 1
  m_TilingRules: []
