%YAML 1.1
%TAG !u! tag:unity3d.com,2011:
--- !u!1001 &4474129805555759403
PrefabInstance:
  m_ObjectHideFlags: 0
  serializedVersion: 2
  m_Modification:
    m_TransformParent: {fileID: 0}
    m_Modifications:
    - target: {fileID: 4113045537049072037, guid: 2fde9760580df734b965459e729d1aba, type: 3}
      propertyPath: m_Sprite
      value: 
      objectReference: {fileID: 21300000, guid: d65aa956b7569874fab274083826a77f, type: 3}
    - target: {fileID: 5743013704039800242, guid: 2fde9760580df734b965459e729d1aba, type: 3}
      propertyPath: m_Name
      value: Ghost_Blinky
      objectReference: {fileID: 0}
    - target: {fileID: 6425241702975275456, guid: 2fde9760580df734b965459e729d1aba, type: 3}
      propertyPath: initialBehavior
      value: 
      objectReference: {fileID: 7499785222042464871}
    - target: {fileID: 8358539419159588431, guid: 2fde9760580df734b965459e729d1aba, type: 3}
      propertyPath: m_RootOrder
      value: 0
      objectReference: {fileID: 0}
    - target: {fileID: 8358539419159588431, guid: 2fde9760580df734b965459e729d1aba, type: 3}
      propertyPath: m_LocalPosition.x
      value: 0
      objectReference: {fileID: 0}
    - target: {fileID: 8358539419159588431, guid: 2fde9760580df734b965459e729d1aba, type: 3}
      propertyPath: m_LocalPosition.y
      value: 0
      objectReference: {fileID: 0}
    - target: {fileID: 8358539419159588431, guid: 2fde9760580df734b965459e729d1aba, type: 3}
      propertyPath: m_LocalPosition.z
      value: -1
      objectReference: {fileID: 0}
    - target: {fileID: 8358539419159588431, guid: 2fde9760580df734b965459e729d1aba, type: 3}
      propertyPath: m_LocalRotation.w
      value: 1
      objectReference: {fileID: 0}
    - target: {fileID: 8358539419159588431, guid: 2fde9760580df734b965459e729d1aba, type: 3}
      propertyPath: m_LocalRotation.x
      value: 0
      objectReference: {fileID: 0}
    - target: {fileID: 8358539419159588431, guid: 2fde9760580df734b965459e729d1aba, type: 3}
      propertyPath: m_LocalRotation.y
      value: 0
      objectReference: {fileID: 0}
    - target: {fileID: 8358539419159588431, guid: 2fde9760580df734b965459e729d1aba, type: 3}
      propertyPath: m_LocalRotation.z
      value: 0
      objectReference: {fileID: 0}
    - target: {fileID: 8358539419159588431, guid: 2fde9760580df734b965459e729d1aba, type: 3}
      propertyPath: m_LocalEulerAnglesHint.x
      value: 0
      objectReference: {fileID: 0}
    - target: {fileID: 8358539419159588431, guid: 2fde9760580df734b965459e729d1aba, type: 3}
      propertyPath: m_LocalEulerAnglesHint.y
      value: 0
      objectReference: {fileID: 0}
    - target: {fileID: 8358539419159588431, guid: 2fde9760580df734b965459e729d1aba, type: 3}
      propertyPath: m_LocalEulerAnglesHint.z
      value: 0
      objectReference: {fileID: 0}
    - target: {fileID: 8516650085219901479, guid: 2fde9760580df734b965459e729d1aba, type: 3}
      propertyPath: m_Color.b
      value: 0.030562414
      objectReference: {fileID: 0}
    - target: {fileID: 8516650085219901479, guid: 2fde9760580df734b965459e729d1aba, type: 3}
      propertyPath: m_Color.g
      value: 0.030562414
      objectReference: {fileID: 0}
    - target: {fileID: 8516650085219901479, guid: 2fde9760580df734b965459e729d1aba, type: 3}
      propertyPath: m_Color.r
      value: 0.9528302
      objectReference: {fileID: 0}
    m_RemovedComponents: []
  m_SourcePrefab: {fileID: 100100000, guid: 2fde9760580df734b965459e729d1aba, type: 3}
--- !u!114 &7499785222042464871 stripped
MonoBehaviour:
  m_CorrespondingSourceObject: {fileID: 6198039090826562380, guid: 2fde9760580df734b965459e729d1aba, type: 3}
  m_PrefabInstance: {fileID: 4474129805555759403}
  m_PrefabAsset: {fileID: 0}
  m_GameObject: {fileID: 0}
  m_Enabled: 0
  m_EditorHideFlags: 0
  m_Script: {fileID: 11500000, guid: d90e4b56b62e12c4dab1ac724d70d134, type: 3}
  m_Name: 
  m_EditorClassIdentifier: 
