%YAML 1.1
%TAG !u! tag:unity3d.com,2011:
--- !u!1001 &9103247671655707554
PrefabInstance:
  m_ObjectHideFlags: 0
  serializedVersion: 2
  m_Modification:
    m_TransformParent: {fileID: 0}
    m_Modifications:
    - target: {fileID: 5743013704039800242, guid: 2fde9760580df734b965459e729d1aba, type: 3}
      propertyPath: m_Name
      value: Ghost_Inky
      objectReference: {fileID: 0}
    - target: {fileID: 6425241702975275456, guid: 2fde9760580df734b965459e729d1aba, type: 3}
      propertyPath: initialBehavior
      value: 
      objectReference: {fileID: 7439874238046613837}
    - target: {fileID: 8358539419159588431, guid: 2fde9760580df734b965459e729d1aba, type: 3}
      propertyPath: m_RootOrder
      value: 0
      objectReference: {fileID: 0}
    - target: {fileID: 8358539419159588431, guid: 2fde9760580df734b965459e729d1aba, type: 3}
      propertyPath: m_LocalPosition.x
      value: 0
      objectReference: {fileID: 0}
    - target: {fileID: 8358539419159588431, guid: 2fde9760580df734b965459e729d1aba, type: 3}
      propertyPath: m_LocalPosition.y
      value: 0.98
      objectReference: {fileID: 0}
    - target: {fileID: 8358539419159588431, guid: 2fde9760580df734b965459e729d1aba, type: 3}
      propertyPath: m_LocalPosition.z
      value: -1
      objectReference: {fileID: 0}
    - target: {fileID: 8358539419159588431, guid: 2fde9760580df734b965459e729d1aba, type: 3}
      propertyPath: m_LocalRotation.w
      value: 1
      objectReference: {fileID: 0}
    - target: {fileID: 8358539419159588431, guid: 2fde9760580df734b965459e729d1aba, type: 3}
      propertyPath: m_LocalRotation.x
      value: 0
      objectReference: {fileID: 0}
    - target: {fileID: 8358539419159588431, guid: 2fde9760580df734b965459e729d1aba, type: 3}
      propertyPath: m_LocalRotation.y
      value: 0
      objectReference: {fileID: 0}
    - target: {fileID: 8358539419159588431, guid: 2fde9760580df734b965459e729d1aba, type: 3}
      propertyPath: m_LocalRotation.z
      value: 0
      objectReference: {fileID: 0}
    - target: {fileID: 8358539419159588431, guid: 2fde9760580df734b965459e729d1aba, type: 3}
      propertyPath: m_LocalEulerAnglesHint.x
      value: 0
      objectReference: {fileID: 0}
    - target: {fileID: 8358539419159588431, guid: 2fde9760580df734b965459e729d1aba, type: 3}
      propertyPath: m_LocalEulerAnglesHint.y
      value: 0
      objectReference: {fileID: 0}
    - target: {fileID: 8358539419159588431, guid: 2fde9760580df734b965459e729d1aba, type: 3}
      propertyPath: m_LocalEulerAnglesHint.z
      value: 0
      objectReference: {fileID: 0}
    m_RemovedComponents: []
  m_SourcePrefab: {fileID: 100100000, guid: 2fde9760580df734b965459e729d1aba, type: 3}
--- !u!114 &7439874238046613837 stripped
MonoBehaviour:
  m_CorrespondingSourceObject: {fileID: 1831423211840570095, guid: 2fde9760580df734b965459e729d1aba, type: 3}
  m_PrefabInstance: {fileID: 9103247671655707554}
  m_PrefabAsset: {fileID: 0}
  m_GameObject: {fileID: 0}
  m_Enabled: 0
  m_EditorHideFlags: 0
  m_Script: {fileID: 11500000, guid: e56e93f9a85f2174dadd6fdb859d8f73, type: 3}
  m_Name: 
  m_EditorClassIdentifier: 
