%YAML 1.1
%TAG !u! tag:unity3d.com,2011:
--- !u!1045 &1
EditorBuildSettings:
  m_ObjectHideFlags: 0
  serializedVersion: 2
  m_Scenes:
  - enabled: 1
    path: Assets/Scenes/login.unity
    guid: a8814e1e14cab2040a3905a2d434e316
  - enabled: 1
    path: Assets/Scenes/uploadImage.unity
    guid: 3e569de03ca2bac47a5eed3f3034b160
  - enabled: 1
    path: Assets/Scenes/SampleScene.unity
    guid: 9fc0d4010bbf28b4594072e72b8655ab
  m_configObjects: {}
