C:\Users\uber\Desktop\cours Sesame 4eme\Semestre 2\J2EE\springboot-bank-project-with-thymeleaf-master\src\main\java\com\example\demo\repository\Employeerepo.java
C:\Users\uber\Desktop\cours Sesame 4eme\Semestre 2\J2EE\springboot-bank-project-with-thymeleaf-master\src\main\java\com\example\demo\BankApplication.java
C:\Users\uber\Desktop\cours Sesame 4eme\Semestre 2\J2EE\springboot-bank-project-with-thymeleaf-master\src\main\java\com\example\demo\entities\Groupe.java
C:\Users\uber\Desktop\cours Sesame 4eme\Semestre 2\J2EE\springboot-bank-project-with-thymeleaf-master\src\main\java\com\example\demo\repository\AccountCrepo.java
C:\Users\uber\Desktop\cours Sesame 4eme\Semestre 2\J2EE\springboot-bank-project-with-thymeleaf-master\src\main\java\com\example\demo\entities\Client.java
C:\Users\uber\Desktop\cours Sesame 4eme\Semestre 2\J2EE\springboot-bank-project-with-thymeleaf-master\src\main\java\com\example\demo\repository\versementRepo.java
C:\Users\uber\Desktop\cours Sesame 4eme\Semestre 2\J2EE\springboot-bank-project-with-thymeleaf-master\src\main\java\com\example\demo\entities\Compte.java
C:\Users\uber\Desktop\cours Sesame 4eme\Semestre 2\J2EE\springboot-bank-project-with-thymeleaf-master\src\main\java\com\example\demo\entities\CompteE.java
C:\Users\uber\Desktop\cours Sesame 4eme\Semestre 2\J2EE\springboot-bank-project-with-thymeleaf-master\src\main\java\com\example\demo\entities\Employee.java
C:\Users\uber\Desktop\cours Sesame 4eme\Semestre 2\J2EE\springboot-bank-project-with-thymeleaf-master\src\main\java\com\example\demo\controllers\AccountCcontroller.java
C:\Users\uber\Desktop\cours Sesame 4eme\Semestre 2\J2EE\springboot-bank-project-with-thymeleaf-master\src\main\java\com\example\demo\entities\Operation.java
C:\Users\uber\Desktop\cours Sesame 4eme\Semestre 2\J2EE\springboot-bank-project-with-thymeleaf-master\src\main\java\com\example\demo\repository\retraitRepo.java
C:\Users\uber\Desktop\cours Sesame 4eme\Semestre 2\J2EE\springboot-bank-project-with-thymeleaf-master\src\main\java\com\example\demo\controllers\opRetraitController.java
C:\Users\uber\Desktop\cours Sesame 4eme\Semestre 2\J2EE\springboot-bank-project-with-thymeleaf-master\src\main\java\com\example\demo\controllers\opversementController.java
C:\Users\uber\Desktop\cours Sesame 4eme\Semestre 2\J2EE\springboot-bank-project-with-thymeleaf-master\src\main\java\com\example\demo\repository\GroupRepo.java
C:\Users\uber\Desktop\cours Sesame 4eme\Semestre 2\J2EE\springboot-bank-project-with-thymeleaf-master\src\main\java\com\example\demo\entities\Retrait.java
C:\Users\uber\Desktop\cours Sesame 4eme\Semestre 2\J2EE\springboot-bank-project-with-thymeleaf-master\src\main\java\com\example\demo\repository\AccountErepo.java
C:\Users\uber\Desktop\cours Sesame 4eme\Semestre 2\J2EE\springboot-bank-project-with-thymeleaf-master\src\main\java\com\example\demo\entities\CompteC.java
C:\Users\uber\Desktop\cours Sesame 4eme\Semestre 2\J2EE\springboot-bank-project-with-thymeleaf-master\src\main\java\com\example\demo\repository\operationRepo.java
C:\Users\uber\Desktop\cours Sesame 4eme\Semestre 2\J2EE\springboot-bank-project-with-thymeleaf-master\src\main\java\com\example\demo\controllers\AccountEcontroller.java
C:\Users\uber\Desktop\cours Sesame 4eme\Semestre 2\J2EE\springboot-bank-project-with-thymeleaf-master\src\main\java\com\example\demo\entities\Versement.java
C:\Users\uber\Desktop\cours Sesame 4eme\Semestre 2\J2EE\springboot-bank-project-with-thymeleaf-master\src\main\java\com\example\demo\repository\Accountrepo.java
C:\Users\uber\Desktop\cours Sesame 4eme\Semestre 2\J2EE\springboot-bank-project-with-thymeleaf-master\src\main\java\com\example\demo\controllers\EmployeeController.java
C:\Users\uber\Desktop\cours Sesame 4eme\Semestre 2\J2EE\springboot-bank-project-with-thymeleaf-master\src\main\java\com\example\demo\controllers\ClientController.java
C:\Users\uber\Desktop\cours Sesame 4eme\Semestre 2\J2EE\springboot-bank-project-with-thymeleaf-master\src\main\java\com\example\demo\repository\ClientRepo.java
