train467@cori09:~/sw/build> spack spec -l /ggdbuk5
Input spec
--------------------------------
xerces-c@3.2.2%intel@19.0.3.199 cxxstd=default transcoder=gnuiconv arch=cray-cnl7-haswell
    ^libiconv@1.16%intel@19.0.3.199 arch=cray-cnl7-haswell

Concretized
--------------------------------
ggdbuk5  xerces-c@3.2.2%intel@19.0.3.199 cxxstd=default transcoder=gnuiconv arch=cray-cnl7-haswell
vr7hfhz      ^libiconv@1.16%intel@19.0.3.199 arch=cray-cnl7-haswell



