2022-05-09 16:02:23,257 - api.get_token - WARNING - could not verify
2022-05-09 16:02:50,651 - api.get_token - WARNING - could not verify
2022-05-09 16:03:02,637 - api.get_token - WARNING - could not verify
2022-05-09 16:03:20,038 - api.get_token - WARNING - could not verify
2022-05-09 16:04:05,111 - api.get_token - WARNING - could not verify
2022-05-09 16:06:19,596 - api.get_token - WARNING - could not verify
2022-05-09 16:40:14,076 - api.get_token - WARNING - could not verify
2022-05-10 11:18:09,435 - api.get_token - WARNING - could not verify
2022-05-10 11:23:54,338 - api.get_token - WARNING - could not verify
2022-05-10 11:25:53,201 - api.get_token - WARNING - could not verify
2022-05-10 13:33:25,588 - api.get_token - WARNING - could not verify
2022-05-10 13:33:58,287 - api.get_token - WARNING - could not verify
