[
    {
        "cardType": {
            "code": "C",
            "description": "VISA",
            "id": "1",
            "active": true
        },
        "patientOID": "163954",
        "pciTokenized": "T427007261122598477709723",
        "middleName": "I",
        "lastName": "FRANCK",
        "lastFour": 9723,
        "firstName": "NANCY",
        "familyAccountOID": "434276",
        "expirationYear": 2017,
        "expirationMonth": 4,
        "creditCardZipCode": 0,
        "creditCardOID": "225004",
        "active": true,
        "fsa": false,
        "defaultCard": true
    }
]