[
    {
        "healthConditions": [
            {
                "healthConditionOID": "149",
                "name": "Diabetes"
            }
        ],
        "drugAllergies": [
            {
                "allergyOID": "00057",
                "name": "Aleve"
            }
        ],
        "patientId": "4000"
    },
    {
        "healthConditions": [
            {
                "healthConditionOID": "9552",
                "name": "Hypertension"
            }
        ],
        "drugAllergies": [
            {
                "allergyOID": "00026",
                "name": "amoxicillin"
            }
        ],
        "patientId": "200"
    }
]