[
{
    "firstName": "HUMBERTO",
    "lastName": "SOCORRO",
    "dob": "1988-03-05",
    "gender": "MALE",
    "coverages": [],
    "uniqueMemberId": "2000"
},
{
    "firstName": "MICHAEL",
    "lastName": "FRANCK",
    "dob": "1965-12-15",
    "gender": "MALE",
    "coverages": [],
    "uniqueMemberId": "2001"
},
{
    "firstName": "NANCY",
    "lastName": "FRANCK",
    "dob": "1964-12-04",
    "gender": "FEMALE",
    "coverages": [],
    "uniqueMemberId": "2002"
},
{
    "firstName": "ERIC",
    "lastName": "FRANCK",
    "dob": "2005-04-02",
    "gender": "MALE",
    "coverages": [],
    "uniqueMemberId": "2003"
},
{
    "firstName": "WAYNE",
    "lastName": "WELDON",
    "dob": "1952-05-12",
    "gender": "MALE",
    "coverages": [],
    "uniqueMemberId": "2004"
},
{
	"firstName": "MICHAEL",
    "lastName": "FRANCK",
    "dob": "1966-12-15",
    "gender": "MALE",
    "coverages": [],
    "uniqueMemberId": "21403683"
},
{
	"firstName": "NANCY",
    "lastName": "FRANCK",
    "dob": "1964-12-04",
    "gender": "FEMALE",
    "coverages": [],
    "uniqueMemberId": "21403907"
},
{
	"firstName": "ERIC",
    "lastName": "FRANCK",
    "dob": "2005-04-02",
    "gender": "MALE",
    "coverages": [],
    "uniqueMemberId": "21404086"
},
{
	"firstName": "ANGELA",
    "lastName": "BROWNLOW",
    "dob": "1971-11-15",
    "gender": "FEMALE",
    "coverages": [],
    "uniqueMemberId": "21404199"
},
{
	"firstName": "LOGAN",
    "lastName": "BROWNLOW",
    "dob": "2000-07-09",
    "gender": "MALE",
    "coverages": [],
    "uniqueMemberId": "21404055"
},
{
	"firstName": "JACE",
    "lastName": "BROWNLOW",
    "dob": "2005-11-09",
    "gender": "MALE",
    "coverages": [],
    "uniqueMemberId": "21404101"
},
{
	"firstName": "DREW",
    "lastName": "BROWNLOW",
    "dob": "1990-03-06",
    "gender": "MALE",
    "coverages": [],
    "uniqueMemberId": "21404106"
}
]
