[
    {
        "allergyOID": "00178",
        "name": "Abacavir"
    }, 
    {
        "allergyOID": "00333",
        "name": "penicillin"
    }, 
    {
        "allergyOID": "00423",
        "name": "etuximab"
    }, 
    {
        "allergyOID": "00434",
        "name": "nevirapine"
    }
]