{
    "firstName": "MICHAEL",
    "lastName": "FRANCK",
    "dob": "1966-12-15",
    "gender": "MALE",
    "coverages": [
        {
            "carrierId": "RWTWDBENE",
            "accountId": "WLDYN",
            "groupId": "WDIN",
            "requestedMember": {
                "firstName": "MICHAEL",
                "lastName": "FRANCK",
                "dob": "1966-12-15",
                "gender": "MALE",
                "uniqueMemberId": "21403683",
                "patientId": "163930",
                "coverageSlices": [
                    {
                        "memberId": "1005F5E8798301",
                        "relationship": "SPOUSE",
                        "hipaaAuthorise": true,
                        "startDate": "2015-06-01",
                        "endDate": "2039-12-31"
                    }
                ]
            },
            "familyMembers": [
                {
                    "firstName": "NANCY",
                    "lastName": "FRANCK",
                    "dob": "1964-12-04",
                    "gender": "FEMALE",
                    "uniqueMemberId": "21403907",
                    "patientId": "163954",
                    "coverageSlices": [
                        {
                            "memberId": "1005F5E8798300",
                            "relationship": "CARDHOLDER",
                            "hipaaAuthorise": false,
                            "startDate": "2015-06-01",
                            "endDate": "2039-12-31"
                        }
                    ]
                },
                {
                    "firstName": "ERIC",
                    "lastName": "FRANCK",
                    "dob": "2005-04-02",
                    "gender": "MALE",
                    "uniqueMemberId": "21404086",
                    "patientId": "163955",
                    "coverageSlices": [
                        {
                            "memberId": "1005F5E8798302",
                            "relationship": "CHILD",
                            "hipaaAuthorise": false,
                            "startDate": "2015-06-01",
                            "endDate": "2039-12-31"
                        }
                    ]
                }
            ],
            "plans": [
                {
                    "planId": "MEDIMPACT",
                    "startDate": "2019-09-09",
                    "endDate": null
                },
                {
                    "planId": "NCS",
                    "startDate": "2015-06-19",
                    "endDate": null
                },
                {
                    "planId": "DEFAULT PAYER",
                    "startDate": "2015-06-19",
                    "endDate": "2019-04-16"
                }
            ]
        }
    ],
    "uniqueMemberId": "21403683",
    "contactDetails": null
}