{
  "type": "service_account",
  "project_id": "shopfurries",
  "private_key_id": "0314acc8cd744f47accb549cfede853482eaacc4",
  "private_key": "-----BEGIN PRIVATE KEY-----\nMIIEuwIBADANBgkqhkiG9w0BAQEFAASCBKUwggShAgEAAoIBAQDs9dVGKJTD0MKt\nILbbSwuAu/LZGMKvd789DZlz03HKLL5rk7s7AuPA8SYQ5jjaeFIIHxv1hZUk73l+\nXM3T+FMLf1I3JRXiJYnzQ7bjJkUmqcLOUII5l8NG+JVyzgSA/jWczSK0+shJopff\n0aUh32DanXUAcBhDvXxYD3a1Q756P8wi1h2evSjQFo9uChDB0yx13uul4bIZslDv\nBr4Gv4zFLjibyYuMexowtXw6xrsGhT7aqHfot8OpGTos2o11rUepnjBktMjSfXPi\nMJk/TBklLG5/4zADFlInR22ZMsDTK6nDPEzt4n9hCwNgQbGoNvFEPhACGUPI9x4w\nt7huL28vAgMBAAECgf9Or+Gj1G3UsPv9eOFCIK+ZWwES2Yt2YaWD/TKIi2gnO//V\nqvlf2EwcWOLYb4b8J689y8O1Bj428BZ5XGH1d9AH9J+U+XilLHTyC7ClLo8VmkNE\nVvhTD07RroneP+QiLGdouECNYhgIJFcDsTYcgsZCkQBWJ6hhAGHG4L5WFgcXOlWW\nJ9wtkA+5MboDKc7Jf0fqqq3ndrSmtpyaOhQDD64NrPfiHNfl7Ytcdijm0iqC0g38\nnxza4YV/3Rw6zSl9BDnQeLzHLjyphQUM/69w0Gktpe7Dsc+L0qgSxASbxzzG5RzS\nfJcJDwYOnfloBxmeXWgxb3JvTj4dVFeutwNqL60CgYEA/Fv+2fho4dEyFgRJLVLk\noxWcvrQjwCUQ9bqP2jpX9QfrwTAHq5k1IM+r1hlICCuG/JcyD+58Y/pqNLvlpRa/\nRHZ/0Bm3T9iWF+AiiHhpVsQsO5dDe8aKTYcJCUrIkhUYxEw/t+vQ7o/SLP8fr6Ax\nRj31jLT2Ct+UjnsN6eR+Ie0CgYEA8GD3XtROVC/jekHtO2UiwCw2XnUxYGlSIbIz\n/Bbg1SCWfdwEQe//xv8oC43uGTAVEfbVLG7mUaaCm8z8KZXu3d8KJqM+szTytrYL\nF8BKidmwXOT89FJGEU9dvIK0P9sXbukexf2bEhGdVLwUvmN6vdFXg0t4gywGQ2yo\nHz78ogsCgYB64bDvIm6vxtXEssGPOFXss5Fnqv/diC8B+J4jfVVnEzxRDboubKPa\nHkVmM1lH4SoRxO2zpEUdycn9c6EXCkSIactC4cLJNoWfipxGJ5vjjBKd0cIie0LN\nDXvw8mFIAM3Wh+pe/Iz4HUASeQhM1Iwpz/HJWjSUhtonpvPXeFOS4QKBgQC9LuOh\na6AWG/aBUv+dnlRCQMmtf7iTs3Bjerf1MCBVPKeUeKOVLYj1mf1vUo3QnwoGMGjH\n5qQ4IL9sVWEkbY8oaZC4pgQD0KkxaYbDc6B2a7Ck+8elllb06qzQX2HzW8BOlwSU\nOKtiBiD3/mqpCOwiFm80syIuwmhPimWq6cy0zwKBgFT0svb/UFnLpaAPpAUjEOF2\nFETm6MTAgWb0D1/X6D4ajOzedv0Nv4y9qkBIDjKcOkjFz9yvzrc3yF60Ptlc737d\nQhCM1ae9to9dpxklA8VjM9XGQvOfjCqKoHnbreP2hD3TMfuts7fMqZ8xFdColt3X\nwGHTZwzVdW/KTHh6XaHl\n-----END PRIVATE KEY-----\n",
  "client_email": "shopfurries-service@shopfurries.iam.gserviceaccount.com",
  "client_id": "110012034154648419625",
  "auth_uri": "https://accounts.google.com/o/oauth2/auth",
  "token_uri": "https://oauth2.googleapis.com/token",
  "auth_provider_x509_cert_url": "https://www.googleapis.com/oauth2/v1/certs",
  "client_x509_cert_url": "https://www.googleapis.com/robot/v1/metadata/x509/shopfurries-service%40shopfurries.iam.gserviceaccount.com"
}
