{
    "$schema": "https://schema.management.azure.com/schemas/2019-04-01/deploymentTemplate.json#",
    "contentVersion": "1.0.0.1",
    "parameters": {
        "rgName": {
            "type": "string",
            "defaultValue": "test-rg"
        },
        "rgLocation": {
            "type": "string",
            "defaultValue": "northeurope"
        },
        "tags": {
            "type": "object",
            "defaultValue": {}
        }
    },
    "variables": {},
    "resources": [
        {
            "type": "Microsoft.Resources/resourceGroups",
            "apiVersion": "2018-05-01",
            "location": "[parameters('rgLocation')]",
            "name": "[parameters('rgName')]",
            "properties": {},
            "tags": "[parameters('tags')]"
        }
    ],
    "outputs": {}
}
