<?xml version="1.0" encoding="utf-8"?>
<svg version="1.1" xmlns="http://www.w3.org/2000/svg" xmlns:xlink="http://www.w3.org/1999/xlink" height="12" width="12.545000000000073">
  <defs>
    <path id="path-0" opacity="1" d="M6.235394895637552,2.1198260869565217 C6.736251755861115,0.8720869565217388 7.880429221485807,0.00026086956521724 9.211249084973787,0.00026086956521724 C11.003959244237809,0.00026086956521724 12.295067959244237,1.6121739130434785 12.45738727866258,3.533217391304347 C12.45738727866258,3.533217391304347 12.545000000000002,4.010086956521739 12.352152735186468,4.868608695652173 C12.089562765852213,6.03782608695652 11.472302601642102,7.0766086956521725 10.640105846275597,7.869391304347825 L6.235394895637552,12 L1.904894153724404,7.869130434782608 C1.0726973983578987,7.0766086956521725 0.45543723414778914,6.037565217391304 0.1928472648135325,4.868347826086956 C0,4.009826086956521 0.08761272133742216,3.5329565217391306 0.08761272133742216,3.5329565217391306 C0.24993204075576209,1.611913043478261 1.5410407557621921,0 3.333750915026215,0 C4.664818973192205,0 5.734538035413988,0.8720869565217391 6.235394895637552,2.1198260869565217Z"/>
  </defs>
  <g opacity="1">
    <g opacity="1">
      <use xlink:href="#path-0" fill="rgb(215,90,74)" fill-opacity="1"/>
    </g>
  </g>
</svg>