<svg width="16" height="17" viewBox="0 0 16 17" fill="none" xmlns="http://www.w3.org/2000/svg">
<path d="M11.727 12.5996L12.667 11.6596L9.61366 8.59961L12.667 5.53961L11.727 4.59961L7.72699 8.59961L11.727 12.5996Z" fill="#333333"/>
<path d="M7.33344 12.5996L8.27344 11.6596L5.2201 8.59961L8.27344 5.53961L7.33344 4.59961L3.33344 8.59961L7.33344 12.5996Z" fill="#333333"/>
</svg>
