<svg width="25" height="25" viewBox="0 0 25 25" fill="none" xmlns="http://www.w3.org/2000/svg">
<path d="M19.6511 6.05424C19.8464 5.85897 19.8464 5.54239 19.6511 5.34713C19.4559 5.15187 19.1393 5.15187 18.944 5.34713L19.6511 6.05424ZM15.1662 9.12491C14.971 9.32017 14.971 9.63675 15.1662 9.83201C15.3615 10.0273 15.6781 10.0273 15.8734 9.83201L15.1662 9.12491ZM15.8734 15.1684C15.6781 14.9731 15.3615 14.9731 15.1662 15.1684C14.971 15.3636 14.971 15.6802 15.1662 15.8755L15.8734 15.1684ZM18.944 19.6532C19.1393 19.8485 19.4559 19.8485 19.6511 19.6532C19.8464 19.458 19.8464 19.1414 19.6511 18.9461L18.944 19.6532ZM9.12279 9.83201C9.31805 10.0273 9.63463 10.0273 9.8299 9.83201C10.0252 9.63675 10.0252 9.32017 9.8299 9.12491L9.12279 9.83201ZM6.05212 5.34713C5.85686 5.15187 5.54027 5.15187 5.34501 5.34713C5.14975 5.54239 5.14975 5.85897 5.34501 6.05424L6.05212 5.34713ZM9.8299 15.8755C10.0252 15.6802 10.0252 15.3636 9.8299 15.1684C9.63463 14.9731 9.31805 14.9731 9.12279 15.1684L9.8299 15.8755ZM5.34501 18.9461C5.14975 19.1414 5.14975 19.458 5.34501 19.6532C5.54027 19.8485 5.85686 19.8485 6.05212 19.6532L5.34501 18.9461ZM2.88281 12.5001L2.38281 12.5001L2.88281 12.5001ZM18.944 5.34713L15.1662 9.12491L15.8734 9.83201L19.6511 6.05424L18.944 5.34713ZM15.1662 15.8755L18.944 19.6532L19.6511 18.9461L15.8734 15.1684L15.1662 15.8755ZM9.8299 9.12491L6.05212 5.34713L5.34501 6.05424L9.12279 9.83201L9.8299 9.12491ZM9.12279 15.1684L5.34501 18.9461L6.05212 19.6532L9.8299 15.8755L9.12279 15.1684ZM21.6136 12.5001C21.6136 15.7568 19.8762 18.766 17.0559 20.3943L17.5559 21.2603C20.6856 19.4534 22.6136 16.114 22.6136 12.5001L21.6136 12.5001ZM17.0559 20.3943C14.2356 22.0226 10.7608 22.0226 7.9405 20.3943L7.4405 21.2603C10.5702 23.0673 14.4262 23.0673 17.5559 21.2603L17.0559 20.3943ZM7.9405 20.3943C5.12019 18.766 3.38281 15.7568 3.38281 12.5001L2.38281 12.5001C2.38281 16.114 4.31079 19.4534 7.4405 21.2603L7.9405 20.3943ZM3.38281 12.5001C3.38281 7.46586 7.46391 3.38477 12.4982 3.38477V2.38477C6.91162 2.38477 2.38281 6.91358 2.38281 12.5001L3.38281 12.5001ZM12.4982 3.38477C17.5325 3.38477 21.6136 7.46586 21.6136 12.5001L22.6136 12.5001C22.6136 6.91358 18.0848 2.38477 12.4982 2.38477V3.38477Z" fill="#F47500"/>
<path fill-rule="evenodd" clip-rule="evenodd" d="M16.7736 12.5001C16.7736 14.8603 14.8603 16.7736 12.5001 16.7736C10.1399 16.7736 8.22656 14.8603 8.22656 12.5001C8.22656 10.1399 10.1399 8.22656 12.5001 8.22656C14.8603 8.22656 16.7736 10.1399 16.7736 12.5001V12.5001Z" stroke="#F47500"/>
</svg>
