<svg width="20" height="20" viewBox="0 0 20 20" fill="none" xmlns="http://www.w3.org/2000/svg">
<path d="M14.5332 12.1846L16.6665 10.0513L14.5332 7.91797" stroke="white" stroke-width="1.25" stroke-miterlimit="10" stroke-linecap="round" stroke-linejoin="round"/>
<path d="M8.13281 10.0508H16.6078" stroke="white" stroke-width="1.25" stroke-miterlimit="10" stroke-linecap="round" stroke-linejoin="round"/>
<path d="M9.79948 16.6654C6.11615 16.6654 3.13281 14.1654 3.13281 9.9987C3.13281 5.83203 6.11615 3.33203 9.79948 3.33203" stroke="white" stroke-width="1.25" stroke-miterlimit="10" stroke-linecap="round" stroke-linejoin="round"/>
</svg>
