<svg width="24" height="24" viewBox="0 0 24 24" fill="none" xmlns="http://www.w3.org/2000/svg">
<g clip-path="url(#clip0_557_4503)">
<path d="M5.71875 0.107812C5.04844 0.337499 4.52813 0.782812 4.24688 1.36875C4.0125 1.87031 3.98438 2.08125 3.98438 3.35156V4.5H4.49531H5.01094L5.025 3.3375L5.03906 2.175L5.19375 1.86562C5.37188 1.5 5.63438 1.26094 6 1.12031C6.20156 1.04531 6.36094 1.03125 7.09688 1.03125H7.95469L8.01094 1.30312C8.10469 1.77187 8.44688 2.19844 8.90156 2.40937C9.1125 2.50781 9.16875 2.50781 12 2.50781C14.8313 2.50781 14.8875 2.50781 15.0984 2.40937C15.5531 2.19844 15.8953 1.77187 15.9891 1.30312L16.0453 1.03125H16.8984C17.8641 1.03125 18.0188 1.06406 18.3984 1.35C18.5672 1.47656 18.6797 1.6125 18.7969 1.84687L18.9609 2.17031L18.975 9.33281L18.9844 16.5H19.5H20.0156V9.35156C20.0156 4.37344 20.0016 2.13281 19.9641 1.95937C19.8281 1.30312 19.3078 0.604687 18.7266 0.295312C18.1266 -0.0187507 18.5578 -6.55651e-07 11.9813 -6.55651e-07L6.02344 0.00468684L5.71875 0.107812ZM14.9531 1.09687C14.9531 1.21406 14.7609 1.40156 14.5875 1.45312C14.3531 1.51875 9.64688 1.51875 9.4125 1.45312C9.23906 1.40156 9.04688 1.21406 9.04688 1.09687C9.04688 1.04062 9.53438 1.03125 12 1.03125C14.4656 1.03125 14.9531 1.04062 14.9531 1.09687Z" fill="#F47500"/>
<path d="M14.2688 4.05469C13.5891 4.2 13.0172 4.51875 12.5157 5.01563C11.7844 5.75156 11.4516 6.61406 11.4985 7.66406C11.5688 9.19219 12.525 10.4156 14.0157 10.8844C14.311 10.9734 14.4657 10.9922 15 10.9922C15.5344 10.9922 15.6891 10.9734 15.9844 10.8844C17.1704 10.5094 18.0094 9.67031 18.3844 8.48438C18.4735 8.18906 18.4922 8.03438 18.4922 7.5C18.4922 6.96563 18.4735 6.81094 18.3844 6.51563C18.1641 5.8125 17.7563 5.19844 17.2266 4.76719C16.8563 4.46719 16.1907 4.14844 15.7407 4.05938C15.3094 3.97031 14.6625 3.97031 14.2688 4.05469ZM15.5813 5.10938C16.0547 5.23125 16.411 5.43281 16.7579 5.78906C17.1 6.13594 17.3204 6.55313 17.4235 7.05469C17.6063 7.95 17.2313 8.90156 16.4672 9.47344C16.1391 9.72656 15.7922 9.86719 15.3235 9.94688C14.7422 10.0453 14.0485 9.8625 13.5329 9.47344C12.7688 8.90156 12.3938 7.95 12.5766 7.05469C12.6891 6.52031 12.8907 6.13594 13.261 5.77031C13.6219 5.40938 13.9219 5.23594 14.4 5.10938C14.8407 4.99219 15.136 4.99219 15.5813 5.10938Z" fill="#F47500"/>
<path d="M14.0203 6.00937C13.5797 6.3 13.2188 6.5625 13.2188 6.58594C13.2188 6.62344 13.6641 7.33125 13.7625 7.44375C13.7672 7.45312 13.9313 7.35469 14.1281 7.22344L14.4844 6.97969V8.25V9.51562H15H15.5156V8.25V6.97969L15.8719 7.22344C16.0688 7.35469 16.2328 7.45312 16.2375 7.44375C16.3359 7.33125 16.7813 6.62344 16.7813 6.58594C16.7813 6.5625 16.4203 6.3 15.9797 6.00937C15.3094 5.56875 15.15 5.48437 15 5.48437C14.85 5.48437 14.6906 5.56875 14.0203 6.00937Z" fill="#F47500"/>
<path d="M3.98438 13.6404C3.98438 19.3451 3.99844 21.867 4.03594 22.0404C4.17188 22.6967 4.69219 23.3951 5.27344 23.7045C5.87344 24.0185 5.44688 23.9998 12 23.9998C18.5531 23.9998 18.1266 24.0185 18.7266 23.7045C19.3078 23.3951 19.8281 22.6967 19.9641 22.0404C19.9922 21.8998 20.0156 21.2904 20.0156 20.6482V19.4998H19.5047H18.9891L18.975 20.667L18.9609 21.8295L18.7969 22.1529C18.6047 22.5232 18.3 22.7857 17.9344 22.8982C17.5828 23.0013 6.41719 23.0013 6.06563 22.8982C5.7 22.7857 5.39531 22.5232 5.20313 22.1529L5.03906 21.8295L5.025 13.6592L5.01563 5.48416H4.5H3.98438V13.6404Z" fill="#F47500"/>
<path d="M7.54719 7.05469C7.06906 7.20469 6.62375 7.71094 6.51594 8.22187C6.48312 8.38594 6.46906 10.1109 6.47844 13.6406L6.4925 18.8203L6.64719 19.1344C6.81594 19.4766 7.055 19.7156 7.40187 19.8844L7.6175 19.9922H12.0003H16.3831L16.5987 19.8844C16.9456 19.7156 17.1847 19.4766 17.3534 19.1344L17.5081 18.8203L17.5222 15.1547L17.5362 11.4844H17.0206H16.505L16.4909 15.0375C16.4769 18.3891 16.4722 18.5953 16.3925 18.7219C16.2144 18.9937 16.3409 18.9844 12.0003 18.9844C7.65969 18.9844 7.78625 18.9937 7.60812 18.7219C7.52844 18.5953 7.52375 18.3516 7.52375 13.5C7.52375 7.95937 7.505 8.28281 7.79562 8.10937C7.93625 8.02031 8.04406 8.01562 9.48312 8.01562H11.0159V7.5V6.98437L9.38937 6.98906C8.12375 6.98906 7.71125 7.00781 7.54719 7.05469Z" fill="#F47500"/>
<path d="M9 10.5V11.0156H10.0078H11.0156V10.5V9.98437H10.0078H9V10.5Z" fill="#F47500"/>
<path d="M9 13.5V14.0156H11.0156H13.0313V13.5V12.9844H11.0156H9V13.5Z" fill="#F47500"/>
<path d="M13.9688 13.5V14.0156H14.4844H15V13.5V12.9844H14.4844H13.9688V13.5Z" fill="#F47500"/>
<path d="M9 16.5V17.0156H11.0156H13.0313V16.5V15.9844H11.0156H9V16.5Z" fill="#F47500"/>
<path d="M13.9688 16.5V17.0156H14.4844H15V16.5V15.9844H14.4844H13.9688V16.5Z" fill="#F47500"/>
<path d="M18.9844 18V18.5156H19.5H20.0156V18V17.4844H19.5H18.9844V18Z" fill="#F47500"/>
</g>
<defs>
<clipPath id="clip0_557_4503">
<rect width="24" height="24" fill="white"/>
</clipPath>
</defs>
</svg>
