<svg width="18" height="19" viewBox="0 0 18 19" fill="none" xmlns="http://www.w3.org/2000/svg">
<path d="M11.2539 17.5239H6.75391C2.68141 17.5239 0.941406 15.7839 0.941406 11.7114V7.21143C0.941406 3.13893 2.68141 1.39893 6.75391 1.39893H11.2539C15.3264 1.39893 17.0664 3.13893 17.0664 7.21143V11.7114C17.0664 15.7839 15.3264 17.5239 11.2539 17.5239ZM6.75391 2.52393C3.29641 2.52393 2.06641 3.75393 2.06641 7.21143V11.7114C2.06641 15.1689 3.29641 16.3989 6.75391 16.3989H11.2539C14.7114 16.3989 15.9414 15.1689 15.9414 11.7114V7.21143C15.9414 3.75393 14.7114 2.52393 11.2539 2.52393H6.75391Z" fill="#F47500"/>
<path d="M7.63945 13.888C7.49695 13.888 7.35445 13.8355 7.24195 13.723L4.96195 11.443C4.74445 11.2255 4.74445 10.8655 4.96195 10.648C5.17945 10.4305 5.53945 10.4305 5.75695 10.648L8.03695 12.928C8.25445 13.1455 8.25445 13.5055 8.03695 13.723C7.93195 13.8355 7.78945 13.888 7.63945 13.888Z" fill="#F47500"/>
<path d="M7.63672 13.8866C7.32922 13.8866 7.07422 13.6316 7.07422 13.3241V5.59912C7.07422 5.29162 7.32922 5.03662 7.63672 5.03662C7.94422 5.03662 8.19922 5.29162 8.19922 5.59912V13.3316C8.19922 13.6391 7.95172 13.8866 7.63672 13.8866Z" fill="#F47500"/>
<path d="M12.6492 8.44072C12.5067 8.44072 12.3642 8.38822 12.2517 8.27572L9.97172 5.99572C9.75422 5.77822 9.75422 5.41822 9.97172 5.20072C10.1892 4.98322 10.5492 4.98322 10.7667 5.20072L13.0467 7.48072C13.2642 7.69822 13.2642 8.05822 13.0467 8.27572C12.9342 8.38072 12.7917 8.44072 12.6492 8.44072Z" fill="#F47500"/>
<path d="M10.3633 13.8866C10.0558 13.8866 9.80078 13.6316 9.80078 13.3241V5.59912C9.80078 5.29162 10.0558 5.03662 10.3633 5.03662C10.6708 5.03662 10.9258 5.29162 10.9258 5.59912V13.3316C10.9258 13.6391 10.6708 13.8866 10.3633 13.8866Z" fill="#F47500"/>
</svg>
