<svg width="24" height="24" viewBox="0 0 24 24" fill="none" xmlns="http://www.w3.org/2000/svg">
<path d="M4.40956 22.0003H20.9996C21.5496 22.0003 21.9996 21.5503 21.9996 21.0003V4.41026C21.9996 3.52026 20.9196 3.07026 20.2896 3.70026L3.70956 20.2903C3.07956 20.9203 3.51956 22.0003 4.40956 22.0003ZM19.9996 20.0003H16.9996V9.83026L19.9996 6.83026V20.0003Z" fill="#F47500"/>
</svg>
