<svg width="24" height="25" viewBox="0 0 24 25" fill="none" xmlns="http://www.w3.org/2000/svg">
<path d="M18 22.9531C17.1667 22.9531 16.4583 22.6615 15.875 22.0781C15.2917 21.4948 15 20.7865 15 19.9531C15 19.8365 15.0083 19.7155 15.025 19.5901C15.0417 19.4648 15.0667 19.3525 15.1 19.2531L8.05 15.1531C7.76667 15.4031 7.45 15.5991 7.1 15.7411C6.75 15.8831 6.38333 15.9538 6 15.9531C5.16667 15.9531 4.45833 15.6615 3.875 15.0781C3.29167 14.4948 3 13.7865 3 12.9531C3 12.1198 3.29167 11.4115 3.875 10.8281C4.45833 10.2448 5.16667 9.95312 6 9.95312C6.38333 9.95312 6.75 10.0241 7.1 10.1661C7.45 10.3081 7.76667 10.5038 8.05 10.7531L15.1 6.65312C15.0667 6.55312 15.0417 6.44079 15.025 6.31612C15.0083 6.19146 15 6.07046 15 5.95312C15 5.11979 15.2917 4.41146 15.875 3.82812C16.4583 3.24479 17.1667 2.95312 18 2.95312C18.8333 2.95312 19.5417 3.24479 20.125 3.82812C20.7083 4.41146 21 5.11979 21 5.95312C21 6.78646 20.7083 7.49479 20.125 8.07812C19.5417 8.66146 18.8333 8.95312 18 8.95312C17.6167 8.95312 17.25 8.88246 16.9 8.74112C16.55 8.59979 16.2333 8.40379 15.95 8.15312L8.9 12.2531C8.93333 12.3531 8.95833 12.4658 8.975 12.5911C8.99167 12.7165 9 12.8371 9 12.9531C9 13.0698 8.99167 13.1908 8.975 13.3161C8.95833 13.4415 8.93333 13.5538 8.9 13.6531L15.95 17.7531C16.2333 17.5031 16.55 17.3075 16.9 17.1661C17.25 17.0248 17.6167 16.9538 18 16.9531C18.8333 16.9531 19.5417 17.2448 20.125 17.8281C20.7083 18.4115 21 19.1198 21 19.9531C21 20.7865 20.7083 21.4948 20.125 22.0781C19.5417 22.6615 18.8333 22.9531 18 22.9531Z" fill="black"/>
</svg>
