{
  "images": [
    {
      "filename": "40-1.png",
      "size": "20x20",
      "scale": "2x",
      "idiom": "iphone"
    },
    {
      "filename": "60-1.png",
      "size": "20x20",
      "scale": "3x",
      "idiom": "iphone"
    },
    {
      "filename": "58-1.png",
      "size": "29x29",
      "scale": "2x",
      "idiom": "iphone"
    },
    {
      "filename": "87.png",
      "size": "29x29",
      "scale": "3x",
      "idiom": "iphone"
    },
    {
      "filename": "80.png",
      "size": "40x40",
      "scale": "2x",
      "idiom": "iphone"
    },
    {
      "filename": "120.png",
      "size": "40x40",
      "scale": "3x",
      "idiom": "iphone"
    },
    {
      "filename": "120-1.png",
      "size": "60x60",
      "scale": "2x",
      "idiom": "iphone"
    },
    {
      "filename": "180.png",
      "size": "60x60",
      "scale": "3x",
      "idiom": "iphone"
    },
    {
      "filename": "20.png",
      "size": "20x20",
      "scale": "1x",
      "idiom": "ipad"
    },
    {
      "filename": "40.png",
      "size": "20x20",
      "scale": "2x",
      "idiom": "ipad"
    },
    {
      "filename": "29.png",
      "size": "29x29",
      "scale": "1x",
      "idiom": "ipad"
    },
    {
      "filename": "58.png",
      "size": "29x29",
      "scale": "2x",
      "idiom": "ipad"
    },
    {
      "filename": "40-2.png",
      "size": "40x40",
      "scale": "1x",
      "idiom": "ipad"
    },
    {
      "filename": "80-1.png",
      "size": "40x40",
      "scale": "2x",
      "idiom": "ipad"
    },
    {
      "filename": "167.png",
      "size": "83.5x83.5",
      "scale": "2x",
      "idiom": "ipad"
    },
    {
      "filename": "76.png",
      "size": "76x76",
      "scale": "1x",
      "idiom": "ipad"
    },
    {
      "filename": "152.png",
      "size": "76x76",
      "scale": "2x",
      "idiom": "ipad"
    },
    {
      "filename": "1024.png",
      "size": "1024x1024",
      "scale": "1x",
      "idiom": "ios-marketing"
    },
    {
      "filename": "120-3.png",
      "size": "60x60",
      "scale": "2x",
      "idiom": "car"
    },
    {
      "filename": "180-2.png",
      "size": "60x60",
      "scale": "3x",
      "idiom": "car"
    },
    {
      "role": "notificationCenter",
      "filename": "48.png",
      "size": "24x24",
      "subtype": "38mm",
      "scale": "2x",
      "idiom": "watch"
    },
    {
      "role": "notificationCenter",
      "filename": "55.png",
      "size": "27.5x27.5",
      "subtype": "42mm",
      "scale": "2x",
      "idiom": "watch"
    },
    {
      "role": "companionSettings",
      "filename": "58-3.png",
      "size": "29x29",
      "scale": "2x",
      "idiom": "watch"
    },
    {
      "role": "companionSettings",
      "filename": "87-1.png",
      "size": "29x29",
      "scale": "3x",
      "idiom": "watch"
    },
    {
      "role": "appLauncher",
      "filename": "80-2.png",
      "size": "40x40",
      "subtype": "38mm",
      "scale": "2x",
      "idiom": "watch"
    },
    {
      "role": "appLauncher",
      "filename": "88.png",
      "size": "44x44",
      "subtype": "40mm",
      "scale": "2x",
      "idiom": "watch"
    },
    {
      "role": "appLauncher",
      "filename": "100.png",
      "size": "50x50",
      "subtype": "44mm",
      "scale": "2x",
      "idiom": "watch"
    },
    {
      "role": "quickLook",
      "filename": "172.png",
      "size": "86x86",
      "subtype": "38mm",
      "scale": "2x",
      "idiom": "watch"
    },
    {
      "role": "quickLook",
      "filename": "196.png",
      "size": "98x98",
      "subtype": "42mm",
      "scale": "2x",
      "idiom": "watch"
    },
    {
      "role": "quickLook",
      "filename": "216.png",
      "size": "108x108",
      "subtype": "44mm",
      "scale": "2x",
      "idiom": "watch"
    },
    {
      "filename": "1024-1.png",
      "size": "1024x1024",
      "scale": "1x",
      "idiom": "watch-marketing"
    },
    {
      "filename": "16.png",
      "size": "16x16",
      "scale": "1x",
      "idiom": "mac"
    },
    {
      "filename": "32.png",
      "size": "16x16",
      "scale": "2x",
      "idiom": "mac"
    },
    {
      "filename": "32-1.png",
      "size": "32x32",
      "scale": "1x",
      "idiom": "mac"
    },
    {
      "filename": "64.png",
      "size": "32x32",
      "scale": "2x",
      "idiom": "mac"
    },
    {
      "filename": "128.png",
      "size": "128x128",
      "scale": "1x",
      "idiom": "mac"
    },
    {
      "filename": "256.png",
      "size": "128x128",
      "scale": "2x",
      "idiom": "mac"
    },
    {
      "filename": "256-1.png",
      "size": "256x256",
      "scale": "1x",
      "idiom": "mac"
    },
    {
      "filename": "512.png",
      "size": "256x256",
      "scale": "2x",
      "idiom": "mac"
    },
    {
      "filename": "512-1.png",
      "size": "512x512",
      "scale": "1x",
      "idiom": "mac"
    },
    {
      "filename": "1024-2.png",
      "size": "512x512",
      "scale": "2x",
      "idiom": "mac"
    }
  ],
  "info": {
    "version": 1,
    "author": "xcode"
  }
}