90.785 15.152 17.896 0.031
347.828 17.341 20.097 0.074
1402.560 93.621 19.725 0.057
1762.818 238.469 20.435 0.103
1830.599 242.811 19.082 0.040
1769.418 257.980 17.333 0.031
1986.628 429.477 20.735 0.118
730.551 441.324 15.049 0.030
848.435 566.791 18.751 0.036
1895.233 595.627 19.640 0.052
900.497 704.374 18.808 0.036
1869.469 704.378 19.384 0.046
1224.411 725.598 19.285 0.044
1733.718 809.975 18.376 0.033
1831.815 877.487 18.218 0.033
90.488 883.786 19.540 0.048
1304.568 908.646 19.719 0.055
779.697 1016.070 20.241 0.079
1765.912 1028.235 19.045 0.039
1571.297 1068.790 19.205 0.043
1801.439 1197.556 20.857 0.131
151.914 1205.121 17.712 0.031
979.061 1334.266 19.013 0.039
828.974 1337.972 19.766 0.057
338.841 1449.767 19.815 0.057
1882.938 1504.986 14.742 0.030
620.121 1605.609 17.916 0.031
1729.238 1653.355 20.384 0.090
980.724 1674.464 16.433 0.030
871.402 1682.636 15.546 0.030
694.089 1689.214 19.827 0.057
929.375 1744.088 20.505 0.101
196.919 1806.021 19.752 0.057
1318.913 1815.376 16.028 0.030
916.921 1919.246 16.824 0.030
716.728 1980.411 19.610 0.056
692.754 1986.030 17.082 0.030
644.085 2098.387 19.119 0.040
1469.259 2254.960 20.069 0.070
1364.318 2268.484 19.854 0.060
938.619 2294.790 19.893 0.063
809.834 2310.345 19.298 0.043
1839.414 2319.854 19.067 0.040
1129.625 2347.135 20.016 0.067
1482.949 2358.445 20.448 0.095
311.989 2391.834 17.519 0.031
878.305 2443.006 20.503 0.098
175.793 2582.133 18.171 0.032
1153.949 2689.326 17.443 0.031
248.136 2861.094 17.836 0.031
741.651 2912.812 18.844 0.037
1845.885 2945.713 17.392 0.031
1444.929 2971.816 20.248 0.080
1147.707 2992.157 20.030 0.069
307.804 3019.065 18.354 0.033
1798.713 3042.059 19.428 0.046
1523.479 3169.895 19.219 0.042
1134.336 3258.130 20.504 0.098
524.379 3295.209 20.244 0.085
1932.668 3332.348 17.626 0.031
1030.446 3332.834 18.456 0.034
1542.992 3350.396 18.991 0.039
1146.145 3443.023 14.194 0.030
1440.931 3461.997 19.106 0.040
1694.758 3521.559 19.960 0.066
948.012 3558.098 20.051 0.072
756.803 3648.186 20.319 0.088
1222.964 3672.868 19.677 0.054
1630.576 3680.288 17.960 0.032
1405.202 3748.878 19.944 0.066
1617.692 3771.376 19.001 0.039
1416.989 3773.099 20.618 0.115
1111.129 3800.794 12.501 0.030
1112.249 3801.953 12.501 0.030
1478.863 3833.493 19.335 0.045
1421.947 3867.002 16.322 0.030
1502.649 3936.269 18.613 0.035
776.224 4038.246 17.055 0.030
1084.996 4081.249 17.136 0.031
