<svg width="70" height="70" viewBox="0 0 70 70" fill="none" xmlns="http://www.w3.org/2000/svg">
<path d="M24.5 57C36.6503 57 46.5 47.1503 46.5 35C46.5 22.8497 36.6503 13 24.5 13C12.3497 13 2.5 22.8497 2.5 35C2.5 47.1503 12.3497 57 24.5 57Z" fill="#ED6881" stroke="#821630" stroke-width="1.5" stroke-miterlimit="10"/>
<path d="M15.2998 40C15.2998 45.1 19.3998 49.2 24.4998 49.2C29.5998 49.2 33.6998 45.1 33.6998 40H15.2998Z" fill="#FFADCB" stroke="#821630" stroke-width="1.5" stroke-miterlimit="10" stroke-linecap="round" stroke-linejoin="round"/>
<path d="M17.1001 24.5V30.9" stroke="#821630" stroke-width="1.5" stroke-miterlimit="10"/>
<path d="M31.8999 24.5V30.9" stroke="#821630" stroke-width="1.5" stroke-miterlimit="10"/>
<path d="M44.5 57C56.6503 57 66.5 47.1503 66.5 35C66.5 22.8497 56.6503 13 44.5 13C32.3497 13 22.5 22.8497 22.5 35C22.5 47.1503 32.3497 57 44.5 57Z" fill="#FE9E6A" stroke="#821630" stroke-width="1.5" stroke-miterlimit="10" stroke-linecap="round" stroke-linejoin="round"/>
<path d="M35.2998 40C35.2998 45.1 39.3998 49.2 44.4998 49.2C49.5998 49.2 53.6998 45.1 53.6998 40" stroke="#821630" stroke-width="1.5" stroke-miterlimit="10" stroke-linecap="round" stroke-linejoin="round"/>
<path d="M37.1001 24.5V30.9" stroke="#821630" stroke-width="1.5" stroke-miterlimit="10"/>
<path d="M51.8999 24.5V30.9" stroke="#821630" stroke-width="1.5" stroke-miterlimit="10"/>
</svg>
