<svg width="70" height="70" viewBox="0 0 70 70" fill="none" xmlns="http://www.w3.org/2000/svg">
<path d="M46.2 30.9C49.1 26 47.5 19.6 42.5 16.7C37.6 13.8 31.2 15.4 28.3 20.4L25.8 24.6L21.6 22.1C16.7 19.2 10.3 20.8 7.39999 25.8C4.49999 30.7 6.19999 37.1 11.1 40L33.2 53L46.2 30.9Z" fill="#FF6161" stroke="#821630" stroke-width="1.5" stroke-miterlimit="10"/>
<path d="M29.6001 37C27.3001 33 28.6001 27.9 32.6001 25.5C36.6001 23.2 41.7001 24.5 44.1001 28.5L46.1001 31.9L49.5001 29.9C53.5001 27.6 58.6001 28.9 61.0001 32.9C63.3001 36.9 62.0001 42 58.0001 44.4L40.1001 54.7L29.6001 37Z" fill="#FF70A4" stroke="#821630" stroke-width="1.5" stroke-miterlimit="10" stroke-linecap="round" stroke-linejoin="round"/>
</svg>
