<svg width="70" height="70" viewBox="0 0 70 70" fill="none" xmlns="http://www.w3.org/2000/svg">
<path d="M55.2002 59.1H9.7002L33.2002 24L55.2002 59.1Z" fill="#FE9E6A" stroke="#821630" stroke-width="1.5" stroke-miterlimit="10" stroke-linecap="round" stroke-linejoin="round"/>
<path d="M29.3003 59.1H62.0003L45.3003 34.2L29.3003 59.1Z" fill="#FE9E6A" stroke="#821630" stroke-width="1.5" stroke-miterlimit="10" stroke-linecap="round" stroke-linejoin="round"/>
<path d="M33.2002 24V10.9H21.7002V17.5H33.2002" fill="#ED6881"/>
<path d="M33.2002 24V10.9H21.7002V17.5H33.2002" stroke="#821630" stroke-width="1.5" stroke-miterlimit="10"/>
</svg>
