<svg width="70" height="70" viewBox="0 0 70 70" fill="none" xmlns="http://www.w3.org/2000/svg">
<g style="mix-blend-mode:multiply" opacity="0.3">
<path d="M35 70C54.33 70 70 54.33 70 35C70 15.67 54.33 0 35 0C15.67 0 0 15.67 0 35C0 54.33 15.67 70 35 70Z" fill="#FF9DC6"/>
</g>
<path d="M29.3002 59.1H9.7002L33.2002 24L42.3002 38.5" stroke="#821630" stroke-width="1.5" stroke-miterlimit="10" stroke-linejoin="round"/>
<path d="M29.3003 59.1H62.0003L45.3003 34.2L29.3003 59.1Z" stroke="#821630" stroke-width="1.5" stroke-miterlimit="10" stroke-linejoin="round"/>
<path d="M33.2002 24V10.9H21.7002V17.5H33.2002" stroke="#821630" stroke-width="1.5" stroke-miterlimit="10" stroke-linejoin="round"/>
</svg>
