<svg width="20" height="20" viewBox="0 0 20 20" fill="none" xmlns="http://www.w3.org/2000/svg">
<path d="M6.40012 16.86C8.48775 16.86 10.1801 15.1676 10.1801 13.08C10.1801 10.9924 8.48775 9.29999 6.40012 9.29999C4.31248 9.29999 2.62012 10.9924 2.62012 13.08C2.62012 15.1676 4.31248 16.86 6.40012 16.86Z" stroke="#575167" stroke-miterlimit="10"/>
<path d="M6.3999 9.3V3.12" stroke="#575167" stroke-miterlimit="10"/>
<path d="M4.34033 4.75998H8.44033" stroke="#575167" stroke-miterlimit="10"/>
<path d="M13.6003 10.56C15.6879 10.56 17.3803 8.86764 17.3803 6.78C17.3803 4.69236 15.6879 3 13.6003 3C11.5127 3 9.82031 4.69236 9.82031 6.78C9.82031 8.86764 11.5127 10.56 13.6003 10.56Z" stroke="#575167" stroke-miterlimit="10"/>
<path d="M13.6001 16.76V10.58" stroke="#575167" stroke-miterlimit="10"/>
<path d="M10.9805 14.38L13.6005 17L16.2205 14.38" stroke="#575167" stroke-miterlimit="10"/>
</svg>
