<svg width="20" height="20" viewBox="0 0 20 20" fill="none" xmlns="http://www.w3.org/2000/svg">
<path d="M10 20C7.32891 20 4.81766 18.9598 2.92891 17.0711C1.0402 15.1823 0 12.6711 0 10C0 7.32891 1.0402 4.8177 2.92891 2.92891C4.81766 1.0402 7.32891 0 10 0C10.9057 0 11.8036 0.12125 12.669 0.360352C13.0849 0.475273 13.3289 0.905586 13.2139 1.32145C13.0991 1.73734 12.6688 1.98125 12.2529 1.86641C11.523 1.66477 10.765 1.5625 10 1.5625C5.34754 1.5625 1.5625 5.34754 1.5625 10C1.5625 14.6525 5.34754 18.4375 10 18.4375C14.6525 18.4375 18.4375 14.6525 18.4375 10C18.4375 9.22223 18.3319 8.45223 18.1236 7.71144C18.0069 7.29609 18.2489 6.86469 18.6643 6.74789C19.0796 6.63117 19.5111 6.87316 19.6279 7.28856C19.8748 8.16703 20 9.07926 20 10C20 12.6711 18.9598 15.1823 17.0711 17.0711C15.1823 18.9598 12.6711 20 10 20ZM10.0048 15.5957C10.4363 15.593 10.7839 15.2411 10.7812 14.8096C10.7786 14.3798 10.4293 14.0332 10.0001 14.0332H9.9952C9.98668 14.0333 9.97824 14.0333 9.96977 14.0333C9.1198 14.0333 8.3043 13.771 7.60992 13.274C6.72746 12.6425 6.14379 11.7052 5.96633 10.6347C5.78891 9.56414 6.03898 8.48859 6.67051 7.60617C7.97406 5.78453 10.5167 5.36309 12.3384 6.66676C13.0311 7.16246 13.5423 7.84871 13.817 8.65137C13.9566 9.05961 14.4009 9.2773 14.8091 9.13762C15.2173 8.99793 15.435 8.55379 15.2953 8.14555C14.9147 7.03309 14.2067 6.08238 13.2477 5.39613C10.7255 3.59109 7.20492 4.17457 5.39984 6.69684C4.52543 7.91867 4.17918 9.40789 4.42488 10.8902C4.67055 12.3725 5.47875 13.6704 6.70059 14.5447C7.66199 15.2328 8.79145 15.5958 9.96957 15.5958C9.98121 15.5958 9.99309 15.5958 10.0048 15.5957ZM16.1328 12.6953C16.1328 11.403 15.0814 10.3516 13.7891 10.3516C12.4967 10.3516 11.4453 11.403 11.4453 12.6953C11.4453 13.9877 12.4967 15.0391 13.7891 15.0391C15.0814 15.0391 16.1328 13.9877 16.1328 12.6953ZM14.5703 12.6953C14.5703 13.1261 14.2198 13.4766 13.7891 13.4766C13.3583 13.4766 13.0078 13.1261 13.0078 12.6953C13.0078 12.2645 13.3583 11.9141 13.7891 11.9141C14.2198 11.9141 14.5703 12.2645 14.5703 12.6953ZM16.4844 5.78125C15.192 5.78125 14.1406 4.72984 14.1406 3.4375C14.1406 2.14516 15.192 1.09375 16.4844 1.09375C17.7767 1.09375 18.8281 2.14516 18.8281 3.4375C18.8281 4.72984 17.7767 5.78125 16.4844 5.78125ZM16.4844 2.65625C16.0536 2.65625 15.7031 3.00672 15.7031 3.4375C15.7031 3.86828 16.0536 4.21875 16.4844 4.21875C16.9152 4.21875 17.2656 3.86828 17.2656 3.4375C17.2656 3.00672 16.9152 2.65625 16.4844 2.65625ZM9.02344 9.96094C9.02344 10.5003 9.46066 10.9375 10 10.9375C10.5393 10.9375 10.9766 10.5003 10.9766 9.96094C10.9766 9.4216 10.5393 8.98438 10 8.98438C9.46066 8.98438 9.02344 9.4216 9.02344 9.96094Z" fill="#FB7474"/>
</svg>
