<svg width="45" height="45" viewBox="0 0 45 45" fill="none" xmlns="http://www.w3.org/2000/svg">
<path d="M21.975 41.25C32.3304 41.25 40.725 32.8553 40.725 22.5C40.725 12.1447 32.3304 3.75 21.975 3.75C11.6197 3.75 3.22505 12.1447 3.22505 22.5C3.22505 32.8553 11.6197 41.25 21.975 41.25Z" fill="#FFB960"/>
<path opacity="0.5" d="M4.80007 15.075C4.20007 16.425 3.75007 17.775 3.52507 19.275C7.05007 20.4 11.4751 20.925 16.0501 20.55C18.7501 20.325 22.5001 19.725 26.5501 18.225C30.0751 16.875 33.8251 14.775 37.2001 11.55C36.6001 10.725 35.8501 9.90002 35.1001 9.15002C23.9251 16.65 12.4501 16.5 4.80007 15.075Z" fill="#D98D2B"/>
<path opacity="0.5" d="M32.4 6.89997C27.525 3.67497 21.225 2.77497 15.3 5.02497C11.7 6.37497 8.775 8.77497 6.75 11.625C14.175 12.525 24 12.225 32.4 6.89997Z" fill="#D98D2B"/>
<path opacity="0.5" d="M19.575 22.5C12 23.85 6.45005 21.975 3.37505 20.4C3.30005 21.375 3.22505 22.275 3.30005 23.25C12.525 25.575 19.575 22.5 19.575 22.5Z" fill="#D98D2B"/>
<path opacity="0.5" d="M39.525 15.825C39.375 15.45 39.225 15.075 39.075 14.7C37.35 18.375 34.8 21.15 31.95 20.1C28.575 18.825 25.2 19.875 23.175 23.25C21.6 25.95 13.875 28.5 3.375 24.45C3.525 25.575 3.75 26.775 4.05 27.9C12.75 31.275 15.375 28.875 24 29.7C36.075 30.825 34.5 25.575 37.2 23.325C38.4 22.35 39.525 20.7 40.425 19.125C40.2 18 39.9 16.875 39.525 15.825Z" fill="#D98D2B"/>
<path d="M20.625 27.15C25.5 26.475 26.475 22.725 28.5 22.575C30.45 22.425 33.45 22.8 34.875 21.825C31.35 23.7 32.175 27.225 27.9 27.15C23.55 27.075 24.3 27 20.625 27.15Z" fill="#FFB960"/>
<path opacity="0.5" d="M40.2001 26.925C32.9251 34.35 18.6751 37.8 6.0751 32.325C7.5751 34.8 9.6001 36.825 12.0001 38.25C24.5251 39 32.4751 36.3 37.4251 33.15C38.7001 31.35 39.6751 29.175 40.2001 26.925Z" fill="#D98D2B"/>
<path d="M21.975 41.25C32.3304 41.25 40.725 32.8553 40.725 22.5C40.725 12.1447 32.3304 3.75 21.975 3.75C11.6197 3.75 3.22505 12.1447 3.22505 22.5C3.22505 32.8553 11.6197 41.25 21.975 41.25Z" stroke="#961937" stroke-width="1.3324" stroke-miterlimit="10"/>
</svg>
