<svg width="46" height="46" viewBox="0 0 46 46" fill="none" xmlns="http://www.w3.org/2000/svg">
<circle cx="23" cy="23" r="22.5" stroke="#FB7474"/>
<path d="M18.3573 30.3748C18.193 30.3748 18.0298 30.3235 17.8905 30.2228C17.6311 30.0348 17.5099 29.7116 17.5805 29.3998L18.5455 25.149L15.2728 22.279C15.0323 22.0689 14.9404 21.7364 15.0391 21.4321C15.1379 21.1283 15.4066 20.9133 15.7248 20.8839L20.0549 20.4908L21.7668 16.4844C21.8931 16.1901 22.1805 16 22.4999 16C22.8194 16 23.1068 16.1901 23.2331 16.4838L24.945 20.4908L29.2744 20.8839C29.5933 20.9126 29.862 21.1283 29.9608 21.4321C30.0595 21.7358 29.9682 22.0689 29.7276 22.279L26.455 25.1484L27.42 29.3991C27.4907 29.7116 27.3694 30.0348 27.1101 30.2223C26.8513 30.4097 26.5063 30.4241 26.2338 30.2604L22.4999 28.0291L18.7661 30.2616C18.6399 30.3366 18.4992 30.3748 18.3573 30.3748ZM22.4999 27.0679C22.6419 27.0679 22.7824 27.106 22.9087 27.1809L26.4326 29.2885L25.5218 25.2765C25.4568 24.9909 25.5538 24.6928 25.7744 24.4996L28.8645 21.7896L24.7762 21.4183C24.4819 21.3914 24.2287 21.2064 24.1137 20.9352L22.4999 17.1544L20.8842 20.9357C20.7705 21.2051 20.5173 21.3902 20.2237 21.4171L16.1348 21.7883L19.2248 24.4984C19.4461 24.6921 19.543 24.9897 19.4774 25.2759L18.5673 29.2878L22.0912 27.1809C22.2174 27.106 22.358 27.0679 22.4999 27.0679Z" fill="#FB7474"/>
</svg>
