<svg width="45" height="45" viewBox="0 0 45 45" fill="none" xmlns="http://www.w3.org/2000/svg">
<path d="M21.975 33.375C27.9811 33.375 32.85 28.5061 32.85 22.5C32.85 16.4939 27.9811 11.625 21.975 11.625C15.9689 11.625 11.1 16.4939 11.1 22.5C11.1 28.5061 15.9689 33.375 21.975 33.375Z" fill="#DBAD39"/>
<path d="M28.05 18.075C26.85 13.875 22.05 14.1 19.95 14.85C17.85 15.6 19.8 19.125 19.95 17.55C20.1 15.975 22.8 15.825 23.475 17.325C24.075 18.825 20.625 22.05 17.7 20.625C16.425 20.025 14.775 16.125 17.4 12.675C12.9 14.775 10.5 19.575 11.325 24.375C17.325 34.275 30.075 25.125 28.05 18.075Z" fill="#C99205"/>
<path d="M32.4 25.5C26.175 32.25 18.15 31.425 14.85 30.675C17.775 33.225 21.975 34.125 25.875 32.625C29.175 31.35 31.5 28.65 32.4 25.5Z" fill="#C99205"/>
<path d="M21.975 33.375C27.9811 33.375 32.85 28.5061 32.85 22.5C32.85 16.4939 27.9811 11.625 21.975 11.625C15.9689 11.625 11.1 16.4939 11.1 22.5C11.1 28.5061 15.9689 33.375 21.975 33.375Z" stroke="#961937" stroke-width="0.4" stroke-miterlimit="10"/>
</svg>
