<svg width="45" height="45" viewBox="0 0 45 45" fill="none" xmlns="http://www.w3.org/2000/svg">
<path d="M16.4247 38.9999C15.8997 35.3249 12.2997 32.6999 8.69974 33.3749C8.09974 33.4499 7.64974 32.8499 7.87474 32.3249C9.59974 29.0249 8.24974 24.8249 4.87474 23.1749C4.27474 22.8749 4.27474 22.1249 4.87474 21.8249C8.24974 20.1749 9.59974 15.9749 7.87474 12.6749C7.57474 12.1499 8.02474 11.4749 8.69974 11.6249C12.3747 12.2999 15.9747 9.67491 16.4247 5.99991C16.4997 5.32491 17.2497 5.09991 17.6997 5.54991C20.2497 8.24991 24.7497 8.24991 27.2997 5.54991C27.7497 5.09991 28.4997 5.32491 28.5747 5.99991C29.0997 9.67491 32.6997 12.2999 36.2997 11.6249C36.8997 11.5499 37.3497 12.1499 37.1247 12.6749C35.3997 15.9749 36.7497 20.1749 40.1247 21.8249C40.7247 22.1249 40.7247 22.8749 40.1247 23.1749C36.7497 24.8249 35.3997 29.0249 37.1247 32.3249C37.4247 32.8499 36.9747 33.5249 36.2997 33.3749C32.6247 32.6999 29.0247 35.3249 28.5747 38.9999C28.4997 39.5999 27.7497 39.8999 27.2997 39.4499C24.7497 36.7499 20.2497 36.7499 17.6997 39.4499C17.2497 39.8999 16.4997 39.6749 16.4247 38.9999Z" fill="#FBFF1D"/>
<path d="M16.4247 38.9999C15.8997 35.3249 12.2997 32.6999 8.69974 33.3749C8.09974 33.4499 7.64974 32.8499 7.87474 32.3249C9.59974 29.0249 8.24974 24.8249 4.87474 23.1749C4.27474 22.8749 4.27474 22.1249 4.87474 21.8249C8.24974 20.1749 9.59974 15.9749 7.87474 12.6749C7.57474 12.1499 8.02474 11.4749 8.69974 11.6249C12.3747 12.2999 15.9747 9.67491 16.4247 5.99991C16.4997 5.32491 17.2497 5.09991 17.6997 5.54991C20.2497 8.24991 24.7497 8.24991 27.2997 5.54991C27.7497 5.09991 28.4997 5.32491 28.5747 5.99991C29.0997 9.67491 32.6997 12.2999 36.2997 11.6249C36.8997 11.5499 37.3497 12.1499 37.1247 12.6749C35.3997 15.9749 36.7497 20.1749 40.1247 21.8249C40.7247 22.1249 40.7247 22.8749 40.1247 23.1749C36.7497 24.8249 35.3997 29.0249 37.1247 32.3249C37.4247 32.8499 36.9747 33.5249 36.2997 33.3749C32.6247 32.6999 29.0247 35.3249 28.5747 38.9999C28.4997 39.5999 27.7497 39.8999 27.2997 39.4499C24.7497 36.7499 20.2497 36.7499 17.6997 39.4499C17.2497 39.8999 16.4997 39.6749 16.4247 38.9999Z" stroke="#961937" stroke-width="0.4" stroke-miterlimit="10"/>
<path d="M22.5002 35.55C29.7489 35.55 35.6252 29.6738 35.6252 22.425C35.6252 15.1763 29.7489 9.30005 22.5002 9.30005C15.2514 9.30005 9.37518 15.1763 9.37518 22.425C9.37518 29.6738 15.2514 35.55 22.5002 35.55Z" fill="#FFC800"/>
<path d="M22.5002 35.55C29.7489 35.55 35.6252 29.6738 35.6252 22.425C35.6252 15.1763 29.7489 9.30005 22.5002 9.30005C15.2514 9.30005 9.37518 15.1763 9.37518 22.425C9.37518 29.6738 15.2514 35.55 22.5002 35.55Z" stroke="#961937" stroke-width="0.4" stroke-miterlimit="10"/>
<path d="M13.5 12.8998C13.5 12.8998 13.725 12.6748 14.25 12.2248C14.7 11.7748 15.525 11.2498 16.575 10.7248C17.7 10.2748 19.125 9.89978 20.775 9.89978C22.425 9.89978 24.375 10.2748 26.25 11.1748C28.125 12.0748 29.925 13.5748 31.2 15.5998C32.475 17.6248 33.075 20.2498 32.55 22.8748C32.1 25.4248 30.525 27.9748 28.125 29.4748C27.825 29.6998 27.525 29.8498 27.225 29.9998C26.925 30.1498 26.55 30.2998 26.25 30.3748C25.575 30.5998 24.9 30.7498 24.15 30.8248C22.725 30.8998 21.3 30.6748 20.025 30.0748C18.75 29.4748 17.625 28.4998 16.8 27.3748L16.65 27.1498L16.5 26.9248C16.425 26.7748 16.35 26.6248 16.275 26.4748C16.125 26.1748 15.975 25.7998 15.9 25.4998C15.825 24.6748 15.75 23.9998 15.75 23.3248C15.825 20.4748 17.775 17.8498 20.475 17.1748C21.825 16.8748 23.175 17.0998 24.3 17.6998C25.425 18.3748 26.325 19.3498 26.625 20.5498C27 21.7498 26.775 23.0248 26.175 23.9998C25.575 24.9748 24.6 25.7248 23.475 25.8748C22.425 26.0248 21.3 25.6498 20.625 24.9748C19.95 24.2998 19.575 23.3248 19.725 22.4248C19.875 21.5248 20.4 20.8498 21.075 20.4748C21.75 20.0998 22.5 20.1748 23.025 20.4748C23.55 20.7748 23.925 21.2248 24.075 21.6748C24.225 22.1248 24.15 22.5748 24 22.8748C23.7 23.4748 23.325 23.6248 23.4 23.6248C23.4 23.6248 23.775 23.4748 24 22.8748C24.15 22.5748 24.15 22.1998 24.075 21.7498C23.925 21.2998 23.55 20.8498 23.025 20.6248C22.5 20.3998 21.825 20.3248 21.225 20.6998C20.625 21.0748 20.1 21.6748 20.025 22.4998C19.725 24.0748 21.525 25.8748 23.475 25.4998C24.45 25.3498 25.275 24.6748 25.875 23.7748C26.4 22.8748 26.625 21.7498 26.25 20.6998C25.95 19.6498 25.125 18.7498 24.075 18.1498C23.025 17.6248 21.825 17.3998 20.625 17.6998C19.5 17.9998 18.375 18.7498 17.625 19.7248C16.875 20.6998 16.425 21.9748 16.425 23.2498C16.35 25.7998 18.15 28.2748 20.475 29.3248C21.675 29.9248 22.95 30.1498 24.3 30.0748C24.975 29.9998 25.575 29.9248 26.175 29.6998C26.475 29.6248 26.775 29.4748 27.075 29.3248C27.375 29.1748 27.675 29.0248 27.9 28.8748C30.075 27.4498 31.575 25.1248 32.025 22.7248C32.475 20.2498 32.025 17.7748 30.825 15.8248C29.625 13.8748 27.9 12.4498 26.1 11.4748C24.3 10.5748 22.425 10.1248 20.775 10.1248C19.125 10.0498 17.7 10.4248 16.575 10.7998C15.45 11.2498 14.7 11.7748 14.175 12.1498C13.8 12.6748 13.5 12.8998 13.5 12.8998Z" fill="#961937"/>
</svg>
