<svg width="25" height="25" viewBox="0 0 25 25" fill="none" xmlns="http://www.w3.org/2000/svg">
<circle cx="12.5" cy="12.5" r="12.5" fill="#F78472"/>
<path d="M16.9239 13.4419C16.8543 13.3697 16.7715 13.3125 16.6804 13.2734C16.5893 13.2343 16.4916 13.2142 16.3929 13.2142C16.2943 13.2142 16.1966 13.2343 16.1055 13.2734C16.0144 13.3125 15.9316 13.3697 15.8619 13.4419L14.4639 14.8865L13.0659 13.4419C12.9963 13.3697 12.9135 13.3125 12.8224 13.2734C12.7313 13.2343 12.6336 13.2142 12.5349 13.2142C12.4363 13.2142 12.3386 13.2343 12.2475 13.2734C12.1564 13.3125 12.0736 13.3697 12.0039 13.4419L10.6059 14.8865L9.21095 13.4419C9.14128 13.3697 9.05852 13.3125 8.9674 13.2734C8.87628 13.2343 8.7786 13.2142 8.67995 13.2142C8.5813 13.2142 8.48361 13.2343 8.3925 13.2734C8.30138 13.3125 8.21862 13.3697 8.14895 13.4419L6.21995 15.4352C6.07912 15.5807 6 15.7781 6 15.9839C6 16.1897 6.07912 16.3871 6.21995 16.5326C6.36078 16.6781 6.55178 16.7599 6.75095 16.7599C6.95011 16.7599 7.14112 16.6781 7.28195 16.5326L8.67995 15.0942L10.0779 16.5388C10.1476 16.611 10.2304 16.6682 10.3215 16.7073C10.4126 16.7464 10.5103 16.7665 10.6089 16.7665C10.7076 16.7665 10.8053 16.7464 10.8964 16.7073C10.9875 16.6682 11.0703 16.611 11.1399 16.5388L12.5409 15.0942L13.9389 16.5388C14.0086 16.611 14.0914 16.6682 14.1825 16.7073C14.2736 16.7464 14.3713 16.7665 14.4699 16.7665C14.5686 16.7665 14.6663 16.7464 14.7574 16.7073C14.8485 16.6682 14.9313 16.611 15.0009 16.5388L16.3929 15.0942L17.7909 16.5388C17.9349 16.6697 18.1219 16.7386 18.3135 16.7314C18.5051 16.7243 18.6868 16.6416 18.8212 16.5003C18.9556 16.359 19.0326 16.1699 19.0362 15.9718C19.0399 15.7737 18.97 15.5817 18.8409 15.4352L16.9239 13.4419Z" fill="#FFFDEB"/>
<path d="M16.9239 8.22768C16.8543 8.15551 16.7715 8.09825 16.6804 8.05918C16.5893 8.02011 16.4916 8 16.3929 8C16.2943 8 16.1966 8.02011 16.1055 8.05918C16.0144 8.09825 15.9316 8.15551 15.8619 8.22768L14.4639 9.67229L13.0659 8.22768C12.9227 8.08704 12.7326 8.00862 12.5349 8.00862C12.3373 8.00862 12.1472 8.08704 12.0039 8.22768L10.6059 9.67229L9.21095 8.22768C9.14128 8.15551 9.05852 8.09825 8.9674 8.05918C8.87628 8.02011 8.7786 8 8.67995 8C8.5813 8 8.48361 8.02011 8.3925 8.05918C8.30138 8.09825 8.21862 8.15551 8.14895 8.22768L6.21995 10.221C6.07912 10.3665 6 10.5639 6 10.7697C6 10.9755 6.07912 11.1729 6.21995 11.3184C6.36078 11.4639 6.55178 11.5457 6.75095 11.5457C6.95011 11.5457 7.14112 11.4639 7.28195 11.3184L8.67995 9.87379L10.0779 11.3184C10.2212 11.459 10.4113 11.5375 10.6089 11.5375C10.8066 11.5375 10.9967 11.459 11.1399 11.3184L12.5409 9.87069L13.9389 11.3153C14.0086 11.3875 14.0914 11.4447 14.1825 11.4838C14.2736 11.5229 14.3713 11.543 14.4699 11.543C14.5686 11.543 14.6663 11.5229 14.7574 11.4838C14.8485 11.4447 14.9313 11.3875 15.0009 11.3153L16.3989 9.87069L17.7969 11.3153C17.8625 11.4024 17.9453 11.474 18.0399 11.5253C18.1344 11.5767 18.2384 11.6066 18.345 11.6131C18.4516 11.6195 18.5583 11.6024 18.658 11.5628C18.7577 11.5232 18.848 11.462 18.923 11.3835C18.998 11.3049 19.0558 11.2107 19.0927 11.1071C19.1296 11.0036 19.1447 10.8931 19.1369 10.783C19.1291 10.673 19.0987 10.5659 19.0477 10.469C18.9966 10.372 18.9262 10.2875 18.8409 10.221L16.9239 8.22768Z" fill="#FFFDEB"/>
</svg>
