<svg width="45" height="45" viewBox="0 0 45 45" fill="none" xmlns="http://www.w3.org/2000/svg">
<path d="M21.975 37.05C30.0107 37.05 36.525 30.5357 36.525 22.5C36.525 14.4642 30.0107 7.94995 21.975 7.94995C13.9393 7.94995 7.425 14.4642 7.425 22.5C7.425 30.5357 13.9393 37.05 21.975 37.05Z" fill="#73DCFF"/>
<path d="M24.825 29.3249C19.2 31.4999 13.125 30.6749 8.40001 27.5999V27.6749C11.25 35.1749 19.65 38.9249 27.15 36.0749C34.5 33.2999 38.25 25.1249 35.7 17.7749C34.05 22.8749 30.225 27.2249 24.825 29.3249Z" fill="#52C5EB"/>
<path d="M22.5 7.94995C34.65 10.8 29.4 13.5 25.65 13.425C21.9 13.35 24.675 18.825 26.25 19.35C27.825 19.875 29.775 17.55 30 17.55C30.225 17.55 31.575 20.1 29.925 21.525C28.275 22.95 24.45 24.825 26.625 26.925C28.8 29.025 30.9 26.175 30.75 29.175C30.675 30.375 31.275 32.025 32.025 32.925C33.825 31.2 35.1 29.1 35.775 26.775C36 25.575 36.225 24.375 36.45 23.1C36.525 21.15 36.225 19.2 35.475 17.325C33.45 11.7 28.125 8.17495 22.5 7.94995Z" fill="#92B841"/>
<path d="M30.825 29.1749C30.75 30.3749 31.35 32.0249 32.1 32.9249C33.9 31.1999 35.175 29.0999 35.85 26.7749C36.075 25.5749 36.3 24.3749 36.525 23.0999C36.525 22.4999 36.525 21.8249 36.45 21.2249C34.725 20.7749 32.475 20.6999 30.45 21.0749C30.3 21.2999 30.15 21.4499 29.925 21.6749C28.35 22.9499 25.05 24.6749 26.175 26.5499C26.325 26.6999 26.4 26.8499 26.625 27.0749C28.8 29.0249 30.9 26.1749 30.825 29.1749Z" fill="#DCE04F"/>
<path d="M15.45 32.175C13.875 30.45 22.65 26.175 17.325 26.325C12 26.475 11.4 25.5 12.9 24.75C14.4 24 13.575 22.05 13.5 20.925C13.425 19.8 13.8 18 15.45 17.85C17.025 17.7 19.65 9.22501 8.925 16.275C7.275 19.725 6.975 23.85 8.475 27.675C10.35 32.55 14.55 35.85 19.35 36.75C19.95 36.675 20.55 36.75 20.925 36.525C21.975 35.55 17.025 33.9 15.45 32.175Z" fill="#92B841"/>
<path d="M21.975 37.05C30.0107 37.05 36.525 30.5357 36.525 22.5C36.525 14.4642 30.0107 7.94995 21.975 7.94995C13.9393 7.94995 7.425 14.4642 7.425 22.5C7.425 30.5357 13.9393 37.05 21.975 37.05Z" stroke="#961937" stroke-width="0.4" stroke-miterlimit="10"/>
</svg>
