<svg width="32" height="32" viewBox="0 0 32 32" fill="none" xmlns="http://www.w3.org/2000/svg">
<rect opacity="0.1" width="32" height="32" rx="4" fill="#FB7474"/>
<path d="M20.3035 13.7266V19.9973C20.3026 20.3506 20.1618 20.6893 19.912 20.9391C19.6621 21.189 19.3235 21.3297 18.9702 21.3306H14.7635C14.4099 21.3306 14.0707 21.1901 13.8207 20.9401C13.5706 20.69 13.4302 20.3509 13.4302 19.9973V19.6039H16.9035C17.3455 19.6039 17.7694 19.4284 18.082 19.1158C18.3946 18.8032 18.5701 18.3793 18.5701 17.9373V12.3906H18.9702C19.324 12.3915 19.663 12.5326 19.9129 12.783C20.1629 13.0335 20.3033 13.3728 20.3035 13.7266Z" fill="#FB7474"/>
<path d="M13.7839 10.6865V11.7532C13.782 12.0178 13.6761 12.271 13.4889 12.4582C13.3018 12.6453 13.0486 12.7513 12.7839 12.7532H11.7173C11.7564 12.5589 11.8517 12.3805 11.9913 12.2399L13.2706 10.9598C13.4115 10.8207 13.5899 10.7258 13.7839 10.6865V10.6865Z" fill="#FB7474"/>
<path d="M17.9032 11.6641V17.9374C17.9032 18.2026 17.7979 18.457 17.6104 18.6445C17.4228 18.832 17.1685 18.9374 16.9032 18.9374H12.6973C12.432 18.9374 12.1777 18.832 11.9902 18.6445C11.8026 18.457 11.6973 18.2026 11.6973 17.9374V13.4174H12.7839C13.2255 13.4162 13.6488 13.2402 13.9611 12.9279C14.2734 12.6156 14.4493 12.1924 14.4506 11.7507V10.6641H16.9032C17.1685 10.6641 17.4228 10.7694 17.6104 10.9569C17.7979 11.1445 17.9032 11.3988 17.9032 11.6641Z" fill="#FB7474"/>
</svg>
