<svg width="70" height="70" viewBox="0 0 70 70" fill="none" xmlns="http://www.w3.org/2000/svg">
<g style="mix-blend-mode:multiply" opacity="0.3">
<path d="M35 70C54.33 70 70 54.33 70 35C70 15.67 54.33 0 35 0C15.67 0 0 15.67 0 35C0 54.33 15.67 70 35 70Z" fill="#FF9DC6"/>
</g>
<path d="M41.1001 42.4C48.5559 42.4 54.6001 36.3558 54.6001 28.9C54.6001 21.4441 48.5559 15.4 41.1001 15.4C33.6443 15.4 27.6001 21.4441 27.6001 28.9C27.6001 36.3558 33.6443 42.4 41.1001 42.4Z" stroke="#821630" stroke-width="1.5" stroke-miterlimit="10"/>
<path d="M16 54L31.6 38.4" stroke="#821630" stroke-width="1.5" stroke-miterlimit="10"/>
<path d="M15.3 41.4V54.7H28.6" stroke="#821630" stroke-width="1.5" stroke-miterlimit="10"/>
</svg>
