<svg width="375" height="460" viewBox="0 0 375 460" fill="none" xmlns="http://www.w3.org/2000/svg">
<path opacity="0.03" fill-rule="evenodd" clip-rule="evenodd" d="M185.845 449.69C307.262 449.69 405.69 351.262 405.69 229.845C405.69 108.428 307.262 10 185.845 10C64.4279 10 -34 108.428 -34 229.845C-34 351.262 64.4279 449.69 185.845 449.69Z" stroke="#FEA163" stroke-width="20"/>
<path opacity="0.06" fill-rule="evenodd" clip-rule="evenodd" d="M185.361 388.723C273.374 388.723 344.723 317.374 344.723 229.361C344.723 141.348 273.374 70 185.361 70C97.3485 70 26 141.348 26 229.361C26 317.374 97.3485 388.723 185.361 388.723Z" stroke="#FEA163" stroke-width="20"/>
<path opacity="0.11" fill-rule="evenodd" clip-rule="evenodd" d="M185.826 328.651C239.853 328.651 283.651 284.853 283.651 230.826C283.651 176.798 239.853 133 185.826 133C131.798 133 88 176.798 88 230.826C88 284.853 131.798 328.651 185.826 328.651Z" stroke="#FEA163" stroke-width="20"/>
</svg>
