<svg width="45" height="45" viewBox="0 0 45 45" fill="none" xmlns="http://www.w3.org/2000/svg">
<path d="M41.25 22.5C28.725 22.5 22.5 16.275 22.5 3.75C22.5 16.275 16.275 22.5 3.75 22.5C16.275 22.5 22.5 28.725 22.5 41.25C22.5 28.725 28.725 22.5 41.25 22.5Z" fill="#FFFACA"/>
<path d="M41.25 22.5C28.725 22.5 22.5 16.275 22.5 3.75C22.5 16.275 16.275 22.5 3.75 22.5C16.275 22.5 22.5 28.725 22.5 41.25C22.5 28.725 28.725 22.5 41.25 22.5Z" stroke="#961937" stroke-width="0.9172" stroke-miterlimit="10"/>
</svg>
