Name,X,Y,Z
1.0,289823.418574586,162834.262466319,22.4690938961047
2.0,212538.137384879,119371.299569967,25.0279092511646
3.0,196741.685319861,110487.840801603,23.6242033978526
4.0,212553.933817799,119380.183028766,26.0516895615645
5.0,212617.119624159,119415.716863007,24.5976140649105
