{
  "samplePayload": {
    "body": "{\n  \"dashboardId\":1,\n  \"evalMatches\":[\n    {\n      \"value\":1,\n      \"metric\":\"Count\",\n      \"tags\":{}\n    }\n  ],\n  \"imageUrl\":\"https://grafana.com/static/assets/img/blog/mixed_styles.png\",\n  \"message\":\"Notification Message\",\n  \"orgId\":1,\n  \"panelId\":2,\n  \"ruleId\":1,\n  \"ruleName\":\"Panel Title alert\",\n  \"ruleUrl\":\"http://localhost:3000/d/hZ7BuVbWz/test-dashboard?fullscreen\\u0026edit\\u0026tab=alert\\u0026panelId=2\\u0026orgId=1\",\n  \"state\":\"alerting\",\n  \"tags\":{\n    \"tag name\":\"tag value\"\n  },\n  \"title\":\"[Alerting] Panel Title alert\"\n}\n",
    "payloadAlerFields": {
      "nodes": [
        {
          "path": ["dashboardId"],
          "label": "Dashboard Id",
          "type": "STRING"
        },
        {
          "path": ["evalMatches"],
          "label": "Eval Matches",
          "type": "ARRAY"
        },
        {
          "path": ["createdAt"],
          "label": "Created At",
          "type": "DATETIME"
        },
        {
          "path": ["imageUrl"],
          "label": "Image Url",
          "type": "STRING"
        },
        {
          "path": ["message"],
          "label": "Message",
          "type": "STRING"
        },
        {
          "path": ["orgId"],
          "label": "Org Id",
          "type": "STRING"
        },
        {
          "path": ["panelId"],
          "label": "Panel Id",
          "type": "STRING"
        },
        {
          "path": ["ruleId"],
          "label": "Rule Id",
          "type": "STRING"
        },
        {
          "path": ["ruleName"],
          "label": "Rule Name",
          "type": "STRING"
        },
        {
          "path": ["ruleUrl"],
          "label": "Rule Url",
          "type": "STRING"
        },
        {
          "path": ["state"],
          "label": "State",
          "type": "STRING"
        },
        {
          "path": ["title"],
          "label": "Title",
          "type": "STRING"
        },
        {
          "path": ["tags", "tag"],
          "label": "Tags",
          "type": "STRING"
        }
      ]
    }
  },
  "storedMapping": {
    "nodes": [
      {
        "alertFieldName": "title",
        "payloadAlertPaths": "title",
        "fallbackAlertPaths": "ruleUrl"
      },
      {
        "alertFieldName": "description",
        "payloadAlertPaths": "message"
      },
      {
        "alertFieldName": "hosts",
        "payloadAlertPaths": "evalMatches"
      },
      {
        "alertFieldName": "startTime",
        "payloadAlertPaths": "createdAt"
      }
    ]
  }
}
