<?xml version="1.0" encoding="UTF-8" standalone="no"?>
<!DOCTYPE svg PUBLIC "-//W3C//DTD SVG 1.1//EN" "http://www.w3.org/Graphics/SVG/1.1/DTD/svg11.dtd">
<svg width="100%" height="100%" viewBox="0 0 800 800" version="1.1" xmlns="http://www.w3.org/2000/svg" xmlns:xlink="http://www.w3.org/1999/xlink" xml:space="preserve" xmlns:serif="http://www.serif.com/" style="fill-rule:evenodd;clip-rule:evenodd;stroke-linejoin:round;stroke-miterlimit:2;">
    <g transform="matrix(1.14362,0,0,1.14362,-181.93,23.7607)">
        <g transform="matrix(472.183,0,0,472.183,195.104,447.379)">
            <path d="M0.021,-0L0.15,-0L0.343,-0.263L0.491,-0.263L0.491,-0L0.599,-0L0.599,-0.679L0.308,-0.679C0.161,-0.679 0.06,-0.597 0.06,-0.471C0.06,-0.368 0.129,-0.295 0.223,-0.272L0.021,-0ZM0.172,-0.469C0.172,-0.535 0.224,-0.577 0.308,-0.577L0.491,-0.577L0.491,-0.363L0.308,-0.363C0.224,-0.363 0.172,-0.404 0.172,-0.469Z" style="fill:rgb(25,31,39);fill-rule:nonzero;"/>
        </g>
        <g transform="matrix(472.183,0,0,472.183,520.438,447.379)">
            <path d="M0.366,0.015C0.514,0.015 0.632,-0.107 0.632,-0.258C0.632,-0.409 0.517,-0.532 0.366,-0.532C0.297,-0.532 0.235,-0.505 0.188,-0.462L0.188,-0.517L0.084,-0.517L0.084,0.21L0.188,0.21L0.188,-0.054C0.235,-0.011 0.296,0.015 0.366,0.015ZM0.182,-0.258C0.182,-0.361 0.254,-0.436 0.354,-0.436C0.454,-0.436 0.526,-0.361 0.526,-0.258C0.526,-0.156 0.454,-0.081 0.354,-0.081C0.254,-0.081 0.182,-0.156 0.182,-0.258Z" style="fill:rgb(25,31,39);fill-rule:nonzero;"/>
        </g>
    </g>
</svg>
