SplineFontDB: 3.2
FontName: Untitled1
FullName: Untitled1
FamilyName: Untitled1
Weight: Regular
Copyright: Copyright (c) 2023, Teivaz
UComments: "2023-7-10: Created with FontForge (http://fontforge.org)"
Version: 001.000
ItalicAngle: 0
UnderlinePosition: -102.4
UnderlineWidth: 51.2
Ascent: 819
Descent: 205
InvalidEm: 0
LayerCount: 2
Layer: 0 0 "Back" 1
Layer: 1 0 "Fore" 0
XUID: [1021 316 1757969727 16079002]
FSType: 0
OS2Version: 0
OS2_WeightWidthSlopeOnly: 0
OS2_UseTypoMetrics: 1
CreationTime: 1688973368
ModificationTime: 1688973909
PfmFamily: 17
TTFWeight: 400
TTFWidth: 5
LineGap: 94
VLineGap: 0
OS2TypoAscent: 0
OS2TypoAOffset: 1
OS2TypoDescent: 0
OS2TypoDOffset: 1
OS2TypoLinegap: 94
OS2WinAscent: 0
OS2WinAOffset: 1
OS2WinDescent: 0
OS2WinDOffset: 1
HheadAscent: 0
HheadAOffset: 1
HheadDescent: 0
HheadDOffset: 1
OS2Vendor: 'PfEd'
MarkAttachClasses: 1
DEI: 91125
LangName: 1033
Encoding: ISO8859-1
UnicodeInterp: none
NameList: AGL For New Fonts
DisplaySize: -48
AntiAlias: 1
FitToEm: 0
WinInfo: 0 20 6
BeginPrivate: 0
EndPrivate
TeXData: 1 0 0 346030 173015 115343 0 1048576 115343 783286 444596 497025 792723 393216 433062 380633 303038 157286 324010 404750 52429 2506097 1059062 262144
BeginChars: 256 1

StartChar: A
Encoding: 65 65 0
Width: 1024
Flags: HW
LayerCount: 2
Fore
SplineSet
654 499 m 2
 666 605 730 694 819 743 c 1
 819 1 l 1
 648 1 l 1
 635 -70 595 -130 540 -172 c 0
 528 -181 519 -192 512 -205 c 1
 505 -192 496 -181 484 -172 c 0
 429 -130 389 -70 376 1 c 1
 205 1 l 1
 205 743 l 1
 294 694 358 604 370 499 c 2
 395 282 l 1
 391 283 388 283 384 283 c 0
 356 283 332 260 332 232 c 0
 332 208 349 187 372 182 c 2
 399 176 l 2
 402 182 406 188 409 194 c 0
 455 273 481 364 481 462 c 0
 481 468 481 474 481 480 c 2
 473 713 l 1
 473 718 l 2
 473 757 488 792 512 819 c 1
 536 792 550 757 550 718 c 2
 550 713 l 1
 542 480 l 2
 542 474 542 468 542 462 c 0
 542 364 568 273 614 194 c 0
 617 188 621 182 624 176 c 2
 651 182 l 2
 674 187 691 208 691 232 c 0
 691 260 668 283 640 283 c 0
 636 283 632 283 628 282 c 1
 654 499 l 2
431 116 m 1
 425 96 422 75 422 53 c 1
 486 53 l 1
 486 85 462 112 431 116 c 1
537 53 m 1
 601 53 l 1
 601 75 598 96 592 116 c 1
 561 112 537 85 537 53 c 1
512 307 m 1
 498 257 478 210 453 167 c 0
 452 166 452 165 451 164 c 1
 475 158 497 144 512 125 c 1
 527 144 549 158 573 164 c 1
 572 165 572 166 571 167 c 0
 546 210 526 257 512 307 c 1
256 637 m 1
 256 257 l 1
 285 257 l 1
 293 286 312 311 339 324 c 1
 319 494 l 2
 313 548 290 597 256 637 c 1
256 53 m 1
 371 53 l 1
 371 79 375 103 381 127 c 1
 361 132 l 2
 324 141 294 169 285 206 c 1
 256 206 l 1
 256 53 l 1
428 1 m 1
 437 -40 458 -77 486 -107 c 1
 486 1 l 1
 428 1 l 1
537 -106 m 1
 565 -77 587 -40 596 2 c 1
 537 2 l 1
 537 -106 l 1
768 53 m 1
 768 53 l 1
 768 206 l 1
 739 206 l 1
 730 169 700 141 663 132 c 2
 642 127 l 1
 649 103 653 79 653 53 c 1
 768 53 l 1
768 257 m 1
 768 637 l 1
 734 597 711 548 705 494 c 2
 685 324 l 1
 712 311 731 286 739 257 c 1
 768 257 l 1
EndSplineSet
EndChar
EndChars
EndSplineFont
