
{
    "categories": [
      {
        "name": "tires",
        "link": "/tires"
      },
      {
        "name": "kids",
        "link": "/kids",
        "subcategories": false
      },
      {
        "name": "sport",
        "link": "/sport",
        "subcategories": [
          {
            "name": "running",
            "link": "/sport/running"
          },
          {
            "name": "lifting",
            "link": "/sport/lifting"
          },
          {
            "name": "hiking",
            "link": "/sport/hiking"
          }
        ]
      },
      {
        "name": "phones",
        "link": "/phones",
        "subcategories": false
      }
    ],
    "products": [
      {
        "name": "Hankook Winter",
        "decription":"wrum wrum on snow",
        "price": 100,
        "img_url": "https://content.rozetka.com.ua/goods/images/big/289360213.jpg",
        "id": "00110010",
        "category": "tires",
        "discount": 10
      },
      {
        "name": "Michelin 215/50R18 92V Pilot Alpin 5",
        "decription":"Michelin 215/50R18 92V Pilot Alpin 5",
        "price": 120,
        "img_url": "https://content2.rozetka.com.ua/goods/images/big/288928694.jpg",
        "id": "110011",
        "category": "tires",
        "discount": 5
      },
      {
        "name": "Tigar 195/75R16 107/105R Cargo Speed Winter",
        "decription":"Tigar 195/75R16 107/105R Cargo Speed Winter",
        "price": 110,
        "img_url": "https://content1.rozetka.com.ua/goods/images/big/288930575.jpg",
        "id": "0001111",
        "category": "tires"
      },
      {
        "name": "Tigar 225/45R17 94V UHP XL",
        "decription":"Tigar 225/45R17 94V UHP XL",
        "price": 95,
        "img_url": "https://content.rozetka.com.ua/goods/images/big/290283149.jpg",
        "id": "00000000",
        "category": "tires"
      },
      {
        "name": "Pictionary Air",
        "decription":"Представляємо Pictionary Air — новий спосіб грати в класичну гру!",
        "price": 999,
        "img_url": "https://content1.rozetka.com.ua/goods/images/big/35789939.jpg",
        "id": "00000ss000",
        "category": "kids"
      }
    ,
      {
        "name": "Обережно! Злий собака",
        "decription":"\"Обережно! Злий собака\" - суперэкстремальная гра для дітей, яка буде тримати всіх у напрузі кожну секунду!",
        "price": 999,
        "img_url": "https://content.rozetka.com.ua/goods/images/big/215358442.jpg",
        "id": "0sd0000ss000",
        "category": "kids",
        "discount": 20
      },
      {
        "name": "Apple iPhone 14 128GB PRODUCT Red",
        "decription":"Екран (6.1\", OLED (Super Retina XDR), 2532x1170) / Apple A15 Bionic / подвійна основна камера: 12 Мп + 12 Мп, фронтальна камера: 12 Мп / 128 ГБ вбудованої пам'яті / 3G / LTE / 5G / GPS / Nano-SIM / iOS 16",
        "price": 36499,
        "img_url": "https://content2.rozetka.com.ua/goods/images/big/284913542.jpg",
        "id": "MPVA3RXA",
        "category": "phones",
        "discount": 15
      },
      {
        "name": "Apple iPhone 14 512GB Purple",
        "decription":"Екран (6.1\", OLED (Super Retina XDR), 2532x1170) / Apple A15 Bionic / подвійна основна камера: 12 Мп + 12 Мп, фронтальна камера: 12 Мп / 512 ГБ вбудованої пам'яті / 3G / LTE / 5G / GPS / Nano-SIM / iOS 16",
        "price": 51499,
        "img_url": "https://content2.rozetka.com.ua/goods/images/big/284913540.jpg",
        "id": "MPX93RX",
        "category": "phones"
      },
      {
        "name": "ASICS Gel-Sonoma 6 G-Tx",
        "decription":"Бігові кросівки Gel-Sonoma 6 G-TX створені для комфортного бігу на природі.",
        "price": 3399,
        "img_url": "https://content2.rozetka.com.ua/goods/images/big/290432149.jpg",
        "id": "1011B048-400",
        "category": "running"
      },
      {
        "name": "Набір RN-Sport штанга 42 кг + 2 гантелі по 10 кг",
        "decription":"Розбірна штанга та гантелі скомплектовані з млинців, які мають пластикове покриття.",
        "price": 3457,
        "img_url": "https://content.rozetka.com.ua/goods/images/big/66591933.jpg",
        "id": "Rn4210",
        "category": "lifting"
      },
      {
        "name": "Намет Terra Incognita Camp 4 Хакі",
        "decription":"4-місний кемпінговий намет «тунельного» типу. Завдяки оптимальній конструкції каркаса форми «напівбочка», намет має прийнятну ціну з достатнім комфортом в експлуатації.",
        "price": 9963,
        "img_url": "https://content.rozetka.com.ua/goods/images/big/46925511.jpg",
        "id": "4823081503361",
        "category": "hiking"
      }
    ]
  }