2013.01.31 23:53:00,1.35869,1.35866,0,49,23,1.358430435461099,1.358430435461099
2013.01.31 23:54:00,1.35869,1.35892,0,68,20,1.358539227580855,1.358539227580855
2013.01.31 23:55:00,1.35893,1.35887,0,63,25,1.358612732562887,1.358612732562887
2013.01.31 23:56:00,1.35887,1.35888,0,53,24,1.35867212532669,1.35867212532669
2013.01.31 23:57:00,1.35889,1.35875,0,35,23,1.358689430809648,1.358689430809648
2013.01.31 23:58:00,1.35874,1.35863,0,43,26,1.358676223963059,1.358676223963059
2013.01.31 23:59:00,1.35862,1.35869,0,41,23,1.358679285304602,1.358679285304602
2013.02.01 00:00:00,1.35864,1.35838,0,54,24,1.358612777459135,1.358612777459135
2013.02.01 00:01:00,1.35837,1.35833,0,30,14,1.358549938023772,1.358549938023772
2013.02.01 00:02:00,1.35834,1.35834,0,1,14,1.3585032851296,1.3585032851296
