<?xml version="1.0" encoding="UTF-8"?>
<svg width="395px" height="303px" viewBox="0 0 395 303" version="1.1" xmlns="http://www.w3.org/2000/svg" xmlns:xlink="http://www.w3.org/1999/xlink">
    <!-- Generator: Sketch 49.1 (51147) - http://www.bohemiancoding.com/sketch -->
    <title>no-products</title>
    <desc>Created with Sketch.</desc>
    <defs>
        <linearGradient x1="10.8549605%" y1="101.74029%" x2="89.1461511%" y2="-1.73567835%" id="linearGradient-1">
            <stop stop-color="#808080" stop-opacity="0.25" offset="0%"></stop>
            <stop stop-color="#808080" stop-opacity="0.12" offset="54%"></stop>
            <stop stop-color="#808080" stop-opacity="0.1" offset="100%"></stop>
        </linearGradient>
        <linearGradient x1="71619%" y1="37464%" x2="71619%" y2="30223%" id="linearGradient-2">
            <stop stop-color="#808080" stop-opacity="0.25" offset="0%"></stop>
            <stop stop-color="#808080" stop-opacity="0.12" offset="54%"></stop>
            <stop stop-color="#808080" stop-opacity="0.1" offset="100%"></stop>
        </linearGradient>
        <linearGradient x1="80896%" y1="80135%" x2="80896%" y2="25882%" id="linearGradient-3">
            <stop stop-color="#808080" stop-opacity="0.25" offset="0%"></stop>
            <stop stop-color="#808080" stop-opacity="0.12" offset="54%"></stop>
            <stop stop-color="#808080" stop-opacity="0.1" offset="100%"></stop>
        </linearGradient>
    </defs>
    <g id="Version-1" stroke="none" stroke-width="1" fill="none" fill-rule="evenodd">
        <g id="Assignments-overview-Copy-2" transform="translate(-602.000000, -355.000000)">
            <g id="Group-13" transform="translate(503.000000, 354.941406)">
                <g id="no-products" transform="translate(99.500000, 0.707031)">
                    <path d="M91.447551,243.086308 C96.7298904,243.433887 102.312607,245.266185 107.118634,243.047688 C108.358761,242.476973 109.483028,241.653082 110.770357,241.193935 C113.726922,240.138325 116.975282,241.163897 119.953303,242.150849 C143.267605,249.867706 167.232409,255.458919 191.554534,258.856087 C196.566534,259.555536 201.797381,260.143416 206.573371,258.512799 C210.066323,257.324166 213.091546,255.028429 216.550169,253.7411 C222.205834,251.642754 228.45367,252.423734 234.474078,252.754148 C250.243092,253.613524 266.019845,251.210491 280.817917,245.695295 L281.594606,245.399209 C289.068853,242.51262 297.499895,243.645607 303.946926,248.402977 C306.461469,250.247334 309.128757,251.873834 311.919782,253.264789 C321.304913,257.996946 325.220863,269.337797 320.755149,278.852595 L320.652163,279.075732 C318.197656,284.426729 316.150803,290.417099 311.340484,293.815648 C306.804796,297.021096 300.853045,297.15412 295.300367,297.166994 L261.21619,297.248525 C257.680327,297.248525 254.101552,297.248525 250.668675,296.416052 C247.583377,295.656528 244.712634,294.231884 241.867637,292.815822 L226.617081,285.25062 C220.476522,282.19965 213.743793,279.058568 207.023936,280.461756 C200.158182,281.894982 195.210548,287.666507 189.22876,291.305356 C179.947119,296.95673 167.605926,297.179867 158.126895,291.858908 C153.586915,289.309997 149.643398,285.593907 144.691473,283.993328 C136.512643,281.345722 127.823173,285.010318 119.408334,286.765377 C103.033511,290.181089 83.7450333,285.508085 71.1978681,274.209629 C55.0375998,259.654231 74.0128272,241.944877 91.447551,243.086308 Z" id="Shape" fill="#F0E4E4" fill-rule="nonzero"></path>
                    <path d="M29.5227418,267.391077 C29.5227418,267.391077 17.0313608,225.003629 31.8656803,193.773031 C38.0920609,180.672314 40.1603693,165.966728 37.2810437,151.750326 C35.9060499,145.002691 33.9152291,138.395349 31.3335844,132.011283" id="Shape" stroke="#535461" stroke-width="2"></path>
                    <path d="M40.5594412,112.302279 C40.5594412,117.498796 31.1490673,132.569126 31.1490673,132.569126 C31.1490673,132.569126 21.7386933,117.498796 21.7386933,112.302279 C21.7386933,107.105072 25.9518613,102.891905 31.1490673,102.891905 C36.3462733,102.891905 40.5594412,107.105072 40.5594412,112.302279 Z" id="Shape" fill="#3C7BE9" fill-rule="nonzero"></path>
                    <path d="M56.1146649,141.091243 C53.2911236,145.455288 37.1995129,152.990453 37.1995129,152.990453 C37.1995129,152.990453 37.4913075,135.225314 40.3148488,130.86127 C42.1422575,128.038904 45.3365668,126.405842 48.6945112,126.577242 C52.0524556,126.748642 55.0638836,128.698463 56.5944193,131.692228 C58.124955,134.685994 57.9420737,138.268878 56.1146649,141.091243 Z" id="Shape" fill="#3C7BE9" fill-rule="nonzero"></path>
                    <path d="M55.4366717,190.28437 C50.7979968,192.623017 33.1229715,191.009565 33.1229715,191.009565 C33.1229715,191.009565 42.3445373,175.819084 46.9832122,173.480437 C49.9889112,171.933236 53.5935523,172.117132 56.4261904,173.962184 C59.2588285,175.807237 60.8841519,179.029903 60.6840049,182.404514 C60.4838579,185.779125 58.4889985,188.78708 55.4581272,190.28437 L55.4366717,190.28437 Z" id="Shape" fill="#3C7BE9" fill-rule="nonzero"></path>
                    <path d="M46.5412293,227.39377 C42.3617016,230.483359 24.6566387,231.882256 24.6566387,231.882256 C24.6566387,231.882256 31.179105,215.352954 35.3543415,212.263364 C39.5338276,209.247342 45.3618329,210.154586 48.4267571,214.298345 C51.4916812,218.442104 50.6529795,224.280367 46.5455204,227.39377 L46.5412293,227.39377 Z" id="Shape" fill="#3C7BE9" fill-rule="nonzero"></path>
                    <path d="M17.443306,153.994569 C21.1722686,157.616254 38.5383349,161.366672 38.5383349,161.366672 C38.5383349,161.366672 34.2858586,144.116466 30.556896,140.494781 C26.8238576,136.906922 20.8936659,137.008749 17.2860063,140.722655 C13.6783466,144.436561 13.7486371,150.367211 17.443306,153.994569 Z" id="Shape" fill="#3C7BE9" fill-rule="nonzero"></path>
                    <path d="M7.58665807,197.540613 C12.2253331,199.879261 29.9003583,198.265809 29.9003583,198.265809 C29.9003583,198.265809 20.6787926,183.075328 16.0401176,180.736681 C11.4325623,178.606702 5.96603312,180.514872 3.68484091,185.049465 C1.4036487,189.584058 3.12998782,195.110703 7.58665807,197.540613 Z" id="Shape" fill="#3C7BE9" fill-rule="nonzero"></path>
                    <path d="M3.81478452,241.146733 C7.99431221,244.236322 25.6993751,245.635219 25.6993751,245.635219 C25.6993751,245.635219 19.1769089,229.105917 15.0016723,226.016328 C10.8221862,223.000305 4.99418091,223.90755 1.92925677,228.051308 C-1.13566737,232.195067 -0.296965659,238.03333 3.81049342,241.146733 L3.81478452,241.146733 Z" id="Shape" fill="#3C7BE9" fill-rule="nonzero"></path>
                    <path d="M40.5594412,112.302279 C40.5594412,117.498796 31.1490673,132.569126 31.1490673,132.569126 C31.1490673,132.569126 21.7386933,117.498796 21.7386933,112.302279 C21.7386933,107.105072 25.9518613,102.891905 31.1490673,102.891905 C36.3462733,102.891905 40.5594412,107.105072 40.5594412,112.302279 Z" id="Shape" fill="#000000" fill-rule="nonzero" opacity="0.25"></path>
                    <path d="M56.1146649,141.091243 C53.2911236,145.455288 37.1995129,152.990453 37.1995129,152.990453 C37.1995129,152.990453 37.4913075,135.225314 40.3148488,130.86127 C42.1422575,128.038904 45.3365668,126.405842 48.6945112,126.577242 C52.0524556,126.748642 55.0638836,128.698463 56.5944193,131.692228 C58.124955,134.685994 57.9420737,138.268878 56.1146649,141.091243 Z" id="Shape" fill="#000000" fill-rule="nonzero" opacity="0.25"></path>
                    <path d="M55.4366717,190.28437 C50.7979968,192.623017 33.1229715,191.009565 33.1229715,191.009565 C33.1229715,191.009565 42.3445373,175.819084 46.9832122,173.480437 C49.9889112,171.933236 53.5935523,172.117132 56.4261904,173.962184 C59.2588285,175.807237 60.8841519,179.029903 60.6840049,182.404514 C60.4838579,185.779125 58.4889985,188.78708 55.4581272,190.28437 L55.4366717,190.28437 Z" id="Shape" fill="#000000" fill-rule="nonzero" opacity="0.25"></path>
                    <path d="M46.5412293,227.39377 C42.3617016,230.483359 24.6566387,231.882256 24.6566387,231.882256 C24.6566387,231.882256 31.179105,215.352954 35.3543415,212.263364 C39.5338276,209.247342 45.3618329,210.154586 48.4267571,214.298345 C51.4916812,218.442104 50.6529795,224.280367 46.5455204,227.39377 L46.5412293,227.39377 Z" id="Shape" fill="#000000" fill-rule="nonzero" opacity="0.25"></path>
                    <path d="M17.443306,153.994569 C21.1722686,157.616254 38.5383349,161.366672 38.5383349,161.366672 C38.5383349,161.366672 34.2858586,144.116466 30.556896,140.494781 C26.8238576,136.906922 20.8936659,137.008749 17.2860063,140.722655 C13.6783466,144.436561 13.7486371,150.367211 17.443306,153.994569 Z" id="Shape" fill="#000000" fill-rule="nonzero" opacity="0.25"></path>
                    <path d="M7.58665807,197.540613 C12.2253331,199.879261 29.9003583,198.265809 29.9003583,198.265809 C29.9003583,198.265809 20.6787926,183.075328 16.0401176,180.736681 C11.4325623,178.606702 5.96603312,180.514872 3.68484091,185.049465 C1.4036487,189.584058 3.12998782,195.110703 7.58665807,197.540613 Z" id="Shape" fill="#000000" fill-rule="nonzero" opacity="0.25"></path>
                    <path d="M3.81478452,241.146733 C7.99431221,244.236322 25.6993751,245.635219 25.6993751,245.635219 C25.6993751,245.635219 19.1769089,229.105917 15.0016723,226.016328 C10.8221862,223.000305 4.99418091,223.90755 1.92925677,228.051308 C-1.13566737,232.195067 -0.296965659,238.03333 3.81049342,241.146733 L3.81478452,241.146733 Z" id="Shape" fill="#000000" fill-rule="nonzero" opacity="0.25"></path>
                    <path d="M257.259799,149.875117 C255.672093,137.430938 260.645474,124.622016 257.688909,112.439594 C255.414628,103.02922 248.677607,95.1722225 246.463401,85.7446842 C243.21075,71.772875 250.651511,57.4234493 260.147707,46.6957088 C266.678755,39.30215 274.874749,32.5908756 284.645575,31.2477625 C290.678856,30.3895433 296.87949,31.715492 302.449333,34.1742901 C313.899041,39.3076574 322.697667,48.9721546 326.736938,60.8520351 C328.024266,64.6711108 328.766626,68.6661213 330.350041,72.3693373 C333.074887,78.7501974 338.074014,83.8995128 341.185058,90.1044379 C345.377652,98.6035445 345.792078,108.47655 342.32649,117.297114 C338.72626,126.28267 331.16964,133.80067 330.053955,143.417017 C329.242938,150.347137 331.843342,157.938087 328.466249,164.044316 C325.917338,168.652954 320.669328,170.978728 315.700238,172.720913 C304.140025,176.754543 287.979757,183.27701 276.393797,177.067793 C266.258228,171.639557 258.727354,161.362381 257.259799,149.875117 Z" id="Shape" fill="#3C7BE9" fill-rule="nonzero"></path>
                    <path d="M289.696195,158.719066 C289.696195,158.719066 306.714683,151.853312 308.860231,147.991326 C311.005779,144.129339 314.009546,121.386529 314.009546,121.386529" id="Shape" stroke="#333333" stroke-width="3"></path>
                    <path d="M289.533134,263.859505 L289.533134,115.816686" id="Shape" stroke="#333333" stroke-width="3"></path>
                    <g id="Group" opacity="0.5" transform="translate(120.579803, 0.000000)" fill="url(#linearGradient-1)" fill-rule="nonzero">
                        <path d="M148.643572,7.62241561e-16 L5.96462371,0.347578792 C4.41001966,0.350989254 2.92044336,0.971826022 1.8235865,2.0735113 C0.726729653,3.17519657 0.112441637,4.66748544 0.115859597,6.22208948 L0.763815123,273.063906 C0.7672243,274.619256 1.3886504,276.109484 2.49126448,277.206464 C3.59387856,278.303444 5.0872704,278.917229 6.64261691,278.91267 L149.321565,278.565092 C150.876169,278.561681 152.365746,277.940844 153.462603,276.839159 C154.559459,275.737474 155.173747,274.245185 155.17033,272.690581 L154.526665,5.84876411 C154.523258,4.29266868 153.901243,2.80178804 152.797699,1.70468415 C151.694156,0.607580263 150.199661,-0.00569955403 148.643572,7.62241561e-16 Z" id="Shape"></path>
                    </g>
                    <rect id="Rectangle-path" fill="#535461" fill-rule="nonzero" transform="translate(198.226348, 139.400866) rotate(-0.140000) translate(-198.226348, -139.400866) " x="123.108564" y="3.81295367" width="150.235569" height="271.175824" rx="13.64"></rect>
                    <path d="M269.871331,262.310419 C269.878451,265.460728 267.331639,268.020984 264.181337,268.030451 L132.873794,268.347992 C129.723485,268.355112 127.163229,265.8083 127.153762,262.657998 L127.063649,224.14541 L126.561591,16.4906827 C126.554471,13.3403743 129.101283,10.780118 132.251585,10.7706514 L159.7146,10.706285 C160.628001,16.6391171 165.72695,21.022393 171.72967,21.0349535 L223.617605,20.9105118 C229.637591,20.8894758 234.740255,16.4759182 235.628383,10.5217679 L263.520508,10.4531103 C266.670817,10.4459901 269.231073,12.9928017 269.24054,16.1431039 L269.776927,224.14541 L269.871331,262.310419 Z" id="Shape" fill="#FFFFFF" fill-rule="nonzero"></path>
                    <path d="M269.871331,262.310419 C269.878451,265.460728 267.331639,268.020984 264.181337,268.030451 L132.873794,268.347992 C129.723485,268.355112 127.163229,265.8083 127.153762,262.657998 L127.063649,224.14541 L269.776927,224.14541 L269.871331,262.310419 Z" id="Shape" fill="#E6E6E6" fill-rule="nonzero"></path>
                    <rect id="Rectangle-3" fill="#3A7DE3" x="144.882201" y="239.340072" width="107" height="16.0680097" rx="4"></rect>
                    <rect id="Rectangle-path" fill="#FFFFFF" fill-rule="nonzero" transform="translate(196.560062, 14.922296) rotate(-0.860000) translate(-196.560062, -14.922296) " x="179.820496" y="13.8752685" width="33.4791325" height="2.09405494" rx="1.04702747"></rect>
                    <circle id="Oval" fill="#FFFFFF" fill-rule="nonzero" transform="translate(220.403014, 14.349900) rotate(-0.860000) translate(-220.403014, -14.349900) " cx="220.403014" cy="14.3499001" r="1.25729119"></circle>
                    <path d="M306.607405,149.875117 C305.0197,137.430938 309.99308,124.622016 307.036515,112.439594 C304.762234,103.02922 298.025213,95.1722225 295.811007,85.7446842 C292.558356,71.772875 299.999117,57.4234493 309.495313,46.6957088 C316.026361,39.30215 324.222355,32.5908756 333.993181,31.2477625 C340.026462,30.3895433 346.227096,31.715492 351.796939,34.1742901 C363.246647,39.3076574 372.045273,48.9721546 376.084544,60.8520351 C377.371873,64.6711108 378.114232,68.6661213 379.697647,72.3693373 C382.422493,78.7501974 387.42162,83.8995128 390.532665,90.1044379 C394.72611,98.6101771 395.135907,108.490496 391.661223,117.314279 C388.060993,126.299834 380.504373,133.817835 379.388688,143.434181 C378.577671,150.364302 381.178075,157.955251 377.800982,164.061481 C375.252071,168.670118 370.00406,170.995892 365.034971,172.738077 C353.487631,176.754543 337.327363,183.27701 325.741403,177.067793 C315.605834,171.639557 308.07496,161.362381 306.607405,149.875117 Z" id="Shape" fill="#3C7BE9" fill-rule="nonzero"></path>
                    <path d="M306.607405,149.875117 C305.0197,137.430938 309.99308,124.622016 307.036515,112.439594 C304.762234,103.02922 298.025213,95.1722225 295.811007,85.7446842 C292.558356,71.772875 299.999117,57.4234493 309.495313,46.6957088 C316.026361,39.30215 324.222355,32.5908756 333.993181,31.2477625 C340.026462,30.3895433 346.227096,31.715492 351.796939,34.1742901 C363.246647,39.3076574 372.045273,48.9721546 376.084544,60.8520351 C377.371873,64.6711108 378.114232,68.6661213 379.697647,72.3693373 C382.422493,78.7501974 387.42162,83.8995128 390.532665,90.1044379 C394.72611,98.6101771 395.135907,108.490496 391.661223,117.314279 C388.060993,126.299834 380.504373,133.817835 379.388688,143.434181 C378.577671,150.364302 381.178075,157.955251 377.800982,164.061481 C375.252071,168.670118 370.00406,170.995892 365.034971,172.738077 C353.487631,176.754543 337.327363,183.27701 325.741403,177.067793 C315.605834,171.639557 308.07496,161.362381 306.607405,149.875117 Z" id="Shape" fill="#000000" fill-rule="nonzero" opacity="0.2"></path>
                    <path d="M339.043801,158.719066 C339.043801,158.719066 356.062289,151.853312 358.207837,147.991326 C360.353385,144.129339 363.357152,121.386529 363.357152,121.386529" id="Shape" stroke="#333333" stroke-width="3"></path>
                    <path d="M338.88074,263.859505 L338.88074,115.816686" id="Shape" stroke="#333333" stroke-width="3"></path>
                    <path d="M60.6975557,284.649866 C60.6975557,284.649866 55.2392813,266.116622 61.7188366,252.466645 C64.474285,246.763614 65.3054412,240.320648 64.0875217,234.105044 C63.4859059,231.158032 62.615464,228.272359 61.4871174,225.484232" id="Shape" stroke="#535461" stroke-width="2"></path>
                    <path d="M65.5207478,216.876293 C65.5207478,219.146283 61.4098776,225.733115 61.4098776,225.733115 C61.4098776,225.733115 57.2990075,219.146283 57.2990075,216.876293 C57.2990075,214.604737 59.1404673,212.763277 61.4120232,212.763277 C63.683579,212.763277 65.5250389,214.604737 65.5250389,216.876293 L65.5207478,216.876293 Z" id="Shape" fill="#3C7BE9" fill-rule="nonzero"></path>
                    <path d="M72.3221353,229.457787 C71.0862996,231.363034 64.057484,234.658595 64.057484,234.658595 C64.057484,234.658595 64.1862169,226.896002 65.4177615,224.986465 C66.2164863,223.753117 67.6125215,223.039571 69.0799943,223.114614 C70.547467,223.189656 71.8634332,224.041885 72.5321811,225.350275 C73.2009291,226.658664 73.1208601,228.224439 72.3221353,229.457787 Z" id="Shape" fill="#3C7BE9" fill-rule="nonzero"></path>
                    <path d="M72.0217585,250.956179 C69.99207,251.97746 62.2595147,251.27372 62.2595147,251.27372 C62.2595147,251.27372 66.288854,244.635394 68.3185425,243.614113 C69.6300762,242.952597 71.1948979,243.041026 72.4235543,243.84609 C73.6522107,244.651153 74.3580397,246.050543 74.2751623,247.517123 C74.192285,248.983702 73.3332923,250.294663 72.0217585,250.956179 Z" id="Shape" fill="#3C7BE9" fill-rule="nonzero"></path>
                    <path d="M68.1340254,267.172231 C66.3060184,268.523927 58.569172,269.133262 58.569172,269.133262 C58.569172,269.133262 61.4184598,261.911347 63.2464668,260.55107 C65.0724802,259.200223 67.6478341,259.585422 68.998681,261.411435 C70.3495279,263.237448 69.9643296,265.812802 68.1383165,267.163649 L68.1340254,267.172231 Z" id="Shape" fill="#3C7BE9" fill-rule="nonzero"></path>
                    <path d="M55.402343,235.100578 C57.0329595,236.683993 64.6196176,238.323192 64.6196176,238.323192 C64.6196176,238.323192 62.7615729,230.783736 61.1309564,229.200321 C60.076977,228.177003 58.557126,227.793709 57.1439166,228.194823 C55.7307073,228.595937 54.6388397,229.720519 54.2796098,231.144952 C53.92038,232.569384 54.3483634,234.07726 55.402343,235.100578 Z" id="Shape" fill="#3C7BE9" fill-rule="nonzero"></path>
                    <path d="M51.1112468,254.118717 C53.1409353,255.139998 60.8734906,254.436258 60.8734906,254.436258 C60.8734906,254.436258 56.8441513,247.797932 54.8144628,246.776651 C52.7870074,245.754036 50.314437,246.568621 49.2918221,248.596076 C48.2692073,250.623531 49.0837914,253.096102 51.1112468,254.118717 Z" id="Shape" fill="#3C7BE9" fill-rule="nonzero"></path>
                    <path d="M49.4634658,273.184057 C51.2914728,274.535752 59.0283193,275.145088 59.0283193,275.145088 C59.0283193,275.145088 56.1790314,267.923173 54.3510244,266.562896 C52.5250111,265.212049 49.9496569,265.597247 48.59881,267.42326 C47.247963,269.249274 47.6331614,271.824628 49.4591747,273.175475 L49.4634658,273.184057 Z" id="Shape" fill="#3C7BE9" fill-rule="nonzero"></path>
                    <path d="M65.5207478,216.876293 C65.5207478,219.146283 61.4098776,225.733115 61.4098776,225.733115 C61.4098776,225.733115 57.2990075,219.146283 57.2990075,216.876293 C57.2990075,214.604737 59.1404673,212.763277 61.4120232,212.763277 C63.683579,212.763277 65.5250389,214.604737 65.5250389,216.876293 L65.5207478,216.876293 Z" id="Shape" fill="#000000" fill-rule="nonzero" opacity="0.25"></path>
                    <path d="M72.3221353,229.457787 C71.0862996,231.363034 64.057484,234.658595 64.057484,234.658595 C64.057484,234.658595 64.1862169,226.896002 65.4177615,224.986465 C66.2164863,223.753117 67.6125215,223.039571 69.0799943,223.114614 C70.547467,223.189656 71.8634332,224.041885 72.5321811,225.350275 C73.2009291,226.658664 73.1208601,228.224439 72.3221353,229.457787 Z" id="Shape" fill="#000000" fill-rule="nonzero" opacity="0.25"></path>
                    <path d="M72.0217585,250.956179 C69.99207,251.97746 62.2595147,251.27372 62.2595147,251.27372 C62.2595147,251.27372 66.288854,244.635394 68.3185425,243.614113 C69.6300762,242.952597 71.1948979,243.041026 72.4235543,243.84609 C73.6522107,244.651153 74.3580397,246.050543 74.2751623,247.517123 C74.192285,248.983702 73.3332923,250.294663 72.0217585,250.956179 Z" id="Shape" fill="#000000" fill-rule="nonzero" opacity="0.25"></path>
                    <path d="M68.1340254,267.172231 C66.3060184,268.523927 58.569172,269.133262 58.569172,269.133262 C58.569172,269.133262 61.4184598,261.911347 63.2464668,260.55107 C65.0724802,259.200223 67.6478341,259.585422 68.998681,261.411435 C70.3495279,263.237448 69.9643296,265.812802 68.1383165,267.163649 L68.1340254,267.172231 Z" id="Shape" fill="#000000" fill-rule="nonzero" opacity="0.25"></path>
                    <path d="M55.402343,235.100578 C57.0329595,236.683993 64.6196176,238.323192 64.6196176,238.323192 C64.6196176,238.323192 62.7615729,230.783736 61.1309564,229.200321 C60.076977,228.177003 58.557126,227.793709 57.1439166,228.194823 C55.7307073,228.595937 54.6388397,229.720519 54.2796098,231.144952 C53.92038,232.569384 54.3483634,234.07726 55.402343,235.100578 Z" id="Shape" fill="#000000" fill-rule="nonzero" opacity="0.25"></path>
                    <path d="M51.1112468,254.118717 C53.1409353,255.139998 60.8734906,254.436258 60.8734906,254.436258 C60.8734906,254.436258 56.8441513,247.797932 54.8144628,246.776651 C52.7870074,245.754036 50.314437,246.568621 49.2918221,248.596076 C48.2692073,250.623531 49.0837914,253.096102 51.1112468,254.118717 Z" id="Shape" fill="#000000" fill-rule="nonzero" opacity="0.25"></path>
                    <path d="M49.4634658,273.184057 C51.2914728,274.535752 59.0283193,275.145088 59.0283193,275.145088 C59.0283193,275.145088 56.1790314,267.923173 54.3510244,266.562896 C52.5250111,265.212049 49.9496569,265.597247 48.59881,267.42326 C47.247963,269.249274 47.6331614,271.824628 49.4591747,273.175475 L49.4634658,273.184057 Z" id="Shape" fill="#000000" fill-rule="nonzero" opacity="0.25"></path>
                    <path d="M363.099687,274.162427 C363.099687,274.162427 356.336919,251.205062 364.387016,234.306726 C367.798161,227.242348 368.826532,219.262304 367.317834,211.563916 C366.571929,207.914218 365.493216,204.340533 364.095221,200.887668" id="Shape" stroke="#535461" stroke-width="2"></path>
                    <path d="M369.081475,190.194257 C369.081475,193.009216 363.987944,201.16659 363.987944,201.16659 C363.987944,201.16659 358.894412,193.013507 358.894412,190.194257 C358.894412,187.379992 361.175825,185.09858 363.990089,185.09858 C366.804354,185.09858 369.085766,187.379992 369.085766,190.194257 L369.081475,190.194257 Z" id="Shape" fill="#3C7BE9" fill-rule="nonzero"></path>
                    <path d="M377.496314,205.779518 C375.968684,208.139621 367.257759,212.216162 367.257759,212.216162 C367.257759,212.216162 367.416529,202.599816 368.94416,200.235422 C370.473935,197.87381 373.628527,197.199472 375.99014,198.729247 C378.351752,200.259022 379.026089,203.413615 377.496314,205.775227 L377.496314,205.779518 Z" id="Shape" fill="#3C7BE9" fill-rule="nonzero"></path>
                    <path d="M377.131571,232.414352 C374.62128,233.701681 365.039262,232.804842 365.039262,232.804842 C365.039262,232.804842 370.029807,224.583102 372.544389,223.312937 C375.056491,222.046222 378.119827,223.055807 379.386542,225.567908 C380.653257,228.08001 379.643672,231.143346 377.131571,232.410061 L377.131571,232.414352 Z" id="Shape" fill="#3C7BE9" fill-rule="nonzero"></path>
                    <path d="M372.31267,252.505264 C370.051263,254.178792 360.460663,254.934025 360.460663,254.934025 C360.460663,254.934025 363.992235,245.987089 366.253642,244.313562 C368.515719,242.640408 371.705853,243.117823 373.379008,245.379899 C375.052162,247.641976 374.574746,250.83211 372.31267,252.505264 Z" id="Shape" fill="#3C7BE9" fill-rule="nonzero"></path>
                    <path d="M356.560056,212.769714 C358.576871,214.730745 367.982954,216.760433 367.982954,216.760433 C367.982954,216.760433 365.678636,207.418717 363.66182,205.461977 C361.63016,203.617614 358.502611,203.714124 356.588535,205.680245 C354.674458,207.646366 354.661866,210.775378 356.560056,212.75684 L356.560056,212.769714 Z" id="Shape" fill="#3C7BE9" fill-rule="nonzero"></path>
                    <path d="M351.226224,236.336414 C353.736515,237.623743 363.318533,236.726904 363.318533,236.726904 C363.318533,236.726904 358.327988,228.505163 355.813405,227.234999 C354.188361,226.415578 352.249602,226.525353 350.72744,227.522972 C349.205278,228.520591 348.330966,230.254493 348.433849,232.071534 C348.536732,233.888574 349.601179,235.512702 351.226224,236.332123 L351.226224,236.336414 Z" id="Shape" fill="#3C7BE9" fill-rule="nonzero"></path>
                    <path d="M349.183662,259.950316 C351.445069,261.623844 361.035669,262.379077 361.035669,262.379077 C361.035669,262.379077 357.504097,253.432141 355.24269,251.758614 C352.980613,250.085459 349.790479,250.562875 348.117324,252.824951 C346.44417,255.087027 346.921586,258.277162 349.183662,259.950316 Z" id="Shape" fill="#3C7BE9" fill-rule="nonzero"></path>
                    <path d="M369.081475,190.194257 C369.081475,193.009216 363.987944,201.16659 363.987944,201.16659 C363.987944,201.16659 358.894412,193.013507 358.894412,190.194257 C358.894412,187.379992 361.175825,185.09858 363.990089,185.09858 C366.804354,185.09858 369.085766,187.379992 369.085766,190.194257 L369.081475,190.194257 Z" id="Shape" fill="#FFFFFF" fill-rule="nonzero" opacity="0.5"></path>
                    <path d="M377.496314,205.779518 C375.968684,208.139621 367.257759,212.216162 367.257759,212.216162 C367.257759,212.216162 367.416529,202.599816 368.94416,200.235422 C370.473935,197.87381 373.628527,197.199472 375.99014,198.729247 C378.351752,200.259022 379.026089,203.413615 377.496314,205.775227 L377.496314,205.779518 Z" id="Shape" fill="#FFFFFF" fill-rule="nonzero" opacity="0.5"></path>
                    <path d="M377.131571,232.414352 C374.62128,233.701681 365.039262,232.804842 365.039262,232.804842 C365.039262,232.804842 370.029807,224.583102 372.544389,223.312937 C375.056491,222.046222 378.119827,223.055807 379.386542,225.567908 C380.653257,228.08001 379.643672,231.143346 377.131571,232.410061 L377.131571,232.414352 Z" id="Shape" fill="#FFFFFF" fill-rule="nonzero" opacity="0.5"></path>
                    <path d="M372.31267,252.505264 C370.051263,254.178792 360.460663,254.934025 360.460663,254.934025 C360.460663,254.934025 363.992235,245.987089 366.253642,244.313562 C368.515719,242.640408 371.705853,243.117823 373.379008,245.379899 C375.052162,247.641976 374.574746,250.83211 372.31267,252.505264 Z" id="Shape" fill="#FFFFFF" fill-rule="nonzero" opacity="0.5"></path>
                    <path d="M356.560056,212.769714 C358.576871,214.730745 367.982954,216.760433 367.982954,216.760433 C367.982954,216.760433 365.678636,207.418717 363.66182,205.461977 C361.63016,203.617614 358.502611,203.714124 356.588535,205.680245 C354.674458,207.646366 354.661866,210.775378 356.560056,212.75684 L356.560056,212.769714 Z" id="Shape" fill="#FFFFFF" fill-rule="nonzero" opacity="0.5"></path>
                    <path d="M351.226224,236.336414 C353.736515,237.623743 363.318533,236.726904 363.318533,236.726904 C363.318533,236.726904 358.327988,228.505163 355.813405,227.234999 C354.188361,226.415578 352.249602,226.525353 350.72744,227.522972 C349.205278,228.520591 348.330966,230.254493 348.433849,232.071534 C348.536732,233.888574 349.601179,235.512702 351.226224,236.332123 L351.226224,236.336414 Z" id="Shape" fill="#FFFFFF" fill-rule="nonzero" opacity="0.5"></path>
                    <path d="M349.183662,259.950316 C351.445069,261.623844 361.035669,262.379077 361.035669,262.379077 C361.035669,262.379077 357.504097,253.432141 355.24269,251.758614 C352.980613,250.085459 349.790479,250.562875 348.117324,252.824951 C346.44417,255.087027 346.921586,258.277162 349.183662,259.950316 Z" id="Shape" fill="#FFFFFF" fill-rule="nonzero" opacity="0.5"></path>
                    <g id="Group" opacity="0.600000024" transform="translate(133.882201, 43.340072)">
                        <rect id="Rectangle-path" fill="#3C7BE9" fill-rule="nonzero" x="0.0386198658" y="0.369034273" width="27.4630156" height="27.4630156" rx="10.5"></rect>
                        <rect id="Rectangle-3" fill="#3A7DE3" x="34" y="0" width="34" height="9" rx="4"></rect>
                        <rect id="Rectangle-4" fill="#D8D8D8" x="34" y="16" width="87" height="4" rx="2"></rect>
                        <rect id="Rectangle-4" fill="#D8D8D8" x="34" y="23" width="67" height="4" rx="2"></rect>
                    </g>
                    <rect id="Rectangle-path" fill="#3C7BE9" fill-rule="nonzero" x="133.779215" y="84.9036293" width="27.4630156" height="27.4630156" rx="10.5"></rect>
                    <rect id="Rectangle-3" fill="#3A7DE3" x="167.882201" y="85.3400716" width="43.5" height="9" rx="4"></rect>
                    <rect id="Rectangle-4" fill="#D8D8D8" x="167.882201" y="101.340072" width="87" height="4" rx="2"></rect>
                    <rect id="Rectangle-4" fill="#D8D8D8" x="167.882201" y="108.340072" width="77" height="4" rx="2"></rect>
                    <g id="Group" opacity="0.6" transform="translate(133.453092, 124.729119)">
                        <rect id="Rectangle-path" fill="#3C7BE9" fill-rule="nonzero" x="0.184517136" y="1.36903427" width="27.4630156" height="27.4630156" rx="10.5"></rect>
                        <rect id="Rectangle-3" fill="#3A7DE3" x="34.4291096" y="0.610953058" width="27.4630156" height="9" rx="4"></rect>
                        <rect id="Rectangle-4" fill="#D8D8D8" x="34.4291096" y="16.6109531" width="87" height="4" rx="2"></rect>
                        <rect id="Rectangle-4" fill="#D8D8D8" x="34.4291096" y="23.6109531" width="47" height="4" rx="2"></rect>
                    </g>
                    <g id="Group" opacity="0.6" transform="translate(133.453092, 166.923642)">
                        <rect id="Rectangle-path" fill="#3C7BE9" fill-rule="nonzero" x="0.0472020581" y="0.369034273" width="27.4630156" height="27.4630156" rx="10.5"></rect>
                        <rect id="Rectangle-3" fill="#3A7DE3" x="34.4291096" y="1.41642959" width="33.4599991" height="9" rx="4"></rect>
                        <rect id="Rectangle-4" fill="#D8D8D8" x="34.4291096" y="17.4164296" width="87" height="4" rx="2"></rect>
                        <rect id="Rectangle-4" fill="#D8D8D8" x="34.4291096" y="24.4164296" width="61" height="4" rx="2"></rect>
                    </g>
                    <path d="M148.090021,115.94971 L148.090021,118.429964 L137.628328,111.821676 L138.73114,110.444234 L139.24178,110.744611 L147.339079,98.8797296 L147.339079,91.9796469 L150.424377,92.2542771 L150.424377,91.1514654 C158.57746,81.7882935 159.397059,92.2542771 157.719241,95.283791 C156.041422,98.3133049 152.951833,100.514637 152.951833,100.514637 C151.235394,101.956446 148.231627,112.85583 147.506432,115.589258 L148.090021,115.94971 Z" id="Shape" fill="url(#linearGradient-2)" fill-rule="nonzero"></path>
                    <path d="M68.7691076,137.572544 C68.7691076,137.572544 76.7548376,153.196425 74.274584,168.820306 C73.4421114,174.072608 73.7896902,177.282348 74.6221628,179.239088 C74.3927768,181.35426 73.8126938,183.416455 72.9057244,185.341027 C69.8762104,191.674685 69.8762104,198.282973 73.7296148,205.994073 L74.8324265,245.901267 C74.8324265,245.901267 76.2098684,264.62332 74.8324265,268.481016 C73.4549847,272.338711 75.3816869,290.794716 75.3816869,290.794716 L75.1070567,290.794716 L75.1070567,300.981778 L95.7386472,301.53533 C95.7386472,301.53533 100.574713,299.239593 101.432932,297.523155 L111.80022,300.711439 C111.80022,300.711439 123.210245,298.746117 116.520426,296.025562 C111.538463,294.000165 110.302628,291.103675 109.993669,289.764853 L126.299834,242.880336 C126.299834,242.880336 123.27032,202.973141 112.255076,189.185849 L111.139391,181.067095 L111.293871,181.067095 L113.632518,133.663355 L113.825618,133.689102 L113.769833,133.689102 C119.799071,134.652589 125.950079,134.558204 131.946917,133.410181 C133.745333,133.090505 135.508604,132.597593 137.212092,131.938335 L137.525342,131.813893 L137.559671,131.813893 L137.589708,131.813893 C138.865997,131.290776 140.068975,130.604185 141.168483,129.771331 L148.034237,119.253854 L137.572544,112.044813 L133.99377,117.151217 C133.99377,117.151217 122.781135,114.782532 116.623412,112.285114 C113.756926,111.114789 110.706355,110.459642 107.61211,110.34983 L100.887963,110.118111 L97.5366165,108.105586 L98.583644,105.397905 C98.6866303,105.350703 98.7896166,105.303501 98.8926029,105.247716 L98.987007,104.668418 C107.593121,102.531252 112.838965,93.8240331 110.705991,85.2168793 L110.924837,85.2168793 C110.830433,79.6384543 109.122576,79.0934851 109.122576,79.0934851 C109.122576,73.4206559 104.16636,69.2711659 98.5192775,68.7948542 C95.5949881,68.5934091 92.65719,68.8511361 89.8126434,69.5586693 C85.6302792,70.5572711 82.5338675,74.0871804 82.0886702,78.3639987 C74.7122758,80.3936872 77.1839473,84.2556738 77.0680877,85.736102 C76.501663,92.9451436 78.7845261,97.2062021 81.3162729,99.6907468 C82.3879566,100.81023 83.6470193,101.733833 85.0366533,102.419884 L83.4274922,105.642497 L82.9554716,105.642497 L81.6423962,109.504484 L81.5780298,109.504484 L80.1448036,110.431361 C71.3017641,116.418453 66.8375842,127.069505 68.7691076,137.572544 Z M90.7953044,290.794716 L90.7953044,278.406321 L96.0261506,241.786106 L96.0261506,223.059762 L105.393614,242.597123 L95.3095376,284.975989 L94.7817328,284.830092 L92.4602497,293.171983 C91.7032638,292.543065 91.1296251,291.721887 90.7995955,290.794716 L90.7953044,290.794716 Z" id="Shape" fill="url(#linearGradient-3)" fill-rule="nonzero"></path>
                    <path d="M145.991675,95.639952 L145.991675,102.252531 L138.113222,113.79558 L145.991675,118.92344 C145.991675,118.92344 149.493209,105.432234 151.381292,103.844528 C151.381292,103.844528 154.346439,101.729017 155.959891,98.8196543 C157.573343,95.9102911 156.766617,85.8562527 148.952531,94.8503903 L148.952531,95.9102911 L145.991675,95.639952 Z" id="Shape" fill="#FDA57D" fill-rule="nonzero"></path>
                    <path d="M83.2644306,111.414022 L86.3840575,105.174768 C86.5694701,104.801382 86.9418085,104.556983 87.3581363,104.535394 L99.2058529,103.93035 C99.5971012,103.909604 99.9721629,104.088734 100.201937,104.406082 C100.43171,104.72343 100.484823,105.135665 100.342993,105.500891 L97.2877329,113.400799 C97.1021509,113.881278 96.6206895,114.18066 96.1076815,114.134577 L84.1998895,113.074676 C83.8200761,113.041734 83.4810246,112.82338 83.293914,112.491216 C83.1068034,112.159052 83.0957696,111.755923 83.2644306,111.414022 Z" id="Shape" fill="#FDA57D" fill-rule="nonzero"></path>
                    <polygon id="Shape" fill="#EDEEF9" fill-rule="nonzero" points="84.1398142 108.736378 82.1272901 114.636635 102.793209 113.894275 94.8546814 109.131158"></polygon>
                    <polygon id="Shape" fill="#EDEEF9" fill-rule="nonzero" points="136.658541 114.688128 137.71415 113.36647 146.708288 118.657392 146.708288 121.03895"></polygon>
                    <path d="M75.879454,173.21868 C76.709447,177.300974 76.2210913,181.541404 74.4848478,185.328154 C71.5754845,191.412928 71.5754845,197.772333 75.2787005,205.170182 L76.3386013,243.532582 C76.3386013,243.532582 77.6602589,261.525149 76.3386013,265.228365 C75.0169437,268.931581 76.8578239,286.66239 76.8578239,286.66239 L91.6749791,286.66239 L91.6749791,274.754598 L96.6998528,239.567609 L96.6998528,221.570752 L105.711155,240.357171 L95.4125239,283.748736 L108.90373,289.305705 L125.836396,240.623219 C125.836396,240.623219 122.901286,202.260819 112.319443,189.035661 L110.328374,174.613286 L75.879454,173.21868 Z" id="Shape" fill="#7A7478" fill-rule="nonzero"></path>
                    <path d="M76.6003582,296.450381 L76.6003582,286.66239 L91.6792702,286.66239 C91.6792702,286.66239 92.739171,290.631654 99.6177982,291.425507 C106.496425,292.21936 96.442387,296.982477 96.442387,296.982477 L76.6003582,296.450381 Z" id="Shape" fill="#333333" fill-rule="nonzero"></path>
                    <path d="M92.8893593,290.357024 L95.5155102,280.916612 L110.045162,284.963116 C110.045162,284.963116 109.99796,289.069695 116.413149,291.678682 C122.828337,294.287668 111.864587,296.180042 111.864587,296.180042 L92.8893593,290.357024 Z" id="Shape" fill="#333333" fill-rule="nonzero"></path>
                    <path d="M110.328374,175.407139 L75.8751629,174.012533 C76.3019019,176.067015 76.3903174,178.177392 76.1369198,180.260369 C77.7117521,183.967876 81.0931359,182.955177 81.0931359,182.955177 L111.238087,182.028301 L110.328374,175.407139 Z" id="Shape" fill="#000000" fill-rule="nonzero" opacity="0.1"></path>
                    <path d="M82.8181566,112.439594 L81.4450058,113.370761 C72.954335,119.121705 68.6661455,129.348036 70.5155838,139.43488 C70.5155838,139.43488 78.1880638,154.453716 75.8065054,169.472553 C73.424947,184.49139 81.097427,182.174198 81.097427,182.174198 L111.392566,181.24303 L113.641101,135.693044 C113.641101,135.693044 131.895424,138.289157 140.1,131.938335 L146.712579,121.832803 L136.658541,114.894101 L133.225664,119.803115 C133.225664,119.803115 122.450721,117.528834 116.533299,115.12582 C113.773274,113.99974 110.835831,113.370703 107.856703,113.267775 L82.8181566,112.439594 Z" id="Shape" fill="#4D8AF0" fill-rule="nonzero"></path>
                    <path d="M83.0842045,185.727226 C83.0842045,185.727226 81.230451,194.987411 91.8165853,210.332371" id="Shape" fill="#000000" fill-rule="nonzero" opacity="0.1"></path>
                    <path d="M113.761251,135.723082 C113.761251,135.723082 126.458605,131.492061 132.015574,131.492061 C137.572544,131.492061 136.645667,133.890783 136.645667,133.890783 C136.645667,133.890783 127.797427,137.838592 113.761251,135.723082 Z" id="Shape" fill="#000000" fill-rule="nonzero" opacity="0.1"></path>
                    <path d="M99.3732057,104.466737 L94.3182944,105.071781 C94.1595238,105.071781 94.0136265,105.290627 93.9278046,105.603877 C95.0391985,107.607819 96.4295137,108.800744 97.9399796,108.800744 C98.4791233,108.792502 99.0069259,108.644658 99.4719009,108.371634 L99.8580996,106.032987 C99.9868324,105.256299 99.7293667,104.423826 99.3732057,104.466737 Z" id="Shape" fill="#000000" fill-rule="nonzero" opacity="0.1"></path>
                    <circle id="Oval" fill="#FDA57D" fill-rule="nonzero" cx="95.8459246" cy="92.8378662" r="15.4307819"></circle>
                    <path d="M108.972388,84.1011943 L108.182826,84.8135163 C107.510579,85.429004 107.198885,86.3449804 107.35619,87.2427536 C107.513496,88.1405268 108.118051,88.8959601 108.959515,89.2462187 C108.959515,89.2462187 102.046559,96.1591746 101.085353,97.4422124 C100.124148,98.7252502 101.244124,102.102343 101.244124,102.102343 C101.244124,102.102343 104.299384,107.72797 88.2249378,106.440641 C88.2249378,106.440641 77.617348,104.192107 78.7416152,89.885592 C78.8531837,88.4523659 76.4930808,84.7362766 83.5648073,82.8138655 C83.9990301,78.6977719 86.9891127,75.3066016 91.0184414,74.360406 C93.7522356,73.680434 96.5756628,73.4328412 99.386079,73.6266285 C104.814751,74.103015 108.977667,78.6516628 108.972388,84.1011943 Z" id="Shape" fill="#000000" fill-rule="nonzero" opacity="0.1"></path>
                    <path d="M109.307093,83.2601395 C109.307093,83.2601395 110.946292,83.7664888 111.023532,89.1432324 L108.693467,88.9844618 C108.693467,88.9844618 103.30385,103.402545 103.870274,101.523045 C105.960038,94.6100889 101.780511,95.8974178 100.815014,97.1847466 C99.8495174,98.4720755 100.973785,101.844877 100.973785,101.844877 C100.973785,101.844877 104.029045,107.470504 87.9545987,106.183175 C87.9545987,106.183175 77.3470089,103.934641 78.4712761,89.6281262 C78.5828446,88.1949001 76.2227417,84.4788108 83.2944682,82.5563997 C83.7252492,78.4423391 86.709587,75.0501074 90.735229,74.0986491 C93.4690233,73.4186772 96.2924504,73.1710843 99.1028666,73.3648716 C104.543977,73.8240189 109.307093,77.8190295 109.307093,83.2601395 Z" id="Shape" fill="#72351C" fill-rule="nonzero"></path>
                </g>
            </g>
        </g>
    </g>
</svg>