<svg id="icon-post" xmlns="http://www.w3.org/2000/svg" width="20.481" height="20.481" viewBox="0 0 20.481 20.481">
  <path id="Path_4940" data-name="Path 4940" d="M107.8,264.662H88.718a.7.7,0,0,0-.7.7V284.44a.7.7,0,0,0,.7.7H107.8a.7.7,0,0,0,.7-.7V265.359a.7.7,0,0,0-.7-.7m-.3,19.477H89.02V265.662H107.5Z" transform="translate(-88.018 -264.659)" fill="#333"/>
  <path id="Path_4941" data-name="Path 4941" d="M97.759,278.9h1v-3.5h3.5v-1h-3.5v-3.5h-1v3.5h-3.5v1h3.5Z" transform="translate(-88.018 -264.659)" fill="#333"/>
</svg>
