<svg id="icon-chevron-left" xmlns="http://www.w3.org/2000/svg" width="24" height="24" viewBox="0 0 24 24">
  <defs>
    <style>
      .cls-1 {
        fill: none;
      }

      .cls-2 {
        fill: #333;
      }
    </style>
  </defs>
  <g id="Group_3026" data-name="Group 3026" transform="translate(632 -416) rotate(90)">
    <rect id="Rectangle_1876" data-name="Rectangle 1876" class="cls-1" width="24" height="24" transform="translate(416 608)"/>
    <path id="Path_2254" data-name="Path 2254" class="cls-2" d="M12.014,17.257,4.589,9.832,5.3,9.125l6.718,6.718,6.718-6.718.707.707Z" transform="translate(415.986 606.744)"/>
  </g>
</svg>
