<?xml version="1.0" encoding="UTF-8"?>
<svg width="60px" height="60px" viewBox="0 0 60 60" version="1.1" xmlns="http://www.w3.org/2000/svg" xmlns:xlink="http://www.w3.org/1999/xlink">
    <!-- Generator: Sketch 52.3 (67297) - http://www.bohemiancoding.com/sketch -->
    <title>Transfer in progress Icon</title>
    <desc>Created with Sketch.</desc>
    <g id="Transfer-in-progress-Icon" stroke="none" stroke-width="1" fill="none" fill-rule="evenodd">
        <g id="Group">
            <circle id="Oval-3" fill="#F3F9F4" cx="30" cy="30" r="30"></circle>
            <path d="M38.016451,16.0424651 C37.6453488,16.0619359 37.2780272,16.2021396 36.9561035,16.4474836 C36.1002931,17.1056423 35.9223179,18.3362405 36.5622781,19.2202525 L40.0461663,24.0181637 L14.8413429,24.0181637 C13.7696532,24.0181637 12.9025104,24.909982 12.9025104,26.0121008 C12.9025104,27.1142197 13.7696823,28.006038 14.8413429,28.006038 L43.9238315,28.006038 C44.9955212,28.006038 45.8626641,27.1142197 45.8626641,26.0121008 C45.8626641,25.3812092 45.5483599,25.0501857 45.2870731,24.6101637 L39.6826837,16.8525519 C39.2812872,16.2995434 38.637556,16.0113597 38.016451,16.0425149 L38.016451,16.0424651 Z M14.8415853,31.993962 C13.7698956,31.993962 12.9027527,32.8857803 12.9027527,33.9878992 C12.9027527,34.6187908 13.2170569,34.9498143 13.4783436,35.3898363 L19.0827331,43.1474481 C19.4841296,43.7004566 20.1278608,43.9886403 20.7489658,43.9574851 C21.120068,43.9380143 21.4873896,43.7978106 21.8093133,43.5524666 C22.6651237,42.8943078 22.8430988,41.6637096 22.2031387,40.7796976 L18.7192504,35.9817864 L43.9240738,35.9817864 C44.9957635,35.9817864 45.8629064,35.0899681 45.8629064,33.9878493 C45.8629064,32.8857305 44.9957345,31.9939122 43.9240738,31.9939122 L14.8415853,31.993962 Z" id="Fill-1" fill="#71CF78"></path>
        </g>
    </g>
</svg>