<?xml version="1.0" encoding="UTF-8"?>
<svg width="880px" height="514px" viewBox="0 0 880 514" version="1.1" xmlns="http://www.w3.org/2000/svg" xmlns:xlink="http://www.w3.org/1999/xlink">
    <!-- Generator: Sketch 50 (54983) - http://www.bohemiancoding.com/sketch -->
    <title>Group 2</title>
    <desc>Created with Sketch.</desc>
    <defs>
        <linearGradient x1="96.3126823%" y1="4.93530086%" x2="5.01458613%" y2="94.7439386%" id="linearGradient-1">
            <stop stop-color="#4372D8" offset="0%"></stop>
            <stop stop-color="#3E51CE" offset="100%"></stop>
        </linearGradient>
        <linearGradient x1="3.77777778%" y1="5.33333333%" x2="3.77777778%" y2="1.33333333%" id="linearGradient-2">
            <stop stop-color="#808080" stop-opacity="0.25" offset="0%"></stop>
            <stop stop-color="#808080" stop-opacity="0.12" offset="54%"></stop>
            <stop stop-color="#808080" stop-opacity="0.1" offset="100%"></stop>
        </linearGradient>
        <linearGradient x1="49.6236786%" y1="99.9329605%" x2="49.6236786%" y2="-0.190600543%" id="linearGradient-3">
            <stop stop-color="#808080" stop-opacity="0.25" offset="0%"></stop>
            <stop stop-color="#808080" stop-opacity="0.12" offset="54%"></stop>
            <stop stop-color="#808080" stop-opacity="0.1" offset="100%"></stop>
        </linearGradient>
        <linearGradient x1="50%" y1="100%" x2="50%" y2="0%" id="linearGradient-4">
            <stop stop-color="#E2E7EB" offset="0%"></stop>
            <stop stop-color="#FFFFFF" offset="100%"></stop>
        </linearGradient>
        <linearGradient x1="62.2929299%" y1="14.7999662%" x2="23.0596274%" y2="88.5434717%" id="linearGradient-5">
            <stop stop-color="#D86296" offset="0%"></stop>
            <stop stop-color="#DC5180" offset="100%"></stop>
        </linearGradient>
        <linearGradient x1="50.0012108%" y1="99.9926045%" x2="50.0012108%" y2="-0.000818025522%" id="linearGradient-6">
            <stop stop-color="#808080" stop-opacity="0.25" offset="0%"></stop>
            <stop stop-color="#808080" stop-opacity="0.12" offset="54%"></stop>
            <stop stop-color="#808080" stop-opacity="0.1" offset="100%"></stop>
        </linearGradient>
    </defs>
    <g id="Page-1" stroke="none" stroke-width="1" fill="none" fill-rule="evenodd">
        <g id="Artboard" transform="translate(-512.000000, -483.000000)">
            <g id="Group-2" transform="translate(512.000000, 483.000000)">
                <rect id="Rectangle" fill="url(#linearGradient-1)" x="0.87890625" y="0.1953125" width="847.605469" height="513.757306"></rect>
                <path d="M579.17,18.19 C684.89,82.52 755.5,198.81 755.5,331.59 C755.52233,362.432023 751.658568,393.153969 744,423.03" id="Shape" stroke="#597FED" stroke-width="2" stroke-dasharray="11.85" transform="translate(667.335048, 220.610000) rotate(14.000000) translate(-667.335048, -220.610000) "></path>
                <path d="M366.15,270.15 C312.530869,299.268575 252.465518,314.475732 191.45,314.38 C71.92,314.38 -34.25,257.16 -101.15,168.61" id="Shape" stroke="#4B72E7" stroke-width="2" opacity="0.5" stroke-dasharray="12" transform="translate(132.500000, 241.495225) rotate(87.000000) translate(-132.500000, -241.495225) "></path>
                <path d="M638.56,351.75 C603.56,445.68 513.11,512.59 407,512.59 C270.59,512.59 160,402 160,265.59 C160,129.18 270.59,18.59 407,18.59 C461.135139,18.5111273 513.783609,36.2972978 556.78,69.19" id="Shape" stroke="#4670E9" stroke-width="2" stroke-dasharray="11.95"></path>
                <path d="M420.5,121.64 C421.666667,121.64 422.833333,121.64 424,121.64 C473.649773,121.639838 519.585707,147.936174 544.726063,190.750453 C569.86642,233.564731 570.450079,286.491724 546.26,329.85" id="Shape" stroke="#4C73E1" stroke-width="2" stroke-dasharray="11.56"></path>
                <g id="undraw_air_support_wy1q" transform="translate(40.681641, 65.196232)">
                    <g id="Group-5" transform="translate(557.000000, 0.000000)" fill="#4F79E9" fill-rule="nonzero">
                        <rect id="Rectangle-path" x="21.9537546" y="0.234377298" width="138.968166" height="15.0065694" rx="7.5032847"></rect>
                        <rect id="Rectangle-path" x="53.0807973" y="13.0200574" width="138.968166" height="15.0065694" rx="7.5032847"></rect>
                        <rect id="Rectangle-path" x="0.270680147" y="24.138341" width="138.968166" height="15.0065694" rx="7.5032847"></rect>
                    </g>
                    <g id="Group-4" transform="translate(199.000000, 272.000000)" fill="#4269D5" fill-rule="nonzero">
                        <rect id="Rectangle-path" x="22.0349403" y="0.00390165441" width="138.968166" height="15.0065694" rx="7.5032847"></rect>
                        <rect id="Rectangle-path" x="53.161983" y="12.7895818" width="138.968166" height="15.0065694" rx="7.5032847"></rect>
                        <rect id="Rectangle-path" x="0.351865809" y="23.9009467" width="138.968166" height="15.0065694" rx="7.5032847"></rect>
                    </g>
                    <path d="M82.977122,448.756387 C93.9700225,429.387613 128.213653,385.016237 209.323049,390.248401 C276.530894,394.600237 305.222569,378.721916 317.039637,367.091652 C331.748704,352.652413 350.346057,342.731057 370.700749,339.46545 C403.854959,334.145002 451.171661,339.223297 499.463895,386.913608 C588.403244,474.745972 665.117325,441.391121 668.452119,441.391121 C670.023565,441.391121 674.804394,444.970759 679.42096,448.756387 L82.977122,448.756387 Z" id="Combined-Shape" fill="#EDF1F8" fill-rule="nonzero"></path>
                    <g id="Group-3" transform="translate(0.000000, 138.000000)" fill="#486FDD" fill-rule="nonzero">
                        <rect id="Rectangle-path" x="22.0598552" y="0.604556526" width="138.968166" height="15.0065694" rx="7.5032847"></rect>
                        <rect id="Rectangle-path" x="53.1938166" y="13.3902367" width="138.968166" height="15.0065694" rx="7.5032847"></rect>
                        <rect id="Rectangle-path" x="0.383699449" y="24.5085202" width="138.968166" height="15.0065694" rx="7.5032847"></rect>
                    </g>
                    <g id="Group" opacity="0.2" transform="translate(391.415211, 397.299403)" fill="url(#linearGradient-2)" fill-rule="nonzero">
                        <path d="M0.345932904,0.103779871 C0.255990349,0.0830238971 0.345932904,0.103779871 0.345932904,0.103779871 Z" id="Shape"></path>
                    </g>
                    <g id="Group" opacity="0.2" transform="translate(390.723346, 396.607537)" fill="url(#linearGradient-3)" fill-rule="nonzero">
                        <path d="M2.04100414,20.8874288 L2.12402803,20.8874288 C2.1591094,20.8741462 2.18336749,20.8418021 2.18629596,20.8044049 C2.19153138,20.7769778 2.19153138,20.748808 2.18629596,20.721381 L2.18629596,20.6521944 C2.11710938,20.4861466 1.95798024,20.2647495 1.86803768,20.0710271 L1.82652574,19.9672472 C1.82250731,19.9212104 1.82250731,19.8749109 1.82652574,19.8288741 C1.82652574,19.8288741 1.82652574,19.7873621 1.82652574,19.7666062 L3.32095588,14.8612776 L3.35554917,14.7436604 C3.35554917,14.7436604 5.25818015,15.560062 5.74940487,17.1928653 C6.03232101,17.9848484 6.04690775,18.8478976 5.79091682,19.648989 L5.75632353,19.7320129 L5.79091682,19.7320129 L5.79091682,20.6314384 L7.86651425,20.6314384 C8.01180607,20.5622518 7.81808364,20.3823667 7.62436121,20.2024816 L7.57593061,20.154051 L7.45139476,20.0225965 C7.41614109,19.9826291 7.38593375,19.9384799 7.36145221,19.891142 L7.32685892,19.8081181 L7.32685892,19.7596875 L7.26459099,19.7596875 L7.26459099,19.6835823 C7.79218995,17.2380568 6.98690475,14.695882 5.14748162,13.0001585 C5.64796988,11.5073551 5.64796988,9.89205434 5.14748162,8.39925092 C5.34120404,8.26087776 9.1118727,5.53492647 9.08419807,2.00641085 C9.09528403,1.81746333 9.09528403,1.6280284 9.08419807,1.43908088 C9.08419807,1.43908088 9.409375,1.16925322 9.08419807,0.678028493 L9.08419807,0.636516544 L9.04960478,0.636516544 L8.82128906,0.636516544 C8.67218027,0.651208128 8.5281123,0.698443526 8.39925092,0.774889706 C8.39925092,0.774889706 8.18477252,1.46675551 8.39925092,1.64664062 L8.34390165,1.64664062 C8.34390165,1.64664062 6.10917509,6.48970129 4.61474494,7.1815671 L4.51096507,7.11929917 L4.51096507,6.48970129 C4.51247572,6.46204727 4.51247572,6.43433141 4.51096507,6.40667739 C4.51224595,6.38132514 4.51224595,6.3559244 4.51096507,6.33057215 C4.67872461,6.24343475 4.83072635,6.12884882 4.96067785,5.9915579 C5.01028777,5.93920876 5.0565061,5.88374677 5.09905101,5.82551011 L5.15440028,5.74248621 L5.20974954,5.645625 L5.25126149,5.55568244 C5.2808941,5.49049824 5.30631471,5.42348027 5.32736673,5.35504136 L5.32736673,5.27201746 L5.32736673,5.16823759 C5.32736673,5.16823759 5.32736673,5.11288833 5.32736673,5.08521369 C5.32736673,5.0506204 5.32736673,5.01602711 5.32736673,4.97451517 C5.32732301,4.77618792 5.29218815,4.57943271 5.22358686,4.39334789 C5.22358686,4.34261106 5.20283088,4.29187423 5.16131893,4.24113741 L5.12672564,4.16503217 L5.07829504,4.08200827 C5.1155441,4.03602755 5.15992572,3.99631767 5.20974954,3.96439108 C5.30556839,3.91058125 5.41165509,3.8775765 5.52108915,3.86752987 L5.79091682,3.86752987 L5.84626608,3.86752987 C5.88573904,3.85172333 5.92295853,3.83078737 5.95696461,3.80526195 C6.00970171,3.76105765 6.07091562,3.72809631 6.13684972,3.70840074 L5.7286489,3.70840074 L5.66638097,3.70840074 L5.61103171,3.70840074 L5.54876379,3.70840074 L5.49341452,3.70840074 L5.43806526,3.70840074 L5.38271599,3.70840074 L5.32736673,3.70840074 L5.27201746,3.70840074 L5.16131893,3.65997013 C5.21875572,3.68308202 5.27944779,3.69708788 5.34120404,3.70148208 L5.57643842,3.70148208 L5.61795037,3.70148208 L5.65946232,3.66688879 L5.65946232,3.61153952 L5.58335708,3.61153952 L5.53492647,3.61153952 C5.44080541,3.62435053 5.34538255,3.62435053 5.25126149,3.61153952 L5.0506204,3.61153952 L4.96067785,3.61153952 L4.87765395,3.57694623 C5.03090546,3.6325617 5.20218618,3.6021938 5.32697634,3.49728184 C5.4517665,3.39236987 5.5111075,3.22885247 5.48264615,3.06832504 C5.4541848,2.90779761 5.34224507,2.77464809 5.18899357,2.71903263 L5.26509881,2.67060202 C5.34473961,2.60221977 5.39441472,2.5053533 5.40347197,2.40077436 C5.41304561,2.35747911 5.41304561,2.31261509 5.40347197,2.26931985 L5.35504136,2.3108318 L5.31352941,2.3108318 C5.18256971,2.40316895 5.02361938,2.44718596 4.86381664,2.43536765 L4.80846737,2.43536765 C4.66743774,2.39909066 4.53061733,2.34807288 4.40026654,2.28315717 L4.28264936,2.24164522 L4.24805607,2.24164522 L4.15119485,2.24164522 L4.09584559,2.24164522 L4.01974035,2.24164522 L3.65305147,2.24164522 C3.13617409,2.25925589 2.64376152,2.46606917 2.26931985,2.8228125 C2.18297213,2.90801017 2.10425938,3.00061341 2.03408548,3.09955882 C1.98387633,2.59274299 2.07738704,2.08203065 2.30391314,1.62588465 L2.26240119,1.62588465 L2.13786535,1.62588465 L2.07559743,1.74350184 C2.10840706,1.57652666 2.17173441,1.41703557 2.26240119,1.27303309 L2.22088925,1.27303309 C2.41116309,1.06030047 2.41116309,0.738550636 2.22088925,0.525818015 C1.89571232,0.0345932904 1.29378906,0.415119485 1.29378906,0.415119485 C1.24526495,0.575237072 1.21281756,0.739791669 1.19692785,0.90634421 L1.10006664,0.864832261 C0.989368107,1.2384398 -0.242153033,5.52800781 1.79193244,8.26779642 C1.78901279,8.32541494 1.78901279,8.38314435 1.79193244,8.44076287 L1.79193244,13.0624265 L0.408200827,19.3999173 L0.138373162,20.5968451 L2.08251608,20.9151034 L2.04100414,20.8874288 Z M2.38693704,5.90853401 C2.49673579,5.99952928 2.61762191,6.07624547 2.74670726,6.13684972 C2.74288097,6.18058436 2.74288097,6.22456959 2.74670726,6.26830423 L2.74670726,6.87022748 L2.62909007,6.92557675 C2.53914752,6.62807445 2.46304228,6.28214154 2.38001838,5.90853401 L2.38693704,5.90853401 Z" id="Shape"></path>
                    </g>
                    <g id="Group-6" transform="translate(679.000000, 82.000000)">
                        <polyline id="Shape" stroke="#B3B3B3" points="61.6543474 198.389759 54.984761 161.139704 76.1074242 160.108824 76.1074242 198.389759 90.5605009 198.389759 105.013578 157.251418"></polyline>
                        <rect id="Rectangle-path" fill="url(#linearGradient-4)" fill-rule="nonzero" x="47.2012707" y="194.494554" width="57.812307" height="41.138341" rx="20.5691705"></rect>
                        <path d="M159.885455,83.1664269 C159.885455,128.449044 122.061151,165.152525 81.7807238,165.152525 C41.5002964,165.152525 0.223582261,128.449044 0.223582261,83.1664269 C0.223582261,37.8838097 41.5141337,1.20800322 81.7876425,1.20800322 C122.061151,1.20800322 159.885455,37.8768911 159.885455,83.1664269 Z" id="Shape" fill="url(#linearGradient-5)" fill-rule="nonzero"></path>
                        <rect id="Rectangle-path" fill="#D7B768" fill-rule="nonzero" x="69.27179" y="168.030687" width="18.1199655" height="6.33057215"></rect>
                        <g id="Group" opacity="0.2" transform="translate(78.591222, 0.564568)" fill="#000000" fill-rule="nonzero">
                            <path d="M3.19642004,0.332095588 C2.23472656,0.332095588 1.27995175,0.332095588 0.318258272,0.401282169 C39.498619,2.0963534 75.5448277,38.1148874 75.5448277,82.3181939 C75.5448277,126.5215 39.498619,162.540034 0.345932904,164.235106 C1.30762638,164.276618 2.26931985,164.304292 3.22409467,164.304292 C43.4976034,164.304292 81.3288258,127.600811 81.3288258,82.3181939 C81.3288258,37.0355767 43.4699288,0.332095588 3.19642004,0.332095588 Z" id="Shape" opacity="0.5"></path>
                        </g>
                        <g id="Group" opacity="0.2" transform="translate(0.102252, 0.564568)" fill="#FFFFFF" fill-rule="nonzero">
                            <path d="M3.73607537,82.6018589 C3.73607537,37.9695956 43.8642923,1.65355928 83.5635524,0.643435202 C82.9893038,0.643435202 82.4150551,0.643435202 81.8408065,0.643435202 C41.5672978,0.643435202 0.283664982,37.3469164 0.283664982,82.6295335 C0.283664982,127.912151 41.5603791,164.615632 81.8338879,164.615632 C82.4081365,164.615632 82.9823851,164.615632 83.5566337,164.615632 C43.8435363,163.536321 3.73607537,127.254878 3.73607537,82.6018589 Z" id="Shape" opacity="0.5"></path>
                        </g>
                        <rect id="Rectangle-path" fill="#CF3B6C" fill-rule="nonzero" x="53.165154" y="159.181723" width="52.0698208" height="11.4365418"></rect>
                        <path d="M53.165154,7.15113051 C53.165154,7.15113051 -8.6807307,77.8459789 53.165154,159.181723 L73.5890326,159.112537 C73.5890326,159.112537 17.2088879,91.9185294 71.0014545,2.05899816 L60.9486443,4.34907399 L53.165154,7.15113051 Z" id="Shape" fill="#FFFFFF" fill-rule="nonzero" opacity="0.100000001"></path>
                        <path d="M106.957721,6.05106388 C106.957721,6.05106388 168.803605,77.8252229 106.957721,159.160967 L86.5338419,159.091781 C86.5338419,159.091781 142.913987,91.2889315 89.12142,1.45015625 L99.1880676,3.46348575 L106.957721,6.05106388 Z" id="Shape" fill="#FFFFFF" fill-rule="nonzero" opacity="0.100000001"></path>
                        <path d="M78.056752,215.063725 L83.9327368,209.18774 C84.4669173,208.653559 84.4669173,207.774746 83.9327368,207.240566 C83.3985564,206.706386 82.5197434,206.706386 81.985563,207.240566 L76.1095781,213.116551 L70.2335933,207.240566 C69.6994128,206.706386 68.8205999,206.706386 68.2864194,207.240566 C68.0193292,207.507656 67.8814762,207.860905 67.8814762,208.214153 C67.8814762,208.567401 68.0193292,208.92065 68.2864194,209.18774 L74.1624043,215.063725 L68.2864194,220.93971 C68.0193292,221.2068 67.8814762,221.560048 67.8814762,221.913297 C67.8814762,222.266545 68.0193292,222.619793 68.2864194,222.886883 C68.8205999,223.421064 69.6994128,223.421064 70.2335933,222.886883 L76.1095781,217.010899 L81.985563,222.886883 C82.5197434,223.421064 83.3985564,223.421064 83.9327368,222.886883 C84.4669173,222.352703 84.4669173,221.47389 83.9327368,220.93971 L78.056752,215.063725 Z" id="Shape" fill="#D4658E" fill-rule="nonzero"></path>
                    </g>
                </g>
                <g id="undraw_may_the_force_bgdm" transform="translate(404.559458, 397.001953)" fill-rule="nonzero">
                    <path d="M17.5671248,37.6791495 C16.0472007,38.0412829 14.5635474,38.6129817 13.0062009,38.7730343 C11.031451,38.9762666 9.00027969,38.508199 7.06813371,38.9659034 C6.16826954,39.1789231 5.20968103,39.7241383 5.05596143,40.6355171 C4.91663505,41.4645666 5.51366585,42.2515879 6.21087347,42.7208069 C7.63349943,43.678244 9.45280256,43.7479072 11.167323,43.7859053 C13.0672282,43.8279335 15.0074344,43.8653558 16.8330705,43.329928 C18.0179205,42.9844907 19.1279257,42.400126 20.3283203,42.113413 C21.9979339,41.7150086 23.7400894,41.9078778 25.4523069,41.9453002 C25.9370706,41.9556633 26.431046,41.9522089 26.891629,41.792732 C27.1904323,41.6885251 27.4639035,41.520988 27.7650097,41.4236898 C28.3551317,41.2325479 28.9947665,41.3263917 29.607342,41.4104481 C32.1679909,41.7592996 34.7523537,41.9036882 37.3359259,41.8422447 C38.6174983,41.8117311 39.9750669,41.7046455 41.0159846,40.9573495 C41.3147879,40.7431784 41.5825018,40.4748887 41.7442816,40.1444204 C41.9872392,39.6475664 41.9647857,39.0505356 41.7863098,38.5277738 C41.3435743,37.2277781 40.0268825,36.3831839 38.6802527,36.1143185 C37.333623,35.8454531 35.9426621,36.0532912 34.5850935,36.2605536 L28.2227141,37.2358383 C27.7719184,37.3049257 27.3170926,37.3745889 26.8875989,37.5288843 C26.3953508,37.7050573 25.9474337,37.9894673 25.4603671,38.1783064 C24.0607703,38.7258245 23.1695421,38.3435406 21.9484212,37.8127186 C20.5378856,37.1978402 19.0496265,37.3210461 17.5671248,37.6791495 Z" id="Shape" fill="#4285F4" opacity="0.1"></path>
                    <path d="M42.1507461,11.1155967 C42.6418428,10.3792395 42.0033596,10.4281764 42.0033596,10.4281764 L30.0161094,13.7374658 L35.2287583,5.51893663 C35.327208,4.92996603 34.6397877,5.07735262 34.6397877,5.07735262 L29.0483093,14.0051797 L27.5830794,14.4081899 L27.4719637,14.1577478 L27.1961896,14.2619548 C27.1616459,14.1393245 27.1086788,14.0500865 27.0303797,14.010937 C26.5611607,13.7766153 26.0027037,14.303983 25.4828206,14.9079225 L24.084951,15.4347144 L24.526535,16.1221346 L25.3596146,15.8526935 C25.5260002,16.3063679 25.8777706,16.7502548 26.0015523,16.9016715 L25.9013754,16.9592444 L26.048762,17.3622545 L25.9508881,17.3996769 L25.9934921,17.5309431 L25.9508881,17.5470635 C25.9508881,17.5470635 26.0856087,17.9592854 26.2473885,18.4791685 L25.6140867,19.4895726 L25.5087284,19.4124249 L24.4292368,20.832748 L23.48389,20.6300914 C23.5069192,20.2685337 23.5357056,19.9438227 23.5575833,19.7135311 C23.7539069,19.8160109 23.8880517,19.9035216 23.8880517,19.9035216 C23.9038803,19.8045587 23.9102421,19.7043126 23.9070507,19.6041426 C23.9496547,18.2920566 22.3341596,17.3490128 22.0998379,17.2188981 C21.9767394,17.0431209 21.8686947,16.8572686 21.776854,16.6633197 C21.6910705,16.3639407 21.7843385,16.1186803 21.9587844,15.9206295 L22.0025398,15.9235082 C22.0393864,15.8895402 22.0791117,15.8578751 22.1176855,15.8267857 L22.1671982,15.8267857 C23.3795522,15.826636 24.3939572,14.9066231 24.5121418,13.7000434 C24.6208197,13.7924501 24.6942397,13.9195623 24.7199799,14.0598739 C24.7540413,13.9845418 24.7662118,13.9011437 24.7550993,13.8192193 C24.764311,13.698892 24.7407061,13.5002655 24.5933195,13.2164312 C24.6565803,13.0114708 24.6859451,12.797555 24.6802546,12.5831295 C24.6940721,12.0695793 24.5207777,11.310193 23.5909756,10.6705583 C23.5909756,10.6705583 21.7256142,9.54155402 20.6944838,11.0632053 C19.6633535,12.5848567 19.7618031,12.1432726 19.7618031,12.1432726 L17.7761144,13.548051 C17.766327,13.554384 17.7571153,13.560717 17.7490551,13.5670501 C17.5366112,13.7322842 17.7893561,14.0213001 18.1083099,14.2780752 C16.9626095,14.0477836 15.3666892,14.0777215 14.0672692,15.4324115 C14.0672692,15.4324115 12.8398153,18.3778402 11.5634245,19.5074202 C10.2870336,20.6370002 9.30541597,28.442156 9.30541597,28.442156 L9.24784309,28.7190816 L7.44178173,37.8219302 L7.51432356,37.7902652 C7.34160491,38.3527522 7.19594551,38.8041236 7.19594551,38.8041236 L6.41065138,40.8191746 L6.44577084,40.8272348 L6.41065138,40.9176242 C6.41065138,40.9176242 10.14195,41.752431 11.3198912,41.5065948 C11.901953,41.385116 12.0165231,41.1922469 11.9837065,41.0275884 C12.0280376,40.8185988 11.7620509,40.6245782 11.7620509,40.6245782 C11.7620509,40.6245782 10.3872105,40.4282547 9.70036596,39.3004019 C9.58001387,39.0943263 9.51588848,38.8602587 9.51440554,38.6216176 C9.52822303,38.0009819 9.83278359,37.3262277 10.0901344,36.8656446 C11.6129372,36.4050616 13.5295385,35.9865067 15.1024296,36.1586496 C15.8391333,36.2390541 16.5806654,36.2663757 17.3212886,36.2404031 C17.1180563,36.9255204 16.9182784,37.5334901 16.9182784,37.5334901 L16.1329843,39.548541 L16.1681037,39.5566012 L16.1329843,39.6469907 C16.1329843,39.6469907 19.8642828,40.4817975 21.0422241,40.2359613 C21.6242859,40.1144825 21.7388559,39.9216133 21.7060394,39.7569549 C21.7503705,39.5479653 21.4843838,39.3539447 21.4843838,39.3539447 C21.4843838,39.3539447 20.1095433,39.1576211 19.4226988,38.0297683 C19.3023467,37.8236928 19.2382214,37.5896252 19.2367384,37.350984 C19.2471015,36.890401 19.4169415,36.39988 19.609235,35.9888096 C19.9108007,35.9325059 20.2090841,35.859857 20.5027661,35.7711841 C20.5027661,35.7711841 23.4481949,36.3112178 24.0377412,36.8512514 C24.2881832,37.081543 24.246155,35.9024503 24.1148889,34.4700369 C23.8815901,31.92758 23.2264674,29.4417328 22.1764099,27.1145253 C22.035932,26.8024803 21.8966056,26.4869809 21.764188,26.1783902 L22.3001916,25.4339728 C22.3410683,25.476001 22.3664004,25.4996059 22.3664004,25.4996059 C22.5509503,25.5438184 22.7402839,25.5648985 22.9300389,25.5623604 C24.5651088,25.6107216 24.2323375,23.4868579 24.2323375,23.4868579 C24.2323375,23.4557686 24.0837995,23.3601976 23.8563866,23.2715353 L23.955412,23.1339361 L23.9922586,23.1132099 C24.0216208,23.1333604 24.0331354,23.1437235 24.0331354,23.1437235 C24.0331354,23.1437235 25.6532363,22.3089167 25.5058497,21.7199461 C25.4646292,21.5620975 25.3855881,21.4166619 25.2755582,21.2962097 L26.2427826,19.9524586 L26.1276369,19.8672507 L26.4914975,19.2915219 C26.6642161,19.8787653 26.8041183,20.4170718 26.783392,20.539702 C26.7344551,20.8344752 28.403493,21.4723827 28.403493,21.4723827 C28.403493,21.4723827 28.9366179,21.5391673 29.3442339,21.5621964 C29.4403806,22.2214059 29.6937013,23.1166643 29.8318762,23.5772473 C29.8874131,23.7624189 29.9612801,23.9415896 30.0523804,24.1120994 C30.2878534,24.5519563 30.7726171,25.503636 30.8273114,25.9774609 C30.8242766,25.9989836 30.818068,26.0199376 30.808888,26.0396396 C30.6131402,26.4322866 30.6131402,26.7270598 30.6131402,26.7270598 L30.6292606,26.7270598 C30.6202204,26.7761056 30.6148321,26.8257546 30.6131402,26.8755979 L31.0305436,26.8352968 C31.0455126,27.231974 30.8002521,27.9619982 29.1398501,28.6920223 C28.1196586,29.1410908 27.4391472,29.5469797 26.9912301,29.8688121 C26.2939322,30.3652123 25.988859,31.2496703 26.2318438,32.0703992 C26.2901798,32.2648481 26.3766902,32.449701 26.4886189,32.6190687 C26.8340562,33.1372247 26.9422932,33.5005096 26.9739583,33.7129535 C26.8766601,33.7094992 26.7937551,33.7043176 26.7344551,33.6968331 C26.7344551,33.6968331 26.7626658,33.754406 26.8104513,33.8517042 C26.7822406,33.8517042 26.7563328,33.8470983 26.7344551,33.8442197 C26.7344551,33.8442197 28.34189,37.0590895 28.4138561,38.2197589 C28.4127867,38.2881228 28.3928638,38.3548644 28.3562832,38.412628 C28.3562832,38.412628 28.1599597,39.2963718 27.3251529,39.2963718 C26.8703271,39.2963718 26.7949066,39.427638 26.8680242,39.554874 C26.7626658,39.6890189 27.0280768,39.9003113 27.227279,39.9348551 C27.5220521,39.983792 30.1237707,40.1801156 30.6638044,39.4437584 L30.6321393,39.3355213 C30.6430781,39.3228553 30.654017,39.3096136 30.6638044,39.2963718 L30.3183671,38.1178549 C30.3183671,38.1178549 30.0253211,37.1730838 29.9959589,36.6370803 C29.9975616,36.5894477 30.0068949,36.5423922 30.0235939,36.4977539 C30.0604406,36.4113946 30.0725309,36.1632555 30.0702279,35.8408473 C30.0777124,34.9104695 29.9251443,33.1101654 29.9251443,33.1101654 L29.7052159,33.2011306 C29.5025593,32.9403254 29.2077862,32.4860754 29.333295,32.1855449 C29.4401622,32.1995987 29.5479378,32.2055648 29.6557032,32.2033925 C30.0068978,32.2033925 30.6551684,32.1458196 31.6379376,31.8251387 L32.7726991,34.3376193 C32.7726991,34.3376193 33.1181364,35.0739765 33.8527664,35.319237 L34.8315054,36.2294643 C34.7843187,36.2403689 34.7364101,36.2478727 34.688149,36.2519177 L34.8176879,36.3400042 C34.7906287,36.34461 34.7641452,36.3480644 34.7370859,36.3503673 L37.297352,38.087917 C37.3151996,38.3331774 37.3272899,39.1478337 36.7014727,39.1478337 C35.9651155,39.1478337 36.0140525,39.6878674 36.0140525,39.6878674 L36.0716253,39.6878674 C36.0659827,39.7203599 36.0640512,39.7533883 36.0658681,39.786317 L39.6497801,39.786317 C39.6497801,39.786317 40.0614262,39.0539899 39.7804705,38.6060729 C39.7603947,38.5540052 39.7328555,38.5051328 39.698717,38.4609892 C39.3532797,38.0194052 38.5697128,37.0861488 38.5697128,37.0861488 C38.5697128,37.0861488 37.802842,36.0532912 37.3434103,35.1545785 C37.241713,34.9558117 37.1592022,34.7477997 37.0969984,34.5333671 L37.0826052,34.5512147 C37.0693634,34.5114894 37.0572731,34.4723399 37.0474857,34.4360689 C37.0474857,34.4360689 36.9899128,34.510338 36.8931904,34.6231808 C36.6289309,34.3324378 36.2241935,33.9323062 35.8200318,33.7020147 C35.3082089,33.4095444 35.0410707,31.210836 34.938591,30.1077395 C35.2488175,29.7641213 35.4470272,29.334165 35.5068354,28.8751041 C35.6093151,28.1001731 35.6219811,27.0604068 35.1775185,26.2647496 C35.1458534,26.0977882 34.9190162,24.8864547 34.9040473,24.1057664 C34.9040806,23.9967321 34.9148799,23.8879674 34.9362881,23.7810554 C34.9738414,23.586321 34.9894834,23.3879955 34.9829221,23.1897818 C34.9829221,23.1822974 34.9829221,23.1753886 34.9829221,23.1679041 C34.9829221,23.1264517 34.9829221,23.0849992 34.9829221,23.0423953 C34.971529,22.2600177 34.7922753,21.4892073 34.4572817,20.7820838 C34.2978048,20.4498883 34.1176017,20.049181 33.9523675,19.6588369 C33.8136168,19.3300957 33.5407214,19.1475897 33.2453725,19.0497158 C33.2604441,19.003892 33.2641973,18.9551005 33.2563113,18.9075107 C33.2652889,18.8449921 33.256718,18.7812085 33.231555,18.7232775 C33.1843452,18.613889 33.0968344,18.5281054 33.0294742,18.4302315 C32.9856707,18.3666465 32.9500774,18.2977812 32.9235401,18.2252721 C32.9206614,18.2172119 32.9177828,18.2091517 32.9154799,18.2010915 C32.9388784,18.1584633 32.9720199,18.1219683 33.0122023,18.0945816 C33.1684858,17.9648079 33.2856791,17.7942 33.3507309,17.6017577 C33.3994982,17.4360572 33.4271598,17.2648648 33.4330601,17.0922377 C33.4451504,16.9241249 33.4537863,16.7531334 33.4514834,16.5838692 C33.4555135,16.2332503 33.4198183,15.8837829 33.2741589,15.5677078 C33.2100675,15.4186565 33.1113885,15.2870188 32.9862945,15.1836966 C32.9016078,15.1221923 32.8107247,15.0697078 32.7151262,15.0270984 C32.3385996,14.8434409 31.95977,14.6592077 31.5561841,14.5475163 C31.1525982,14.4358249 30.7184986,14.4012811 30.3166399,14.5193055 C30.1975157,14.5490776 30.0868183,14.605805 29.9930803,14.6851155 C29.9165083,14.7553544 29.8629656,14.847471 29.7858179,14.915407 C29.6775809,15.0138566 29.5319215,15.0616421 29.4185029,15.1537587 C29.206059,15.3264774 29.1415773,15.6258564 29.1490618,15.9022062 C29.1490618,15.9022062 29.1490618,15.9062363 29.1490618,15.9085392 C29.1490618,15.9396286 29.1490618,15.9701422 29.1490618,16.0006558 C29.1525162,16.1186803 29.1939687,16.2666426 29.3114173,16.2810358 C29.3764668,16.2847589 29.4393754,16.2571561 29.4806816,16.2067668 C29.2162316,16.9599405 29.5219089,17.7949436 30.2101301,18.1993643 C30.3449388,18.5135325 30.4296405,18.8468999 30.4611478,19.187315 C30.2953379,19.2045868 30.1577387,19.2155257 30.0742581,19.2155257 C30.0463967,19.2160646 30.019026,19.2229565 29.9942317,19.2356762 C29.4185029,19.1781033 29.0264316,18.981204 28.5549096,18.8228786 C28.1518995,18.6881581 27.8346729,18.049099 27.6337435,17.4987023 L29.5912216,14.4133714 L42.1507461,11.1155967 Z M21.2753942,24.98145 C21.1602485,24.6780409 21.0641017,24.4057211 20.9973172,24.1754296 C20.9037062,23.8607238 20.7882809,23.552923 20.6518799,23.2542635 C20.5742678,23.0719612 20.5243939,22.8790638 20.5039176,22.681989 C20.6916052,22.4516975 20.8787171,22.2214059 21.0606474,21.9980231 C21.1982466,22.0210523 21.3421788,22.0515659 21.4918683,22.0901398 C21.451246,22.2005629 21.3989416,22.3063297 21.3358458,22.4056392 C21.0410726,22.7994377 21.6317704,24.3222405 21.6317704,24.3222405 L21.640982,24.3124531 C21.6501733,24.361251 21.6620904,24.4094958 21.6766772,24.456961 L21.2753942,24.98145 Z M29.6810353,33.2114937 L29.6718236,33.2155238 C29.6349769,33.168314 29.5941002,33.1141955 29.5532235,33.0554712 C29.6286439,33.1487393 29.6833382,33.2074636 29.6833382,33.2074636 L29.6810353,33.2114937 Z M27.3781199,16.6742586 L27.3781199,16.662744 C27.3413251,16.7240067 27.2893775,16.7747646 27.227279,16.8101306 L27.0833467,16.2700969 L27.0724079,16.2793086 C27.116739,16.0536229 27.1875537,15.6540671 27.2261275,15.2504812 L27.8686409,15.0426431 L27.7989777,14.8854691 L28.6389661,14.6649649 L27.3781199,16.6742586 Z" id="Shape" fill="url(#linearGradient-6)"></path>
                    <path d="M27.3349402,14.7075689 L41.4978696,10.7977943 C41.4978696,10.7977943 42.1179296,10.7500088 41.6406504,11.4650641 L27.477721,15.1836966 L27.3349402,14.7075689 Z" id="Shape" fill="#8499F0"></path>
                    <polygon id="Shape" fill="#9F9BAD" points="24.0930112 15.662703 24.5219291 16.3299727 27.7638582 15.2815705 27.3827257 14.4231588"></polygon>
                    <path d="M25.9998251,17.1405989 C25.9998251,17.1405989 24.8558519,15.8532693 25.3803408,15.2332093 C25.9048298,14.6131493 26.4742256,14.0414506 26.9538078,14.2798024 C27.4333899,14.5181541 26.9538078,16.6638955 26.9538078,16.6638955 L25.9998251,17.1405989 Z" id="Shape" fill="#F9D3C4"></path>
                    <path d="M26.0476106,17.6650879 L25.8570443,17.1405989 C25.8570443,17.1405989 26.9060223,16.5683245 27.0010175,16.4733292 L27.1915838,17.1883844 L26.0476106,17.6650879 Z" id="Shape" fill="#F6E2D7"></path>
                    <path d="M23.6163077,19.4769066 C23.6163077,19.4769066 23.282385,22.3854887 23.6163077,23.1477536 C23.6163077,23.1477536 21.9950553,23.9583798 21.7094938,24.2917268 C21.7094938,24.2917268 21.1372193,22.8138309 21.4216294,22.4321227 C21.7060394,22.0504145 22.5656026,18.9996274 22.5656026,18.9996274 L23.6163077,19.4769066 Z" id="Shape" fill="#2A2A31"></path>
                    <path d="M29.7668189,17.8078687 C29.7668189,17.8078687 30.4818741,18.9017535 30.2435223,19.9058245 C30.0051706,20.9098956 32.57983,19.3335501 32.57983,19.3335501 C32.57983,19.3335501 31.8169892,18.1895769 31.9125602,17.1405989 L29.7668189,17.8078687 Z" id="Shape" fill="#F9D3C4"></path>
                    <path d="M31.1969293,31.062298 L32.5320445,34.0180898 C32.5320445,34.0180898 32.8659672,34.733145 33.5810224,34.9714968 L34.9627716,36.2588264 L36.8223758,34.637574 C36.8223758,34.637574 36.155106,33.7791623 35.4872606,33.3980299 C34.8194151,33.0168974 34.5816391,29.2976891 34.5816391,29.2976891 L31.1969293,31.062298 Z" id="Shape" fill="#C8B5AC"></path>
                    <path d="M31.1969293,31.062298 L32.5320445,34.0180898 C32.5320445,34.0180898 32.8659672,34.733145 33.5810224,34.9714968 L34.9627716,36.2588264 L36.8223758,34.637574 C36.8223758,34.637574 36.155106,33.7791623 35.4872606,33.3980299 C34.8194151,33.0168974 34.5816391,29.2976891 34.5816391,29.2976891 L31.1969293,31.062298 Z" id="Shape" fill="#000000" opacity="0.1"></path>
                    <path d="M30.7680113,26.4374682 C30.7680113,26.4374682 31.3874955,27.4887491 29.0010995,28.5354241 C28.0102702,28.9712508 27.3493335,29.3662008 26.9146582,29.6782458 C26.2383709,30.1610492 25.9432633,31.0200067 26.1800282,31.8165027 C26.2366327,32.0054359 26.3206221,32.1850529 26.4293188,32.3496276 C27.0015932,33.2080393 26.9060223,33.6369573 26.9060223,33.6369573 C26.9060223,33.6369573 29.0039781,34.399798 29.6695207,33.1124683 C29.6695207,33.1124683 28.9544655,32.3496276 29.1450317,31.9207097 C29.1450317,31.9207097 29.9556579,32.1112759 31.7674766,31.4440062 C32.5704037,31.1434728 33.3436688,30.7689827 34.0773007,30.325365 C34.6570122,29.9771974 35.0463683,29.3837314 35.1349145,28.7133243 C35.244303,27.8871534 35.2500603,26.7512404 34.6743315,25.9596133 L30.7680113,26.4374682 Z" id="Shape" fill="#C8B5AC"></path>
                    <path d="M34.7249956,25.9607647 L34.6616654,25.9682492 C35.1055524,26.7431802 35.0934621,27.7645232 34.9932852,28.5239095 C34.904739,29.1943166 34.5153829,29.7877826 33.9356714,30.1359503 C33.2020395,30.5795679 32.4287744,30.954058 31.6258473,31.2545914 C29.8140286,31.9218611 29.0010995,31.7295677 29.0010995,31.7295677 C28.8105333,32.1584857 29.5255885,32.9213264 29.5255885,32.9213264 C28.9821004,33.9691529 27.4915385,33.658835 26.9555349,33.5068426 C26.9593499,33.5500469 26.9578029,33.5935573 26.9509291,33.6363816 C26.9509291,33.6363816 29.048885,34.3992223 29.7144275,33.1118926 C29.7144275,33.1118926 28.9993723,32.3490519 29.1899386,31.9201339 C29.1899386,31.9201339 30.0005648,32.1107002 31.8123834,31.4434304 C32.6162997,31.1430605 33.3905354,30.7685671 34.1250861,30.3247893 C34.7047977,29.9766217 35.0941538,29.3831557 35.1827,28.7127486 C35.29324,27.8883049 35.2984215,26.7523919 34.7249956,25.9607647 Z" id="Shape" fill="#000000" opacity="0.1"></path>
                    <path d="M24.0452257,36.4499684 C23.4729512,35.9254794 20.6127303,35.4009905 20.6127303,35.4009905 C20.6127303,35.4009905 18.4197792,36.1160457 15.3684164,35.782123 C12.3170535,35.4482002 7.92942405,37.4033754 7.92942405,37.4033754 L9.68769992,28.5659377 L9.7412427,28.2970724 C9.7412427,28.2970724 10.6929225,20.7164508 11.9353453,19.6196873 C13.1777681,18.5229239 14.3666482,15.662703 14.3666482,15.662703 C16.6073848,13.3263954 19.7543186,15.0426431 19.7543186,15.0426431 C19.7543186,15.0426431 19.7715905,15.0858227 19.8021041,15.1664248 C20.0513947,15.8296644 21.1809747,18.9984759 20.7555111,20.9542268 C20.4774341,22.2334962 20.6046701,22.9117048 20.7595412,23.2571421 C20.8917774,23.5464777 21.0037387,23.8446564 21.0946154,24.1495218 C21.2955447,24.836942 21.7624608,25.9434929 22.2403158,27.0045611 C23.2581777,29.2614477 23.8936227,31.6718975 24.1206461,34.1372657 C24.2473065,35.5282265 24.2881832,36.6721997 24.0452257,36.4499684 Z" id="Shape" fill="#3E3F49"></path>
                    <path d="M19.0409906,15.0426431 C19.0409906,15.0426431 17.5153092,14.1842314 17.9471058,13.8508844 C18.3789024,13.5175374 20.6167604,13.3741809 20.6167604,13.3741809 L21.4014788,15.2096044 L19.0409906,15.0426431 Z" id="Shape" fill="#151519"></path>
                    <path d="M23.3301705,15.471561 C23.3301705,15.471561 21.5661373,15.8526935 21.8522745,16.8533103 C21.8522745,16.8533103 22.1401389,17.4733702 22.424549,17.6639365 C22.708959,17.8545027 20.6127303,18.0928544 20.6127303,18.0928544 L19.4209716,17.1394475 L19.587933,15.8285129 C19.587933,15.8285129 19.6593234,13.7558891 20.8038723,13.7558891 C21.9484212,13.7558891 23.3301705,15.471561 23.3301705,15.471561 Z" id="Shape" fill="#535461"></path>
                    <circle id="Oval" fill="#F9D3C4" cx="30.8630066" cy="16.9500327" r="1.62125241"></circle>
                    <path d="M31.864199,19.2385548 C31.864199,19.2385548 33.2943094,19.0002031 33.6760177,19.9058245 C33.8360703,20.2863813 34.0133948,20.6749983 34.1648114,20.9997093 C34.4900328,21.6865075 34.6639857,22.4351335 34.6749072,23.1949634 C34.6813277,23.3879701 34.6660714,23.5810878 34.6294246,23.7706922 C34.4866439,24.3907522 34.8677763,26.3453516 34.8677763,26.3453516 L30.4346643,26.7742696 C30.4500806,26.5408373 30.5150442,26.3133666 30.6252305,26.1069999 C30.77492,25.8076209 30.1646475,24.5997418 29.8906006,24.0919489 C29.8021812,23.9267706 29.7304366,23.7531949 29.6764294,23.573793 C29.4651369,22.8708281 28.9774946,21.1292483 29.2423299,20.8638373 C29.2423299,20.8638373 29.5301943,19.4820881 29.9095996,19.4820881 C30.2890049,19.4820881 31.864199,19.2385548 31.864199,19.2385548 Z" id="Shape" fill="#FFFFFF" opacity="0.1"></path>
                    <path d="M31.864199,19.0951983 C31.864199,19.0951983 33.2943094,18.8568466 33.6760177,19.7624681 C33.8360703,20.1430248 34.0133948,20.5316418 34.1648114,20.8563529 C34.4900328,21.5431511 34.6639857,22.2917771 34.6749072,23.0516069 C34.6813277,23.2446136 34.6660714,23.4377314 34.6294246,23.6273358 C34.4866439,24.2473957 34.8677763,26.2019951 34.8677763,26.2019951 L30.4346643,26.6309131 C30.4500806,26.3974808 30.5150442,26.1700101 30.6252305,25.9636434 C30.77492,25.6642644 30.1646475,24.4563853 29.8906006,23.9485924 C29.8021812,23.7834141 29.7304366,23.6098385 29.6764294,23.4304365 C29.4651369,22.7274716 28.9774946,20.9858918 29.2423299,20.7204809 C29.2423299,20.7204809 29.5301943,19.3387316 29.9095996,19.3387316 C30.2890049,19.3387316 31.864199,19.0951983 31.864199,19.0951983 Z" id="Shape" fill="#C8B5AC"></path>
                    <path d="M30.3385176,19.4285453 C30.3385176,19.4285453 30.2429466,18.9040564 30.4812983,18.8084854 C30.7196501,18.7129144 31.673057,18.5701336 31.673057,18.5701336 C31.673057,18.5701336 31.9609215,19.2374034 32.2453315,19.2374034 C32.5297415,19.2374034 30.3385176,19.4285453 30.3385176,19.4285453 Z" id="Shape" fill="#C8B5AC"></path>
                    <path d="M30.3385176,19.4285453 C30.3385176,19.4285453 30.2429466,18.9040564 30.4812983,18.8084854 C30.7196501,18.7129144 31.673057,18.5701336 31.673057,18.5701336 C31.673057,18.5701336 31.9609215,19.2374034 32.2453315,19.2374034 C32.5297415,19.2374034 30.3385176,19.4285453 30.3385176,19.4285453 Z" id="Shape" fill="#000000" opacity="0.1"></path>
                    <path d="M31.435281,22.0509902 C31.435281,22.0509902 29.8140286,21.6220722 29.4328961,21.6220722 C29.0517636,21.6220722 28.2889229,21.5265012 28.2889229,21.5265012 C28.2889229,21.5265012 26.6676705,20.9064413 26.715456,20.6208798 C26.7632415,20.3353183 25.9048298,17.7122977 25.9048298,17.7122977 C25.9048298,17.7122977 27.1921595,17.2355942 27.286579,16.9972425 C27.286579,16.9972425 27.715497,18.8568466 28.4305522,19.0951983 C29.1456074,19.3335501 29.6700964,19.6674728 30.9574261,19.4291211 C31.2080684,19.3820558 31.4619314,19.3541482 31.7168124,19.3456404 C32.6132222,19.3180054 33.3910319,19.9996683 33.4307572,20.8955024 C33.4612708,21.5627721 33.0801383,22.1920438 31.435281,22.0509902 Z" id="Shape" fill="#FFFFFF" opacity="0.1"></path>
                    <path d="M31.435281,21.9082094 C31.435281,21.9082094 29.8140286,21.4792915 29.4328961,21.4792915 C29.0517636,21.4792915 28.2883472,21.3860234 28.2883472,21.3860234 C28.2883472,21.3860234 26.6670948,20.7659634 26.7148803,20.4804019 C26.7626658,20.1948404 25.9042541,17.5718198 25.9042541,17.5718198 C25.9042541,17.5718198 27.1915838,17.0951164 27.2860033,16.8567646 C27.2860033,16.8567646 27.7149213,18.7163688 28.4299765,18.9547205 C29.1450317,19.1930722 29.6695207,19.526995 30.9568504,19.2886432 C31.2074927,19.241578 31.4613556,19.2136704 31.7162367,19.2051626 C32.6126465,19.1775276 33.3904562,19.8591905 33.4301814,20.7550246 C33.4612708,21.4194157 33.0801383,22.0509902 31.435281,21.9082094 Z" id="Shape" fill="#C8B5AC"></path>
                    <path d="M29.9671725,16.5539313 C30.061592,16.7024693 30.2153116,16.8239481 30.3909089,16.8343112 C30.4830255,16.8400685 30.5791722,16.8153122 30.6655316,16.8481287 C30.7483611,16.8866718 30.8110793,16.9583796 30.8382502,17.0456037 C30.9447601,17.3271351 30.8307657,17.6748753 30.9994543,17.9235902 C31.1146001,18.0922787 31.3235896,18.1619419 31.50955,18.2454226 C31.3518003,18.350781 31.3293469,18.5908599 31.4203121,18.7560941 C31.5112772,18.9213282 31.6851473,19.0272623 31.8613204,19.0975013 C32.1163686,19.1889648 32.3803661,19.2532273 32.6489174,19.289219 C32.741034,19.3047636 32.8446652,19.3180054 32.9212372,19.2638869 C33.015081,19.1965266 33.021414,19.0543216 32.9753557,18.9483875 C32.9292974,18.8424534 32.8446652,18.7589727 32.7790321,18.6639774 C32.7364185,18.6021876 32.7017918,18.5352557 32.6759767,18.4647753 C32.6629939,18.4354999 32.6576457,18.4034107 32.660432,18.3715072 C32.6777992,18.3178385 32.7137242,18.2721157 32.7617603,18.2425439 C32.9135883,18.1164024 33.0273983,17.9505708 33.0905014,17.7635375 C33.1379125,17.6025219 33.1648006,17.4361637 33.1705277,17.2684107 C33.20392,16.7997675 33.2131317,16.3098222 33.0168081,15.8832072 C32.9548406,15.7385018 32.859325,15.6106214 32.7381554,15.5101349 C32.6558004,15.450416 32.567425,15.3994747 32.4744716,15.3581425 C32.1088838,15.1796665 31.740993,15.0006149 31.3489217,14.8929536 C30.9568504,14.7852923 30.5354168,14.7513243 30.1450727,14.8653186 C30.0295308,14.8943522 29.9221879,14.9495009 29.8313005,15.0265227 C29.7570315,15.0950344 29.7046401,15.1842724 29.6297954,15.2522084 C29.524437,15.3477793 29.3833834,15.3944134 29.2728435,15.4824999 C29.0667326,15.6506127 29.0039781,15.943083 29.0114626,16.2073425 C29.0143413,16.3224883 29.055218,16.4658447 29.1686366,16.4796622 C29.3563242,16.5026914 29.4369262,16.1866163 29.6211595,16.1480424 C29.851451,16.1019841 29.8756316,16.4105748 29.9671725,16.5539313 Z" id="Shape" fill="#000000" opacity="0.1"></path>
                    <path d="M29.9671725,16.4583603 C30.061592,16.6068983 30.2153116,16.7283771 30.3909089,16.7387402 C30.4830255,16.7444975 30.5791722,16.7197412 30.6655316,16.7525577 C30.7483611,16.7911008 30.8110793,16.8628086 30.8382502,16.9500327 C30.9447601,17.2315641 30.8307657,17.5793043 30.9994543,17.8280192 C31.1146001,17.9967077 31.3235896,18.0663709 31.50955,18.1498516 C31.3518003,18.25521 31.3293469,18.4952889 31.4203121,18.6605231 C31.5112772,18.8257573 31.6851473,18.9316914 31.8613204,19.0019303 C32.1163686,19.0933938 32.3803661,19.1576563 32.6489174,19.193648 C32.741034,19.2091927 32.8446652,19.2224344 32.9212372,19.1683159 C33.015081,19.1009556 33.021414,18.9587506 32.9753557,18.8528165 C32.9292974,18.7468824 32.8446652,18.6634017 32.7790321,18.5684065 C32.7364185,18.5066166 32.7017918,18.4396847 32.6759767,18.3692043 C32.6629939,18.3399289 32.6576457,18.3078398 32.660432,18.2759362 C32.6777992,18.2222675 32.7137242,18.1765447 32.7617603,18.146973 C32.9135883,18.0208314 33.0273983,17.8549998 33.0905014,17.6679666 C33.1379125,17.5069509 33.1648006,17.3405927 33.1705277,17.1728398 C33.20392,16.7041965 33.2131317,16.2142512 33.0168081,15.7876362 C32.9548406,15.6429308 32.859325,15.5150504 32.7381554,15.4145639 C32.6558004,15.354845 32.567425,15.3039037 32.4744716,15.2625715 C32.1088838,15.0840955 31.740993,14.9050439 31.3489217,14.7973826 C30.9568504,14.6897213 30.5354168,14.6557533 30.1450727,14.7697476 C30.0295308,14.7987812 29.9221879,14.8539299 29.8313005,14.9309517 C29.7570315,14.9994634 29.7046401,15.0887014 29.6297954,15.1566374 C29.524437,15.2522084 29.3833834,15.2988424 29.2728435,15.3869289 C29.0667326,15.5550417 29.0039781,15.847512 29.0114626,16.1117715 C29.0143413,16.2269173 29.055218,16.3702738 29.1686366,16.3840913 C29.3563242,16.4071204 29.4369262,16.0910453 29.6211595,16.0524714 C29.851451,16.0069889 29.8756316,16.3155795 29.9671725,16.4583603 Z" id="Shape" fill="#D37F3F"></path>
                    <path d="M35.679554,35.1148532 C35.679554,35.1148532 35.0122843,35.8299085 34.3922243,35.877694 L36.9190982,37.5939416 C36.9190982,37.5939416 37.0618789,38.6878264 36.3468237,38.6878264 C35.6317685,38.6878264 35.679554,39.215194 35.679554,39.215194 L39.1598348,39.215194 C39.1598348,39.215194 39.5887528,38.4523533 39.2554058,38.0234353 C38.9220588,37.5945173 38.161521,36.6883202 38.161521,36.6883202 C38.161521,36.6883202 36.9219768,35.0187065 36.6836251,34.1136608 C36.679595,34.1136608 36.1792866,34.7573256 35.679554,35.1148532 Z" id="Shape" fill="#FFFFFF" opacity="0.1"></path>
                    <path d="M35.726188,35.2104242 C35.726188,35.2104242 35.0589183,35.9254794 34.4388584,35.9732649 L36.9657322,37.6895126 C36.9657322,37.6895126 37.108513,38.7833974 36.3934578,38.7833974 C35.6784026,38.7833974 35.726188,39.3078864 35.726188,39.3078864 L39.2064689,39.3078864 C39.2064689,39.3078864 39.6353869,38.5450457 39.3020399,38.1161277 C38.9686929,37.6872097 38.2081551,36.7810125 38.2081551,36.7810125 C38.2081551,36.7810125 36.9686109,35.1113989 36.7302591,34.2063531 C36.7273805,34.2086561 36.2270721,34.8523209 35.726188,35.2104242 Z" id="Shape" fill="#74555E"></path>
                    <path d="M17.7997192,25.102353 L22.2328313,30.346667 C22.2328313,30.346667 22.8051058,32.1584857 21.4222051,32.7779699 L20.8499306,33.4452396 L18.513623,32.5396182 C18.513623,32.5396182 19.2764637,32.3012664 18.513623,30.9183657 C17.7507823,29.5354651 16.3206719,28.1548673 16.3206719,28.1548673 L15.3194794,27.9165156 L12.7926055,32.0168564 C12.7926055,32.0168564 12.5047411,33.828675 11.3624951,34.0670268 L10.3613027,34.5437302 L8.97955345,33.4498454 L12.173697,26.6320646 C12.173697,26.6320646 11.6969936,23.2928373 13.0321087,22.8656465 L17.7997192,25.102353 Z" id="Shape" fill="#2A2A31"></path>
                    <path d="M21.2903632,17.6881171 C21.5039586,17.7623861 21.6795559,17.9149542 22.1384118,17.5217314 C22.1384118,17.5217314 23.3301705,18.8568466 22.9012525,19.7146826 C22.4723345,20.5725185 18.133642,25.6740518 18.133642,25.6740518 L12.3187807,23.4811006 C12.3187807,23.4811006 14.1305994,21.0970075 13.8444621,20.0958151 C13.5583249,19.0946226 15.942418,15.5665563 17.6586657,15.804908 C19.3749133,16.0432598 19.8044071,16.1860405 19.8044071,16.1860405 C19.8044071,16.1860405 20.0542734,17.4762489 20.942623,17.6069393 C21.0608174,17.6230782 21.1772396,17.6502562 21.2903632,17.6881171 Z" id="Shape" fill="#000000" opacity="0.1"></path>
                    <path d="M21.2903632,17.5453363 C21.5039586,17.6196053 21.6795559,17.7721735 22.1384118,17.3789507 C22.1384118,17.3789507 23.3301705,18.7140659 22.9012525,19.5719018 C22.4723345,20.4297378 18.133642,25.531271 18.133642,25.531271 L12.3187807,23.3383199 C12.3187807,23.3383199 14.1305994,20.9542268 13.8444621,19.9530343 C13.5583249,18.9518419 15.942418,15.4237756 17.6586657,15.6621273 C19.3749133,15.900479 19.8044071,16.0432598 19.8044071,16.0432598 C19.8044071,16.0432598 20.0542734,17.3334681 20.942623,17.4641586 C21.0608174,17.4802974 21.1772396,17.5074755 21.2903632,17.5453363 Z" id="Shape" fill="#2A2A31"></path>
                    <path d="M15.2728454,16.61611 C15.2728454,16.61611 15.6539779,20.9548025 19.8021041,21.4792915 L21.3277856,19.6196873 C21.3277856,19.6196873 18.9436924,18.4279286 18.9436924,18.0940059 C18.9436924,18.0940059 18.038071,17.3789507 18.3236325,16.187192 L15.2728454,16.61611 Z" id="Shape" fill="#2A2A31"></path>
                    <path d="M22.1384118,17.4745217 C22.1384118,17.4745217 24.1407967,18.5234996 23.9024449,20.0013955 C23.9024449,20.0013955 22.949038,19.3813356 22.424549,19.5246921 L22.1384118,17.4745217 Z" id="Shape" fill="#000000" opacity="0.1"></path>
                    <path d="M22.1384118,17.3789507 C22.1384118,17.3789507 24.1407967,18.4279286 23.9024449,19.9058245 C23.9024449,19.9058245 22.949038,19.2857646 22.424549,19.4291211 L22.1384118,17.3789507 Z" id="Shape" fill="#757681"></path>
                    <path d="M22.6629007,31.4912159 C22.6629007,31.4912159 20.2788076,34.2086561 20.2788076,34.5903643 C20.2788076,34.5903643 18.8970584,36.4971782 19.5637524,37.5939416 C20.2304464,38.6907051 21.5661373,38.8812713 21.5661373,38.8812713 C21.5661373,38.8812713 22.2811925,39.4057603 21.1372193,39.644112 C19.9932461,39.8824637 16.3696088,39.0718375 16.3696088,39.0718375 L17.1324495,37.1143595 C17.1324495,37.1143595 17.9430757,34.6352711 17.9430757,34.1107822 C17.9430757,33.5862932 18.6103454,31.9218611 18.6103454,31.9218611 L21.0416483,32.6847018 L21.804489,31.6817822 L22.3508557,31.2050787 L22.6629007,31.4912159 Z" id="Shape" fill="#000000" opacity="0.1"></path>
                    <path d="M22.6629007,31.5867869 C22.6629007,31.5867869 20.2788076,34.304227 20.2788076,34.6853595 C20.2788076,34.6853595 18.8970584,36.5921734 19.5637524,37.6889369 C20.2304464,38.7857003 21.5661373,38.9762666 21.5661373,38.9762666 C21.5661373,38.9762666 22.2811925,39.5007555 21.1372193,39.7391073 C19.9932461,39.977459 16.3696088,39.1668328 16.3696088,39.1668328 L17.1324495,37.2093548 C17.1324495,37.2093548 17.9430757,34.7302664 17.9430757,34.2057774 C17.9430757,33.6812884 18.6103454,32.0128263 18.6103454,32.0128263 L21.0416483,32.775667 L21.804489,31.7773532 L22.3508557,31.3006497 L22.6629007,31.5867869 Z" id="Shape" fill="#535461"></path>
                    <path d="M13.222675,32.7307601 C13.222675,32.7307601 10.8385819,35.4482002 10.8385819,35.8299085 C10.8385819,35.8299085 9.45683266,37.7367224 10.1235267,38.8334858 C10.7902206,39.9302492 12.1259115,40.1208155 12.1259115,40.1208155 C12.1259115,40.1208155 12.8409668,40.6453045 11.6969936,40.8836562 C10.5530204,41.1220079 6.92938306,40.3113817 6.92938306,40.3113817 L7.69222377,38.3539037 C7.69222377,38.3539037 8.50515289,35.877694 8.50515289,35.353205 C8.50515289,34.828716 9.17242261,33.1602538 9.17242261,33.1602538 L11.6037255,33.9230946 L12.3625361,32.9219021 L12.9089028,32.4451986 L13.222675,32.7307601 Z" id="Shape" fill="#000000" opacity="0.1"></path>
                    <path d="M13.222675,32.8263311 C13.222675,32.8263311 10.8385819,35.5437712 10.8385819,35.9254794 C10.8385819,35.9254794 9.45683266,37.8322934 10.1235267,38.9290568 C10.7902206,40.0258202 12.1259115,40.2163865 12.1259115,40.2163865 C12.1259115,40.2163865 12.8409668,40.7408754 11.6969936,40.9792272 C10.5530204,41.2175789 6.92938306,40.4069527 6.92938306,40.4069527 L7.69222377,38.4494747 C7.69222377,38.4494747 8.50515289,35.9732649 8.50515289,35.448776 C8.50515289,34.924287 9.17242261,33.2558248 9.17242261,33.2558248 L11.6037255,34.0186655 L12.3625361,33.0157459 L12.9089028,32.5390424 L13.222675,32.8263311 Z" id="Shape" fill="#535461"></path>
                    <path d="M25.4759118,19.7630438 L34.3421359,5.6001144 C34.3421359,5.6001144 35.0094056,5.45733365 34.9144104,6.02903238 L25.9048298,20.2397473 L25.4759118,19.7630438 Z" id="Shape" fill="#FC6681"></path>
                    <path d="M18.9436924,16.1394065 L18.8009117,17.045028 C18.8009117,17.045028 16.3218233,15.2832977 15.2250599,17.7589317 L14.7483564,15.7565468 C14.7483564,15.7565468 18.038071,14.7075689 18.9436924,16.1394065 Z" id="Shape" fill="#000000" opacity="0.1"></path>
                    <path d="M18.9436924,16.0438355 L18.8009117,16.949457 C18.8009117,16.949457 16.3218233,15.1854238 15.2250599,17.6645122 L14.7483564,15.6621273 C14.7483564,15.6621273 18.038071,14.6137251 18.9436924,16.0438355 Z" id="Shape" fill="#757681"></path>
                    <path d="M19.8021041,15.2619957 L19.8021041,16.1394065 L18.9436924,16.5683245 C17.0840883,14.9470721 15.2250599,16.1394065 15.2250599,16.1394065 C15.2250599,16.1394065 12.5076198,20.478099 12.0309163,20.860383 C11.5542128,21.2426669 9.68885138,28.6620844 9.68885138,28.6620844 L9.74239416,28.3932191 C9.74239416,28.3932191 10.6929225,20.8102946 11.9353453,19.7164098 C13.1777681,18.622525 14.3666482,15.7594255 14.3666482,15.7594255 C16.6073848,13.4231178 19.7543186,15.1393655 19.7543186,15.1393655 C19.7543186,15.1393655 19.7715905,15.1813937 19.8021041,15.2619957 Z" id="Shape" fill="#000000" opacity="0.1"></path>
                    <path d="M19.8021041,15.1681519 L19.8021041,16.0455627 L18.9436924,16.4744807 C17.0840883,14.8532283 15.2250599,16.0455627 15.2250599,16.0455627 C15.2250599,16.0455627 12.5076198,20.3842552 12.0309163,20.7665392 C11.5542128,21.1488231 9.68885138,28.5682406 9.68885138,28.5682406 L9.74239416,28.2993753 C9.74239416,28.2993753 10.6929225,20.7164508 11.9353453,19.6196873 C13.1777681,18.5229239 14.3666482,15.662703 14.3666482,15.662703 C16.6073848,13.3263954 19.7543186,15.0426431 19.7543186,15.0426431 C19.7543186,15.0426431 19.7715905,15.0863985 19.8021041,15.1681519 Z" id="Shape" fill="#2A2A31"></path>
                    <path d="M20.7555111,13.8508844 C20.4446175,13.8508844 20.165389,13.9919379 19.9235829,14.1963217 C20.088184,15.2709051 20.9858751,16.0814977 22.0716272,16.1359521 C22.511484,15.7329419 23.2806578,15.5665563 23.2806578,15.5665563 C23.2806578,15.5665563 21.90006,13.8508844 20.7555111,13.8508844 Z" id="Shape" fill="#000000" opacity="0.1"></path>
                    <circle id="Oval" fill="#535461" cx="22.233407" cy="13.7558891" r="2.28852213"></circle>
                    <path d="M23.6163077,11.1334443 C23.6163077,11.1334443 21.804489,10.0395595 20.8032966,11.5145767 C19.8021041,12.989594 19.8976751,12.5635547 19.8976751,12.5635547 L17.9401971,13.9453039 C17.9401971,13.9453039 19.5614495,13.9453039 20.5626419,14.3264364 C20.5626419,14.3264364 23.5662193,12.5624032 24.0907082,13.7063764 C24.0907082,13.7063764 24.6629827,13.9447282 24.7107682,14.3264364 C24.7107682,14.3264364 24.853549,14.0880846 24.5679875,13.5635957 C24.5679875,13.5647471 25.1437163,12.1818465 23.6163077,11.1334443 Z" id="Shape" fill="#000000" opacity="0.1"></path>
                    <path d="M23.6163077,11.0378733 C23.6163077,11.0378733 21.804489,9.94398848 20.8032966,11.4190058 C19.8021041,12.894023 19.8976751,12.4679837 19.8976751,12.4679837 L17.9401971,13.8497329 C17.9401971,13.8497329 19.5614495,13.8497329 20.5626419,14.2308654 C20.5626419,14.2308654 23.5662193,12.4668322 24.0907082,13.6108054 C24.0907082,13.6108054 24.6629827,13.8491572 24.7107682,14.2308654 C24.7107682,14.2308654 24.853549,13.9925137 24.5679875,13.4680247 C24.5679875,13.4691761 25.1437163,12.0868512 23.6163077,11.0378733 Z" id="Shape" fill="#535461"></path>
                    <polygon id="Shape" fill="#9F9BAD" points="25.4753361 19.5246921 20.9460773 25.4840613 21.8396085 26.096061 26.190967 20.049181"></polygon>
                    <path d="M20.8510821,19.1907693 C20.8510821,19.1907693 19.3731862,20.5258845 19.4693329,22.0993514 C19.4693329,22.0993514 20.5632177,21.7182189 22.0917777,22.2899177 C23.6203378,22.8616164 23.9513819,23.1483294 23.9513819,23.1483294 C23.9513819,23.1483294 25.5248488,22.3377032 25.3814923,21.7665802 C25.2381358,21.1954571 24.5679875,20.9548025 24.5679875,20.9548025 L23.2328723,20.6669381 C23.2328723,20.6669381 21.0416483,19.5719018 20.8510821,19.1907693 Z" id="Shape" fill="#000000" opacity="0.1"></path>
                    <path d="M20.9460773,19.1907693 C20.9460773,19.1907693 19.4681814,20.5258845 19.5643281,22.0993514 C19.5643281,22.0993514 20.6582129,21.7182189 22.186773,22.2899177 C23.715333,22.8616164 24.0463771,23.1483294 24.0463771,23.1483294 C24.0463771,23.1483294 25.619844,22.3377032 25.4764876,21.7665802 C25.3331311,21.1954571 24.6658614,20.9559539 24.6658614,20.9559539 L23.3307462,20.6680895 C23.3307462,20.6680895 21.1372193,19.5719018 20.9460773,19.1907693 Z" id="Shape" fill="#757681"></path>
                    <path d="M24.1407967,23.4816764 C24.1407967,23.4816764 24.5219291,25.9129792 22.424549,25.4391544 C22.424549,25.4391544 21.1850048,24.2951812 21.9478455,23.4816764 C22.7106862,22.6681715 24.1407967,23.3861054 24.1407967,23.4816764 Z" id="Shape" fill="#000000" opacity="0.1"></path>
                    <path d="M24.2357919,23.4816764 C24.2357919,23.4816764 24.6169244,25.9129792 22.5195442,25.4391544 C22.5195442,25.4391544 21.2800001,24.2951812 22.0428408,23.4816764 C22.8056815,22.6681715 24.2357919,23.3861054 24.2357919,23.4816764 Z" id="Shape" fill="#757681"></path>
                    <path d="M34.4129506,23.7465116 C34.4129506,23.7465116 34.3651651,24.5093523 34.0318181,24.6999186 C33.6984711,24.8904848 32.7444884,25.0338413 32.7444884,25.1288366 C32.7444884,25.2238318 32.3633559,25.6533255 32.2677849,25.5099691" id="Shape" fill="#000000" opacity="0.1"></path>
                    <path d="M27.5289609,33.4187561 C27.2409511,33.426988 26.9527086,33.4204545 26.6653676,33.3991813 C26.6653676,33.3991813 28.6677525,37.4039511 28.2388345,37.9762256 C28.2388345,37.9762256 28.0482683,38.8346373 27.2376421,38.8346373 C26.4270159,38.8346373 26.8565096,39.2635552 27.1420711,39.3113407 C27.4276326,39.3591262 29.9550822,39.5496925 30.4812983,38.8346373 L30.1473756,37.6906641 C30.1473756,37.6906641 29.7184576,36.3089149 29.8595112,35.9744164 C30.0005648,35.6399179 29.7639402,32.8274826 29.7639402,32.8274826 L29.1243055,33.0923178 C28.6181437,33.3016644 28.0766708,33.4124602 27.5289609,33.4187561 Z" id="Shape" fill="#FFFFFF" opacity="0.1"></path>
                    <path d="M27.5289609,33.5609611 C27.2409511,33.569193 26.9527086,33.5626595 26.6653676,33.5413863 C26.6653676,33.5413863 28.6677525,37.5461561 28.2388345,38.1184306 C28.2388345,38.1184306 28.0482683,38.9768423 27.2376421,38.9768423 C26.4270159,38.9768423 26.8565096,39.4057603 27.1420711,39.4535458 C27.4276326,39.5013313 29.9550822,39.6918975 30.4812983,38.9768423 L30.1473756,37.8328691 C30.1473756,37.8328691 29.7184576,36.4511199 29.8595112,36.1166214 C30.0005648,35.782123 29.7639402,32.9696876 29.7639402,32.9696876 L29.1243055,33.2345229 C28.6181437,33.4438695 28.0766708,33.5546653 27.5289609,33.5609611 Z" id="Shape" fill="#74555E"></path>
                    <path d="M38.7458858,0.269441096 C38.6782524,0.239922579 38.6433798,0.16448887 38.664708,0.0938438005 C38.666298,0.0886021883 38.6672642,0.0831913462 38.6675867,0.077723393 C38.6694315,0.0455997208 38.6500592,0.0160455975 38.6198665,0.00492197462 C38.5896738,-0.00620164821 38.5557579,0.0037199795 38.5363205,0.0293621707 C38.5330732,0.033823742 38.5303675,0.0386553495 38.5282603,0.0437553916 C38.4987418,0.111388805 38.4233081,0.146261438 38.352663,0.124933158 C38.3474214,0.123343192 38.3420105,0.12237697 38.3365426,0.122054514 C38.3044189,0.120209729 38.2748648,0.139581981 38.2637412,0.169774672 C38.2526176,0.199967363 38.2625392,0.233883313 38.2881814,0.253320688 C38.2926429,0.256568003 38.2974746,0.259273704 38.3025746,0.261380892 C38.3703315,0.290214245 38.405912,0.365081589 38.3854795,0.43582673 C38.3838896,0.441068342 38.3829234,0.446479184 38.3826009,0.451947137 C38.3807561,0.484070809 38.4001284,0.513624933 38.4303211,0.524748556 C38.4605138,0.535872179 38.4944297,0.525950551 38.5138671,0.50030836 C38.5171144,0.495846788 38.5198201,0.491015181 38.5219273,0.485915139 C38.5514458,0.418281725 38.6268795,0.383409093 38.6975246,0.404737373 C38.7027662,0.406327339 38.708177,0.40729356 38.713645,0.407616017 C38.7457687,0.409460801 38.7753228,0.390088549 38.7864464,0.359895858 C38.79757,0.329703168 38.7876484,0.295787218 38.7620062,0.276349842 C38.7569452,0.273377006 38.7515289,0.271055699 38.7458858,0.269441096 Z" id="Shape" fill="#4285F4"></path>
                    <path d="M23.5466445,3.83895989 C23.4790111,3.80944137 23.4441384,3.73400766 23.4654667,3.66336259 C23.4670567,3.65812098 23.4680229,3.65271014 23.4683454,3.64724218 C23.4701902,3.61511851 23.4508179,3.58556439 23.4206252,3.57444077 C23.3904325,3.56331714 23.3565166,3.57323877 23.3370792,3.59888096 C23.3338319,3.60334253 23.3311262,3.60817414 23.329019,3.61327418 C23.2995005,3.6809076 23.2240668,3.71578023 23.1534217,3.69445195 C23.1481801,3.69286198 23.1427692,3.69189576 23.1373013,3.6915733 C23.1051776,3.68972852 23.0756235,3.70910077 23.0644999,3.73929346 C23.0533762,3.76948615 23.0632979,3.8034021 23.0889401,3.82283948 C23.0934016,3.82608679 23.0982332,3.82879249 23.1033333,3.83089968 C23.1709667,3.8604182 23.2058393,3.93585191 23.1845111,4.00649698 C23.1829211,4.01173859 23.1819549,4.01714943 23.1816324,4.02261739 C23.1797876,4.05474106 23.1991599,4.08429518 23.2293526,4.0954188 C23.2595453,4.10654243 23.2934612,4.0966208 23.3128986,4.07097861 C23.3161459,4.06651704 23.3188516,4.06168543 23.3209588,4.05658539 C23.3504773,3.98895197 23.425911,3.95407934 23.4965561,3.97540762 C23.5017977,3.97699759 23.5072085,3.97796381 23.5126765,3.97828627 C23.5448002,3.98013105 23.5743543,3.9607588 23.5854779,3.93056611 C23.5966015,3.90037342 23.5866799,3.86645747 23.5610377,3.84702009 C23.5565761,3.84377278 23.5517445,3.84106708 23.5466445,3.83895989 Z" id="Shape" fill="#4285F4"></path>
                    <circle id="Oval" fill="#4285F4" cx="43.5044183" cy="9.30909325" r="1"></circle>
                    <rect id="Rectangle-path" fill="#4285F4" x="6.86950726" y="19.1274392" width="1" height="1"></rect>
                    <rect id="Rectangle-path" fill="#4285F4" transform="translate(6.760427, 19.900335) rotate(90.000000) translate(-6.760427, -19.900335) " x="6.26042714" y="19.4003346" width="1" height="1"></rect>
                    <rect id="Rectangle-path" fill="#4285F4" x="44.9827563" y="2.60402153" width="1" height="1"></rect>
                    <rect id="Rectangle-path" fill="#4285F4" transform="translate(44.873676, 3.376917) rotate(90.000000) translate(-44.873676, -3.376917) " x="44.3736762" y="2.876917" width="1" height="1"></rect>
                    <rect id="Rectangle-path" fill="#4285F4" x="14.3539821" y="8.07344549" width="1" height="1"></rect>
                    <rect id="Rectangle-path" fill="#4285F4" transform="translate(14.244902, 8.846341) rotate(90.000000) translate(-14.244902, -8.846341) " x="13.744902" y="8.34634095" width="1" height="1"></rect>
                    <rect id="Rectangle-path" fill="#4285F4" x="29.0926404" y="2.02829269" width="1" height="1"></rect>
                    <rect id="Rectangle-path" fill="#4285F4" transform="translate(28.983560, 2.801188) rotate(90.000000) translate(-28.983560, -2.801188) " x="28.4835603" y="2.30118816" width="1" height="1"></rect>
                    <rect id="Rectangle-path" fill="#4285F4" x="46.1917869" y="13.5428694" width="1" height="1"></rect>
                    <rect id="Rectangle-path" fill="#4285F4" transform="translate(46.082707, 14.315765) rotate(90.000000) translate(-46.082707, -14.315765) " x="45.5827067" y="13.8157649" width="1" height="1"></rect>
                    <path d="M11.7798985,1.59016305 C11.7133322,1.56116415 11.6789583,1.48697582 11.6998722,1.4174444 C11.7014674,1.41220405 11.7024338,1.40679258 11.7027509,1.40132399 C11.7059765,1.36924283 11.6874705,1.33893143 11.6574604,1.32714173 C11.6274502,1.31535203 11.5932609,1.3249617 11.5737876,1.35065985 C11.5705357,1.35511846 11.5678296,1.35995064 11.5657274,1.36505307 C11.5367285,1.43161939 11.4625402,1.46599332 11.3930087,1.44507938 C11.3877684,1.44348415 11.3823569,1.44251782 11.3768883,1.44220074 C11.3450431,1.44006203 11.3155936,1.45915366 11.3045473,1.48909821 C11.2935011,1.51904276 11.3034975,1.55268555 11.3291028,1.57173973 C11.3335614,1.57499167 11.3383936,1.57769769 11.3434961,1.57979993 C11.4100624,1.60879883 11.4444363,1.68298716 11.4235224,1.75251858 C11.4219271,1.75775893 11.4209608,1.7631704 11.4206437,1.76863899 C11.418505,1.80048425 11.4375966,1.82993377 11.4675412,1.84097998 C11.4974857,1.85202619 11.5311285,1.84202982 11.5501827,1.81642448 C11.5534347,1.81196588 11.5561407,1.8071337 11.5582429,1.80203126 C11.5872418,1.73546494 11.6614301,1.70109101 11.7309616,1.72200495 C11.7362019,1.72360018 11.7416134,1.72456652 11.747082,1.7248836 C11.7789272,1.72702231 11.8083768,1.70793067 11.819423,1.67798612 C11.8304692,1.64804157 11.8204728,1.61439878 11.7948675,1.59534461 C11.790093,1.59304923 11.7850703,1.59131062 11.7798985,1.59016305 Z" id="Shape" fill="#4285F4"></path>
                    <path d="M6.35998724,11.8508024 C6.29342092,11.8218035 6.25904699,11.7476152 6.27996093,11.6780837 C6.28155616,11.6728434 6.2825225,11.6674319 6.28283958,11.6619633 C6.28497829,11.6301181 6.26588665,11.6006685 6.2359421,11.5896223 C6.20599755,11.5785761 6.17235477,11.5885725 6.15330059,11.6141778 C6.15004865,11.6186364 6.14734263,11.6234686 6.14524039,11.6285711 C6.11624149,11.6951374 6.04205315,11.7295113 5.97252174,11.7085974 C5.96728139,11.7070021 5.96186992,11.7060358 5.95640133,11.7057187 C5.92455606,11.70358 5.89510655,11.7226716 5.88406034,11.7526162 C5.87301413,11.7825607 5.8830105,11.8162035 5.90861583,11.8352577 C5.91307444,11.8385096 5.91790662,11.8412157 5.92300906,11.8433179 C5.98957537,11.8723168 6.0239493,11.9465051 6.00303536,12.0160366 C6.00144013,12.0212769 6.0004738,12.0266884 6.00015672,12.032157 C5.99801801,12.0640022 6.01710964,12.0934517 6.04705419,12.104498 C6.07699874,12.1155442 6.11064153,12.1055478 6.12969571,12.0799425 C6.13294765,12.0754839 6.13565367,12.0706517 6.13775591,12.0655492 C6.16675481,11.9989829 6.24094314,11.964609 6.31047456,11.9855229 C6.31571491,11.9871182 6.32112638,11.9880845 6.32659497,11.9884016 C6.35844023,11.9905403 6.38788975,11.9714487 6.39893596,11.9415041 C6.40998217,11.9115596 6.3999858,11.8779168 6.37438046,11.8588626 C6.36992186,11.8556107 6.36508968,11.8529046 6.35998724,11.8508024 Z" id="Shape" fill="#4285F4"></path>
                    <circle id="Oval" fill="#4285F4" cx="0.362753629" cy="10.6378754" r="1"></circle>
                    <circle id="Oval" fill="#4285F4" cx="3.98005791" cy="3.17988405" r="1"></circle>
                    <circle id="Oval" fill="#4285F4" cx="44.5113681" cy="19.2761109" r="1"></circle>
                </g>
            </g>
        </g>
    </g>
</svg>