<?xml version="1.0" encoding="UTF-8"?>
<svg width="323px" height="266px" viewBox="0 0 323 266" version="1.1" xmlns="http://www.w3.org/2000/svg" xmlns:xlink="http://www.w3.org/1999/xlink">
    <!-- Generator: Sketch 49.1 (51147) - http://www.bohemiancoding.com/sketch -->
    <title>Group 6</title>
    <desc>Created with Sketch.</desc>
    <defs>
        <circle id="path-1" cx="129.84304" cy="129.84304" r="129.84304"></circle>
        <filter x="-1.9%" y="-1.5%" width="103.9%" height="103.9%" filterUnits="objectBoundingBox" id="filter-3">
            <feOffset dx="0" dy="1" in="SourceAlpha" result="shadowOffsetOuter1"></feOffset>
            <feGaussianBlur stdDeviation="1.5" in="shadowOffsetOuter1" result="shadowBlurOuter1"></feGaussianBlur>
            <feColorMatrix values="0 0 0 0 0.553913976   0 0 0 0 0.561421821   0 0 0 0 0.575733418  0 0 0 0.303555254 0" type="matrix" in="shadowBlurOuter1"></feColorMatrix>
        </filter>
        <linearGradient x1="50.0053057%" y1="99.9526347%" x2="50.0053057%" y2="-0.0118413262%" id="linearGradient-4">
            <stop stop-color="#808080" stop-opacity="0.25" offset="0%"></stop>
            <stop stop-color="#808080" stop-opacity="0.12" offset="54%"></stop>
            <stop stop-color="#808080" stop-opacity="0.1" offset="100%"></stop>
        </linearGradient>
        <linearGradient x1="37041%" y1="52973%" x2="37041%" y2="51461%" id="linearGradient-5">
            <stop stop-color="#808080" stop-opacity="0.25" offset="0%"></stop>
            <stop stop-color="#808080" stop-opacity="0.12" offset="54%"></stop>
            <stop stop-color="#808080" stop-opacity="0.1" offset="100%"></stop>
        </linearGradient>
        <linearGradient x1="47213%" y1="50775%" x2="47213%" y2="49263%" id="linearGradient-6">
            <stop stop-color="#808080" stop-opacity="0.25" offset="0%"></stop>
            <stop stop-color="#808080" stop-opacity="0.12" offset="54%"></stop>
            <stop stop-color="#808080" stop-opacity="0.1" offset="100%"></stop>
        </linearGradient>
        <linearGradient x1="64614%" y1="51773%" x2="64614%" y2="49463%" id="linearGradient-7">
            <stop stop-color="#808080" stop-opacity="0.25" offset="0%"></stop>
            <stop stop-color="#808080" stop-opacity="0.12" offset="54%"></stop>
            <stop stop-color="#808080" stop-opacity="0.1" offset="100%"></stop>
        </linearGradient>
        <linearGradient x1="55724%" y1="56318%" x2="55724%" y2="54806%" id="linearGradient-8">
            <stop stop-color="#808080" stop-opacity="0.25" offset="0%"></stop>
            <stop stop-color="#808080" stop-opacity="0.12" offset="54%"></stop>
            <stop stop-color="#808080" stop-opacity="0.1" offset="100%"></stop>
        </linearGradient>
        <linearGradient x1="44124%" y1="62584%" x2="44124%" y2="61073%" id="linearGradient-9">
            <stop stop-color="#808080" stop-opacity="0.25" offset="0%"></stop>
            <stop stop-color="#808080" stop-opacity="0.12" offset="54%"></stop>
            <stop stop-color="#808080" stop-opacity="0.1" offset="100%"></stop>
        </linearGradient>
        <linearGradient x1="66202%" y1="55999%" x2="66202%" y2="53688%" id="linearGradient-10">
            <stop stop-color="#808080" stop-opacity="0.25" offset="0%"></stop>
            <stop stop-color="#808080" stop-opacity="0.12" offset="54%"></stop>
            <stop stop-color="#808080" stop-opacity="0.1" offset="100%"></stop>
        </linearGradient>
        <linearGradient x1="71848%" y1="68772%" x2="71848%" y2="66462%" id="linearGradient-11">
            <stop stop-color="#808080" stop-opacity="0.25" offset="0%"></stop>
            <stop stop-color="#808080" stop-opacity="0.12" offset="54%"></stop>
            <stop stop-color="#808080" stop-opacity="0.1" offset="100%"></stop>
        </linearGradient>
        <linearGradient x1="96018%" y1="80218%" x2="96018%" y2="77908%" id="linearGradient-12">
            <stop stop-color="#808080" stop-opacity="0.25" offset="0%"></stop>
            <stop stop-color="#808080" stop-opacity="0.12" offset="54%"></stop>
            <stop stop-color="#808080" stop-opacity="0.1" offset="100%"></stop>
        </linearGradient>
        <linearGradient x1="57626%" y1="65026%" x2="57626%" y2="63514%" id="linearGradient-13">
            <stop stop-color="#808080" stop-opacity="0.25" offset="0%"></stop>
            <stop stop-color="#808080" stop-opacity="0.12" offset="54%"></stop>
            <stop stop-color="#808080" stop-opacity="0.1" offset="100%"></stop>
        </linearGradient>
        <linearGradient x1="95334%" y1="71538%" x2="95334%" y2="70026%" id="linearGradient-14">
            <stop stop-color="#808080" stop-opacity="0.25" offset="0%"></stop>
            <stop stop-color="#808080" stop-opacity="0.12" offset="54%"></stop>
            <stop stop-color="#808080" stop-opacity="0.1" offset="100%"></stop>
        </linearGradient>
        <linearGradient x1="90715%" y1="58290%" x2="90715%" y2="56779%" id="linearGradient-15">
            <stop stop-color="#808080" stop-opacity="0.25" offset="0%"></stop>
            <stop stop-color="#808080" stop-opacity="0.12" offset="54%"></stop>
            <stop stop-color="#808080" stop-opacity="0.1" offset="100%"></stop>
        </linearGradient>
        <linearGradient x1="40847%" y1="59330%" x2="40847%" y2="57818%" id="linearGradient-16">
            <stop stop-color="#808080" stop-opacity="0.25" offset="0%"></stop>
            <stop stop-color="#808080" stop-opacity="0.12" offset="54%"></stop>
            <stop stop-color="#808080" stop-opacity="0.1" offset="100%"></stop>
        </linearGradient>
        <linearGradient x1="79518%" y1="56241%" x2="79518%" y2="53931%" id="linearGradient-17">
            <stop stop-color="#808080" stop-opacity="0.25" offset="0%"></stop>
            <stop stop-color="#808080" stop-opacity="0.12" offset="54%"></stop>
            <stop stop-color="#808080" stop-opacity="0.1" offset="100%"></stop>
        </linearGradient>
        <linearGradient x1="81898%" y1="74495%" x2="81898%" y2="69209%" id="linearGradient-18">
            <stop stop-color="#808080" stop-opacity="0.25" offset="0%"></stop>
            <stop stop-color="#808080" stop-opacity="0.12" offset="54%"></stop>
            <stop stop-color="#808080" stop-opacity="0.1" offset="100%"></stop>
        </linearGradient>
        <linearGradient x1="100963%" y1="94157%" x2="100963%" y2="83119%" id="linearGradient-19">
            <stop stop-color="#808080" stop-opacity="0.25" offset="0%"></stop>
            <stop stop-color="#808080" stop-opacity="0.12" offset="54%"></stop>
            <stop stop-color="#808080" stop-opacity="0.1" offset="100%"></stop>
        </linearGradient>
        <linearGradient x1="98397%" y1="57848%" x2="98397%" y2="52562%" id="linearGradient-20">
            <stop stop-color="#808080" stop-opacity="0.25" offset="0%"></stop>
            <stop stop-color="#808080" stop-opacity="0.12" offset="54%"></stop>
            <stop stop-color="#808080" stop-opacity="0.1" offset="100%"></stop>
        </linearGradient>
        <linearGradient x1="69197%" y1="61933%" x2="69197%" y2="59623%" id="linearGradient-21">
            <stop stop-color="#808080" stop-opacity="0.25" offset="0%"></stop>
            <stop stop-color="#808080" stop-opacity="0.12" offset="54%"></stop>
            <stop stop-color="#808080" stop-opacity="0.1" offset="100%"></stop>
        </linearGradient>
        <linearGradient x1="88274%" y1="61751%" x2="88274%" y2="59441%" id="linearGradient-22">
            <stop stop-color="#808080" stop-opacity="0.25" offset="0%"></stop>
            <stop stop-color="#808080" stop-opacity="0.12" offset="54%"></stop>
            <stop stop-color="#808080" stop-opacity="0.1" offset="100%"></stop>
        </linearGradient>
        <linearGradient x1="105869%" y1="65983%" x2="105869%" y2="60697%" id="linearGradient-23">
            <stop stop-color="#808080" stop-opacity="0.25" offset="0%"></stop>
            <stop stop-color="#808080" stop-opacity="0.12" offset="54%"></stop>
            <stop stop-color="#808080" stop-opacity="0.1" offset="100%"></stop>
        </linearGradient>
    </defs>
    <g id="Page-1" stroke="none" stroke-width="1" fill="none" fill-rule="evenodd">
        <g id="Dashboard-empty" transform="translate(-667.000000, -260.000000)">
            <g id="Group-6" transform="translate(670.000000, 262.000000)">
                <g id="Group-16" transform="translate(0.000000, 0.544922)">
                    <mask id="mask-2" fill="white">
                        <use xlink:href="#path-1"></use>
                    </mask>
                    <g id="Oval-2">
                        <use fill="black" fill-opacity="1" filter="url(#filter-3)" xlink:href="#path-1"></use>
                        <use fill="#FFFFFF" fill-rule="evenodd" xlink:href="#path-1"></use>
                    </g>
                    <g id="undraw_news_go0e" mask="url(#mask-2)">
                        <g transform="translate(38.630987, 38.201203)">
                            <rect id="Rectangle-path" fill="#3A7DE3" fill-rule="nonzero" x="6.3808016" y="81.5457733" width="27.3561443" height="4.15586907"></rect>
                            <polygon id="Shape" fill="#EEEEEE" fill-rule="nonzero" points="6.3808016 85.6036438 3.28476988 225.759875 5.21933601 225.759875 9.50586996 85.7016424"></polygon>
                            <polygon id="Shape" fill="#EEEEEE" fill-rule="nonzero" points="33.7333163 85.6036438 36.8257184 225.759875 34.8947819 225.759875 30.6082479 85.7016424"></polygon>
                            <polygon id="Shape" fill="#E0E0E0" fill-rule="nonzero" points="12.209907 85.7016424 8.89247094 225.759875 11.2117725 225.759875 14.275138 85.6036438"></polygon>
                            <polygon id="Shape" fill="#E0E0E0" fill-rule="nonzero" points="28.4813141 85.7016424 31.8023798 225.759875 29.4794486 225.759875 26.4197127 85.6036438"></polygon>
                            <rect id="Rectangle-path" fill="#E0E0E0" fill-rule="nonzero" x="11.6001376" y="208.748033" width="17.5925741" height="2.12693387"></rect>
                            <rect id="Rectangle-path" fill="#E0E0E0" fill-rule="nonzero" x="11.0194048" y="196.955528" width="18.9464075" height="2.12693387"></rect>
                            <rect id="Rectangle-path" fill="#E0E0E0" fill-rule="nonzero" x="11.6001376" y="185.35539" width="18.3656747" height="2.12693387"></rect>
                            <rect id="Rectangle-path" fill="#E0E0E0" fill-rule="nonzero" x="11.6001376" y="173.562885" width="17.5925741" height="2.12693387"></rect>
                            <rect id="Rectangle-path" fill="#E0E0E0" fill-rule="nonzero" x="11.6001376" y="161.385644" width="17.5925741" height="1.93456613"></rect>
                            <rect id="Rectangle-path" fill="#E0E0E0" fill-rule="nonzero" x="12.1808704" y="149.785506" width="17.0118414" height="2.31930161"></rect>
                            <rect id="Rectangle-path" fill="#E0E0E0" fill-rule="nonzero" x="12.1808704" y="138.185369" width="16.4311086" height="1.54620107"></rect>
                            <rect id="Rectangle-path" fill="#E0E0E0" fill-rule="nonzero" x="12.7579736" y="125.81576" width="14.500172" height="2.51166934"></rect>
                            <rect id="Rectangle-path" fill="#E0E0E0" fill-rule="nonzero" x="12.7579736" y="114.215623" width="15.0772752" height="2.12693387"></rect>
                            <rect id="Rectangle-path" fill="#E0E0E0" fill-rule="nonzero" x="12.7579736" y="102.23075" width="15.0772752" height="2.31930161"></rect>
                            <rect id="Rectangle-path" fill="#E0E0E0" fill-rule="nonzero" x="13.5310742" y="90.4382443" width="13.7270715" height="2.31930161"></rect>
                            <rect id="Rectangle-path" fill="#3A7DE3" fill-rule="nonzero" x="0" y="73.6187707" width="40.208487" height="8.50773547"></rect>
                            <g id="Group" opacity="0.5" stroke-width="1" fill="none" fill-rule="evenodd" transform="translate(6.896202, 13.792404)">
                                <path d="M31.1889807,0 L17.2042091,9.11024574 C17.0673482,8.54669823 16.7484019,8.04403895 16.2968141,7.68019123 C16.4606741,7.24115661 16.4872554,6.76269352 16.3730353,6.30821 C16.3520478,6.17737736 16.3011194,6.05316179 16.2242225,5.945252 C16.0775645,5.80767489 15.8727882,5.75071723 15.6761559,5.79280964 L13.454853,5.93799284 C13.1962106,5.92554785 12.9407924,5.99961912 12.728937,6.14850848 C12.4167931,6.40983824 12.322424,6.95790482 12.003021,7.19019793 C11.7888758,7.34264029 11.5166573,7.32812197 11.277105,7.44789811 C10.7653342,7.72011661 10.6528172,8.53677211 10.6128919,9.20098524 C10.5584482,10.1083802 10.5620777,11.1754767 11.1536993,11.7416912 C11.5856193,12.1445746 12.1845,12.1046492 12.728937,12.0756126 L13.2770036,12.0320576 C13.4155202,12.1142585 13.5613204,12.1835136 13.7125532,12.2389437 L13.7125532,13.0120442 L13.6109249,13.0120442 C13.6109249,13.0120442 7.34264029,11.1972542 0.457327077,30.15818 L0.337550938,30.15818 C0.337550938,30.15818 -0.678731456,33.606281 0.947320374,33.0001411 C2.36285656,32.4702225 2.39915236,30.702617 2.3737453,30.2598083 L2.46811438,30.2598083 C2.46811438,30.2598083 5.31007551,21.940811 9.77445888,20.9245286 C9.77445888,20.9245286 13.022933,24.982399 7.74552367,33.0981398 L11.8759857,33.0981398 C11.8629216,34.00613 12.0461601,34.906227 12.4131635,35.7368445 C13.6290728,38.1722926 9.97771536,61.3036058 9.97771536,61.3036058 L13.022933,61.3036058 L14.5546157,53.6379329 L14.7469834,61.3036058 L16.9791751,61.3036058 L19.2113668,46.5638815 L18.9064821,28.8079763 L18.9064821,24.2092984 L19.3129951,24.7501059 L19.3129951,17.6470178 L25.1965442,17.6470178 L26.2128266,9.7345335 L26.1075688,9.7345335 C26.1324382,9.18188107 26.1093645,8.62811299 26.0386068,8.07944503 L33.6244289,6.48605942 C34.8185607,1.41553619 31.1889807,0 31.1889807,0 Z M24.5468494,9.85793922 L22.7683552,14.4058029 C22.7683552,14.4058029 17.8974589,12.1736112 16.0717801,12.9866372 L15.9701519,12.9866372 L15.9701519,12.0211689 C16.7283723,11.5830328 17.2193975,10.7968484 17.2804303,9.92327166 L24.5940339,8.38795933 C24.4993489,8.87094463 24.482196,9.36592848 24.5432198,9.85430964 L24.5468494,9.85793922 Z" id="Shape" fill="url(#linearGradient-4)" fill-rule="nonzero"></path>
                            </g>
                            <path d="M32.5500732,24.8154383 C32.5500732,24.8154383 32.7823664,21.4617064 31.7370473,22.1985111 C30.6917283,22.9353159 31.1417962,25.0223244 31.1417962,25.0223244 L32.5500732,24.8154383 Z" id="Shape" fill="#FDA57D" fill-rule="nonzero"></path>
                            <path d="M8.02137175,43.9433248 C8.02137175,43.9433248 7.05590347,47.2280947 8.60210455,46.6509914 C10.1483056,46.0738882 9.95593788,43.9433248 9.95593788,43.9433248 L8.02137175,43.9433248 Z" id="Shape" fill="#FDA57D" fill-rule="nonzero"></path>
                            <rect id="Rectangle-path" fill="#FDA57D" fill-rule="nonzero" x="20.7829749" y="26.3507506" width="2.12693387" height="1.93456613"></rect>
                            <rect id="Rectangle-path" fill="#4D8AF0" fill-rule="nonzero" x="19.0407766" y="36.98542" width="1.73856881" height="8.7001032"></rect>
                            <rect id="Rectangle-path" fill="#000000" fill-rule="nonzero" opacity="0.1" x="19.0407766" y="36.98542" width="1.73856881" height="8.7001032"></rect>
                            <path d="M21.6105192,27.6102149 L23.6213065,27.6102149 C24.7739294,27.6102149 25.708315,28.5446004 25.708315,29.6972234 L25.708315,42.6874901 L19.538029,42.6874901 L19.538029,29.6972234 C19.5380013,28.5502464 20.46357,27.6181939 21.6105192,27.6102149 Z" id="Shape" fill="#FFFFFF" fill-rule="nonzero"></path>
                            <circle id="Oval" fill="#FDA57D" fill-rule="nonzero" cx="21.6504446" cy="24.5141832" r="2.51166934"></circle>
                            <path d="M20.6849763,27.6102149 C20.6849763,27.6102149 14.6925397,25.8716461 8.11937041,44.0413234 L10.0539365,44.0413234 C10.0539365,44.0413234 12.7616032,36.1143208 17.0118414,35.1488525 C17.0118414,35.1488525 20.1042435,39.0143552 15.0772752,46.7635084 L19.1387752,46.7635084 L19.1387752,44.1719883 C19.1151044,40.2441832 19.603154,36.3300256 20.5906072,32.5282958 C21.0562814,30.9261041 21.088844,29.2290915 20.6849763,27.6102149 Z" id="Shape" fill="#3A7DE3" fill-rule="nonzero"></path>
                            <path d="M23.0042779,27.6102149 L23.0042779,28.1909477 C23.0042779,28.1909477 24.3581112,34.1833842 25.5159472,38.0488869 L26.1075688,38.8365058 L26.1075688,32.0564504 L31.7152698,32.0564504 L32.6807381,24.5178127 L31.134537,24.5178127 L29.3741908,28.9604186 C29.3741908,28.9604186 24.7428467,26.8334848 23.0042779,27.6102149 Z" id="Shape" fill="#3A7DE3" fill-rule="nonzero"></path>
                            <path d="M19.5235107,42.6874901 C19.5235107,42.6874901 18.3620451,46.9413578 19.5235107,49.2606594 C20.6849763,51.5799611 17.2042091,73.6187707 17.2042091,73.6187707 L20.1078731,73.6187707 L24.2637421,52.8357957 L24.938844,42.6729718 L19.5235107,42.6874901 Z" id="Shape" fill="#333333" fill-rule="nonzero"></path>
                            <polygon id="Shape" fill="#333333" fill-rule="nonzero" points="25.7119446 42.6874901 26.002311 59.6013328 23.8753771 73.6187707 21.7484432 73.6187707 20.9753427 42.6874901"></polygon>
                            <path d="M21.240302,23.555974 C21.2918172,23.4720974 21.3554132,23.3962713 21.4290402,23.3309401 C21.5016948,23.2883292 21.5843645,23.265783 21.6685925,23.2656077 C22.1948816,23.2220527 22.8010214,23.211164 23.1204245,22.7139115 C23.3551445,22.2675165 23.4122009,21.7488219 23.280126,21.2620795 C23.262913,21.1314456 23.2143466,21.0069164 23.1385724,20.8991215 C22.9987289,20.7678983 22.803401,20.7136405 22.6159128,20.7539383 L20.4998677,20.8918623 C20.2579122,20.8826412 20.0195715,20.9527414 19.8211363,21.0914892 C19.5235107,21.3419303 19.4364008,21.8609602 19.1242569,22.0859942 C18.9173708,22.2311774 18.6596707,22.216659 18.4418959,22.3328056 C17.9555321,22.5905058 17.8502743,23.3599767 17.8103489,24.0024124 C17.7595348,24.8662524 17.7595348,25.8825348 18.3257493,26.4088239 C18.7358918,26.7935594 19.3057359,26.7717819 19.8247658,26.7282269 L20.7902341,26.6483762 C20.887653,26.651007 20.9832569,26.6216885 21.0624526,26.5648959 C21.1859906,26.3998149 21.2334987,26.1899874 21.1931175,25.9877926 C21.1677104,25.5014289 21.1168963,24.9497328 20.7974933,24.6521072 C20.7212973,24.5948606 20.6518859,24.5291024 20.5906072,24.4561099 C20.2457971,23.918932 21.058823,23.7955263 21.240302,23.555974 Z" id="Shape" fill="#333333" fill-rule="nonzero"></path>
                            <path d="M37.4064512,15.2442359 C37.4064512,15.2442359 40.8872184,16.5980692 39.7257528,21.4145219 L24.0677448,24.6992917 L24.0677448,23.9261912 L37.4064512,15.2442359 Z" id="Shape" fill="#E36C65" fill-rule="nonzero"></path>
                            <rect id="Rectangle-path" fill="#000000" fill-rule="nonzero" opacity="0.1" x="6.47517068" y="82.0285075" width="27.2581456" height="1"></rect>
                            <rect id="Rectangle-path" fill="#000000" fill-rule="nonzero" opacity="0.1" x="10.9214062" y="136.544799" width="2.12693387" height="1"></rect>
                            <rect id="Rectangle-path" fill="#000000" fill-rule="nonzero" opacity="0.1" x="27.548512" y="136.544799" width="2.12693387" height="1"></rect>
                            <rect id="Rectangle-path" fill="#EEEEEE" fill-rule="nonzero" x="6.3808016" y="133.354398" width="27.2581456" height="3.28476988"></rect>
                            <polygon id="Shape" fill="url(#linearGradient-5)" fill-rule="nonzero" points="54.8611013 13.9194392 55.1333198 13.7815152 55.0679874 13.774256 55.0897649 13.7597377 55.0498395 13.7706264 47.5583864 12.8015286 47.718088 15.2805317 47.9540107 17.4800572 48.4149673 17.2441345 48.8432577 18.2168619"></polygon>
                            <polygon id="Shape" fill="#6C63FF" fill-rule="nonzero" points="47.968529 15.2333472 48.1863038 17.247764 54.8828788 13.8541068 49.0682917 13.9811421"></polygon>
                            <polygon id="Shape" fill="#000000" fill-rule="nonzero" opacity="0.2" points="47.968529 15.2333472 48.1863038 17.247764 54.8828788 13.8541068 49.0682917 13.9811421"></polygon>
                            <polygon id="Shape" fill="#6C63FF" fill-rule="nonzero" points="47.8197162 12.9648597 54.8828788 13.8541068 47.968529 15.2333472"></polygon>
                            <polygon id="Shape" fill="#6C63FF" fill-rule="nonzero" points="49.013848 17.9156068 54.8429534 13.8323293 48.0846755 15.8431166"></polygon>
                            <polygon id="Shape" fill="url(#linearGradient-6)" fill-rule="nonzero" points="91.1823082 3.54247006 91.4545267 3.40454602 91.3891942 3.39365728 91.4109717 3.37913896 91.3710463 3.39365728 83.8759637 2.42455942 84.0392948 4.90356255 84.2752175 7.10308801 84.7361741 6.86716532 85.1644646 7.83989275"></polygon>
                            <polygon id="Shape" fill="#6C63FF" fill-rule="nonzero" points="84.2897358 4.85637801 84.5075106 6.8707949 91.2040857 3.47713762 85.3894985 3.60417292"></polygon>
                            <polygon id="Shape" fill="#000000" fill-rule="nonzero" opacity="0.2" points="84.2897358 4.85637801 84.5075106 6.8707949 91.2040857 3.47713762 85.3894985 3.60417292"></polygon>
                            <polygon id="Shape" fill="#6C63FF" fill-rule="nonzero" points="84.140923 2.58789052 91.2040857 3.47713762 84.2897358 4.85637801"></polygon>
                            <polygon id="Shape" fill="#6C63FF" fill-rule="nonzero" points="85.3350548 7.53863761 91.1641603 3.45536014 84.4058824 5.46251787"></polygon>
                            <polygon id="Shape" fill="url(#linearGradient-7)" fill-rule="nonzero" points="154.819734 0.304884718 155.193581 0.0254070598 155.095582 0.0290366398 155.120989 0 155.066545 0.0290366398 143.528111 0.504511617 144.413728 4.19942403 145.335641 7.44789811 145.970818 6.97242314 146.863695 8.32625647"></polygon>
                            <polygon id="Shape" fill="#6C63FF" fill-rule="nonzero" points="144.780316 4.06149999 145.626008 7.03775558 154.837882 0.195997319 146.112372 1.89101117"></polygon>
                            <polygon id="Shape" fill="#000000" fill-rule="nonzero" opacity="0.2" points="144.780316 4.06149999 145.626008 7.03775558 154.837882 0.195997319 146.112372 1.89101117"></polygon>
                            <polygon id="Shape" fill="#6C63FF" fill-rule="nonzero" points="143.970919 0.682361036 154.837882 0.195997319 144.780316 4.06149999"></polygon>
                            <polygon id="Shape" fill="#6C63FF" fill-rule="nonzero" points="147.045174 7.83263359 154.772549 0.174219839 145.110607 4.94711751"></polygon>
                            <polygon id="Shape" fill="url(#linearGradient-8)" fill-rule="nonzero" points="124.189708 21.2003766 124.487334 21.1314146 124.425631 21.1096371 124.451038 21.0987484 124.407483 21.0987484 117.369728 18.3547859 116.930549 20.8011228 116.629293 22.9897596 117.133805 22.873613 117.311654 23.918932"></polygon>
                            <polygon id="Shape" fill="#6C63FF" fill-rule="nonzero" points="117.184619 20.8156412 116.908771 22.8191693 124.226004 21.1423034 118.552971 19.8646912"></polygon>
                            <polygon id="Shape" fill="#000000" fill-rule="nonzero" opacity="0.2" points="117.184619 20.8156412 116.908771 22.8191693 124.226004 21.1423034 118.552971 19.8646912"></polygon>
                            <polygon id="Shape" fill="#6C63FF" fill-rule="nonzero" points="117.587503 18.5761903 124.226004 21.1423034 117.184619 20.8156412"></polygon>
                            <polygon id="Shape" fill="#6C63FF" fill-rule="nonzero" points="117.551207 23.668491 124.193338 21.1096371 117.148323 21.4326698"></polygon>
                            <g id="Group" opacity="0.5" stroke-width="1" fill="none" fill-rule="evenodd" transform="translate(75.495264, 45.732708)">
                                <polygon id="Shape" fill="url(#linearGradient-9)" fill-rule="nonzero" points="7.30634449 1.31753753 7.57493341 1.17598391 7.51323055 1.16872475 7.53137845 1.15420643 7.49145307 1.16509517 0 0.195997319 0.163331099 2.67863002 0.399253797 4.87452591 0.860210455 4.63860321 1.28487131 5.61133064"></polygon>
                                <polygon id="Shape" fill="#6C63FF" fill-rule="nonzero" points="0.413772117 2.63144548 0.631546916 4.64223279 7.32812197 1.24857551 1.51353485 1.37561081"></polygon>
                                <polygon id="Shape" fill="#000000" fill-rule="nonzero" opacity="0.2" points="0.413772117 2.63144548 0.631546916 4.64223279 7.32812197 1.24857551 1.51353485 1.37561081"></polygon>
                                <polygon id="Shape" fill="#6C63FF" fill-rule="nonzero" points="0.264959338 0.359328418 7.32812197 1.24857551 0.413772117 2.63144548"></polygon>
                                <polygon id="Shape" fill="#6C63FF" fill-rule="nonzero" points="1.45909115 5.31007551 7.28819659 1.22679803 0.529918677 3.23758534"></polygon>
                            </g>
                            <g id="Group" opacity="0.2" stroke-width="1" fill="none" fill-rule="evenodd" transform="translate(152.442359, 13.429446)">
                                <polygon id="Shape" fill="url(#linearGradient-10)" fill-rule="nonzero" points="11.5565826 0.446438337 11.9304294 0.163331099 11.8324307 0.166960679 11.8614674 0.141553619 11.8033941 0.170590259 0.268588918 0.642435656 1.15420643 4.33734807 2.07249017 7.58945173 2.70766666 7.11397675 3.60417292 8.46781009"></polygon>
                                <polygon id="Shape" fill="#6C63FF" fill-rule="nonzero" points="1.51716443 4.20305361 2.36285656 7.17567961 11.5747305 0.337550938 2.84922028 2.03256479"></polygon>
                                <polygon id="Shape" fill="#000000" fill-rule="nonzero" points="1.51716443 4.20305361 2.36285656 7.17567961 11.5747305 0.337550938 2.84922028 2.03256479"></polygon>
                                <polygon id="Shape" fill="#6C63FF" fill-rule="nonzero" points="0.707768095 0.823914655 11.5747305 0.337550938 1.51716443 4.20305361"></polygon>
                                <polygon id="Shape" fill="#6C63FF" fill-rule="nonzero" points="3.78202234 7.97418721 11.5093981 0.315773458 1.84745621 5.08867113"></polygon>
                            </g>
                            <g id="Group" opacity="0.3" stroke-width="1" fill="none" fill-rule="evenodd" transform="translate(183.293789, 53.717784)">
                                <polygon id="Shape" fill="url(#linearGradient-11)" fill-rule="nonzero" points="11.4404361 0.468215817 11.8106532 0.188738159 11.7126546 0.192367739 11.7416912 0.163331099 11.6836179 0.192367739 0.148812779 0.667842716 1.03443029 4.36275513 1.95634361 7.61485879 2.58789052 7.13575423 3.48439678 8.49321715"></polygon>
                                <polygon id="Shape" fill="#6C63FF" fill-rule="nonzero" points="1.39738829 4.22483109 2.24308043 7.20108667 11.458584 0.359328418 2.72944414 2.05434227"></polygon>
                                <polygon id="Shape" fill="#000000" fill-rule="nonzero" opacity="0.2" points="1.39738829 4.22483109 2.24308043 7.20108667 11.458584 0.359328418 2.72944414 2.05434227"></polygon>
                                <polygon id="Shape" fill="#6C63FF" fill-rule="nonzero" points="0.587991956 0.845692135 11.458584 0.359328418 1.39738829 4.22483109"></polygon>
                                <polygon id="Shape" fill="#6C63FF" fill-rule="nonzero" points="3.6622462 7.99596469 11.389622 0.341180518 1.72768007 5.11044861"></polygon>
                            </g>
                            <g id="Group" opacity="0.3" stroke-width="1" fill="none" fill-rule="evenodd" transform="translate(278.388784, 73.680474)">
                                <polygon id="Shape" fill="url(#linearGradient-12)" fill-rule="nonzero" points="11.3351783 0.464586237 11.709025 0.181478999 11.6110263 0.185108579 11.640063 0.159701519 11.5819897 0.185108579 0.0471845397 0.660583556 0.932802054 4.35549597 1.85108579 7.60759963 2.48626228 7.13212465 3.37913896 8.48595799"></polygon>
                                <polygon id="Shape" fill="#6C63FF" fill-rule="nonzero" points="1.29576005 4.22120151 2.14145219 7.19382751 11.3533262 0.352069258 2.6278159 2.04708311"></polygon>
                                <polygon id="Shape" fill="#000000" fill-rule="nonzero" opacity="0.2" points="1.29576005 4.22120151 2.14145219 7.19382751 11.3533262 0.352069258 2.6278159 2.04708311"></polygon>
                                <polygon id="Shape" fill="#6C63FF" fill-rule="nonzero" points="0.486363717 0.842062555 11.3533262 0.352069258 1.29576005 4.22120151"></polygon>
                                <polygon id="Shape" fill="#6C63FF" fill-rule="nonzero" points="3.56061796 7.99233511 11.2879937 0.333921358 1.62605183 5.10318945"></polygon>
                            </g>
                            <g id="Group" opacity="0.5" stroke-width="1" fill="none" fill-rule="evenodd" transform="translate(117.598391, 50.451162)">
                                <polygon id="Shape" fill="url(#linearGradient-13)" fill-rule="nonzero" points="7.78907863 3.0815134 8.08670419 3.0089218 8.02500133 2.98714432 8.05040839 2.97625558 8.00685343 2.97988516 0.969097854 0.232293119 0.529918677 2.67863002 0.228663539 4.87089633 0.729545575 4.75112019 0.911024574 5.79643922"></polygon>
                                <polygon id="Shape" fill="#6C63FF" fill-rule="nonzero" points="0.783989275 2.69314834 0.508141197 4.69667649 7.82537443 3.01981054 2.15234093 1.74219839"></polygon>
                                <polygon id="Shape" fill="#000000" fill-rule="nonzero" opacity="0.2" points="0.783989275 2.69314834 0.508141197 4.69667649 7.82537443 3.01981054 2.15234093 1.74219839"></polygon>
                                <polygon id="Shape" fill="#6C63FF" fill-rule="nonzero" points="1.18687265 0.453697497 7.82537443 3.01981054 0.783989275 2.69314834"></polygon>
                                <polygon id="Shape" fill="#6C63FF" fill-rule="nonzero" points="1.15057685 5.54962778 7.79270821 2.9907739 0.747693475 3.31017694"></polygon>
                            </g>
                            <g id="Group" opacity="0.5" stroke-width="1" fill="none" fill-rule="evenodd" transform="translate(248.263270, 97.998659)">
                                <polygon id="Shape" fill="url(#linearGradient-14)" fill-rule="nonzero" points="7.63663627 3.0270697 7.93426183 2.95810768 7.87618855 2.93270062 7.89796603 2.92544146 7.85441107 2.92544146 0.820285075 0.181478999 0.377476318 2.6278159 0.0762211795 4.81645263 0.580732796 4.69667649 0.762211795 5.7456251"></polygon>
                                <polygon id="Shape" fill="#6C63FF" fill-rule="nonzero" points="0.631546916 2.64233422 0.359328418 4.64586237 7.67656165 2.96899642 1.99989857 1.69138427"></polygon>
                                <polygon id="Shape" fill="#000000" fill-rule="nonzero" opacity="0.2" points="0.631546916 2.64233422 0.359328418 4.64586237 7.67656165 2.96899642 1.99989857 1.69138427"></polygon>
                                <polygon id="Shape" fill="#6C63FF" fill-rule="nonzero" points="1.03443029 0.402883377 7.67656165 2.96899642 0.631546916 2.64233422"></polygon>
                                <polygon id="Shape" fill="#6C63FF" fill-rule="nonzero" points="0.998134494 5.49518408 7.64026585 2.9363302 0.598880696 3.25936282"></polygon>
                            </g>
                            <g id="Group" opacity="0.5" stroke-width="1" fill="none" fill-rule="evenodd" transform="translate(240.278194, 47.547498)">
                                <polygon id="Shape" fill="url(#linearGradient-15)" fill-rule="nonzero" points="7.64026585 3.1904008 7.93789141 3.1178092 7.87618855 3.09603172 7.90159561 3.08514298 7.85804065 3.08877256 0.820285075 0.341180518 0.381105898 2.78751742 0.0798507595 4.97978373 0.584362376 4.86000759 0.765841375 5.90532662"></polygon>
                                <polygon id="Shape" fill="#6C63FF" fill-rule="nonzero" points="0.635176496 2.80203574 0.359328418 4.80556389 7.68019123 3.12869794 2.00352815 1.85108579"></polygon>
                                <polygon id="Shape" fill="#000000" fill-rule="nonzero" opacity="0.2" points="0.635176496 2.80203574 0.359328418 4.80556389 7.68019123 3.12869794 2.00352815 1.85108579"></polygon>
                                <polygon id="Shape" fill="#6C63FF" fill-rule="nonzero" points="1.03805987 0.566214476 7.68019123 3.12869794 0.635176496 2.80203574"></polygon>
                                <polygon id="Shape" fill="#6C63FF" fill-rule="nonzero" points="1.00176407 5.65851518 7.64389543 3.0996613 0.598880696 3.41906434"></polygon>
                            </g>
                            <g id="Group" opacity="0.2" stroke-width="1" fill="none" fill-rule="evenodd" transform="translate(61.339902, 19.236774)">
                                <polygon id="Shape" fill="url(#linearGradient-16)" fill-rule="nonzero" points="7.77093073 3.16136416 8.06855629 3.09240214 8.00685343 3.06699508 8.03226049 3.05973592 7.98870553 3.05973592 0.950949954 0.315773458 0.511770777 2.76211036 0.206886059 4.95074709 0.715027255 4.83097095 0.892876674 5.87991956"></polygon>
                                <polygon id="Shape" fill="#6C63FF" fill-rule="nonzero" points="0.765841375 2.77662868 0.489993297 4.78015683 7.80722653 3.10329088 2.13419303 1.82567873"></polygon>
                                <polygon id="Shape" fill="#000000" fill-rule="nonzero" points="0.765841375 2.77662868 0.489993297 4.78015683 7.80722653 3.10329088 2.13419303 1.82567873"></polygon>
                                <polygon id="Shape" fill="#6C63FF" fill-rule="nonzero" points="1.16872475 0.537177837 7.80722653 3.10329088 0.765841375 2.77662868"></polygon>
                                <polygon id="Shape" fill="#6C63FF" fill-rule="nonzero" points="1.13242895 5.62947854 7.77456031 3.07062466 0.729545575 3.39365728"></polygon>
                            </g>
                            <polygon id="Shape" fill="url(#linearGradient-17)" fill-rule="nonzero" points="211.176222 13.4984079 211.589994 13.2842627 211.491996 13.2697444 211.524662 13.2479669 211.462959 13.2661148 200.011634 11.7852462 200.262075 15.5781573 200.621404 18.9391483 201.325542 18.5725607 201.978867 20.0606885"></polygon>
                            <polygon id="Shape" fill="#6C63FF" fill-rule="nonzero" points="200.643181 15.5055657 200.973473 18.5798199 211.208888 13.3931501 202.323677 13.5891474"></polygon>
                            <polygon id="Shape" fill="#000000" fill-rule="nonzero" opacity="0.2" points="200.643181 15.5055657 200.973473 18.5798199 211.208888 13.3931501 202.323677 13.5891474"></polygon>
                            <polygon id="Shape" fill="#6C63FF" fill-rule="nonzero" points="200.414518 12.0356872 211.208888 13.3931501 200.643181 15.5055657"></polygon>
                            <polygon id="Shape" fill="#6C63FF" fill-rule="nonzero" points="202.240196 19.6033615 211.150815 13.3604839 200.821031 16.4311086"></polygon>
                            <polygon id="Shape" fill="url(#linearGradient-18)" fill-rule="nonzero" points="237.835487 72.1487908 238.902584 72.2141232 238.724734 72.0761992 238.815474 72.06894 238.670291 72.0326442 217.909093 55.7031639 213.952851 63.4414284 210.718895 70.4682952 212.530056 70.5771826 212.072728 74.2648359"></polygon>
                            <polygon id="Shape" fill="#6C63FF" fill-rule="nonzero" points="214.787654 63.7463131 211.836806 70.1742993 238.027855 71.9854597 220.337282 61.9533006"></polygon>
                            <polygon id="Shape" fill="#000000" fill-rule="nonzero" opacity="0.2" points="214.787654 63.7463131 211.836806 70.1742993 238.027855 71.9854597 220.337282 61.9533006"></polygon>
                            <polygon id="Shape" fill="#6C63FF" fill-rule="nonzero" points="218.406346 56.6686322 238.027855 71.9854597 214.787654 63.7463131"></polygon>
                            <polygon id="Shape" fill="#6C63FF" fill-rule="nonzero" points="213.118047 73.6732144 237.944375 71.8511652 214.04722 65.7752483"></polygon>
                            <polygon id="Shape" fill="url(#linearGradient-19)" fill-rule="nonzero" points="325.108738 133.960538 327.340929 134.033129 326.963453 133.753652 327.144932 133.731874 326.843677 133.666542 282.475691 100.895064 274.70839 117.300766 268.40381 132.167525 272.185832 132.287301 271.467175 140.007418"></polygon>
                            <polygon id="Shape" fill="#6C63FF" fill-rule="nonzero" points="276.472366 117.885128 270.715852 131.488794 325.500732 133.612098 287.938209 113.787332"></polygon>
                            <polygon id="Shape" fill="#000000" fill-rule="nonzero" opacity="0.2" points="276.472366 117.885128 270.715852 131.488794 325.500732 133.612098 287.938209 113.787332"></polygon>
                            <polygon id="Shape" fill="#6C63FF" fill-rule="nonzero" points="283.575454 102.880444 325.500732 133.612098 276.472366 117.885128"></polygon>
                            <polygon id="Shape" fill="#6C63FF" fill-rule="nonzero" points="273.615887 138.708028 325.315624 133.33262 275.05683 122.168032"></polygon>
                            <polygon id="Shape" fill="url(#linearGradient-20)" fill-rule="nonzero" points="287.125183 9.1538007 288.097911 8.71099194 287.876506 8.67106656 287.952727 8.62388202 287.807544 8.66017782 261.819752 3.93446469 261.943157 12.6273087 262.367818 20.3474253 264.019277 19.5997319 265.340444 23.0732399"></polygon>
                            <polygon id="Shape" fill="#6C63FF" fill-rule="nonzero" points="262.825145 12.503903 263.220769 19.5670657 287.219552 8.917878 266.890275 8.32262689"></polygon>
                            <polygon id="Shape" fill="#000000" fill-rule="nonzero" opacity="0.2" points="262.825145 12.503903 263.220769 19.5670657 287.219552 8.917878 266.890275 8.32262689"></polygon>
                            <polygon id="Shape" fill="#6C63FF" fill-rule="nonzero" points="262.712628 4.55512287 287.219552 8.917878 262.825145 12.503903"></polygon>
                            <polygon id="Shape" fill="#6C63FF" fill-rule="nonzero" points="265.990139 22.0605871 287.081628 8.83802724 263.119141 14.6453552"></polygon>
                            <polygon id="Shape" fill="url(#linearGradient-21)" fill-rule="nonzero" points="175.145382 36.5607591 175.562783 36.3466139 175.464785 36.3357251 175.493821 36.3139477 175.432119 36.3320956 163.984423 34.8512269 164.234864 38.6405084 164.590563 42.0014995 165.294702 41.6385415 165.948026 43.1266693"></polygon>
                            <polygon id="Shape" fill="#6C63FF" fill-rule="nonzero" points="164.61597 38.5715464 164.946262 41.6421711 175.181678 36.4591309 166.296466 36.6551282"></polygon>
                            <polygon id="Shape" fill="#000000" fill-rule="nonzero" opacity="0.2" points="164.61597 38.5715464 164.946262 41.6421711 175.181678 36.4591309 166.296466 36.6551282"></polygon>
                            <polygon id="Shape" fill="#6C63FF" fill-rule="nonzero" points="164.387307 35.101668 175.181678 36.4591309 164.61597 38.5715464"></polygon>
                            <polygon id="Shape" fill="#6C63FF" fill-rule="nonzero" points="166.209356 42.6693422 175.119975 36.4264646 164.79019 39.4970893"></polygon>
                            <polygon id="Shape" fill="url(#linearGradient-22)" fill-rule="nonzero" points="244.194511 31.3740893 244.608283 31.1599441 244.513914 31.1454258 244.542951 31.1236483 244.481248 31.1417962 233.033553 29.6609276 233.280364 33.4538386 233.639693 36.8148297 234.343831 36.4518717 234.997156 37.9363699"></polygon>
                            <polygon id="Shape" fill="#6C63FF" fill-rule="nonzero" points="233.6651 33.381247 233.995392 36.4555013 244.230807 31.2688315 235.345595 31.4648288"></polygon>
                            <polygon id="Shape" fill="#000000" fill-rule="nonzero" opacity="0.2" points="233.6651 33.381247 233.995392 36.4555013 244.230807 31.2688315 235.345595 31.4648288"></polygon>
                            <polygon id="Shape" fill="#6C63FF" fill-rule="nonzero" points="233.436436 29.9149982 244.230807 31.2688315 233.6651 33.381247"></polygon>
                            <polygon id="Shape" fill="#6C63FF" fill-rule="nonzero" points="235.258485 37.4790428 244.169104 31.2361653 233.83932 34.3104195"></polygon>
                        </g>
                    </g>
                </g>
                <g id="Group-23" transform="translate(238.000000, 50.000000)" fill-rule="nonzero">
                    <polygon id="Shape" fill="url(#linearGradient-17)" points="11.8072092 2.24453282 12.2209814 2.0303876 12.1229827 2.01586928 12.1556489 1.9940918 12.0939461 2.0122397 0.642621241 0.531371068 0.89306226 4.32428214 1.25239068 7.6852732 1.95652919 7.31868562 2.60985359 8.80681341"></polygon>
                    <polygon id="Shape" fill="#6C63FF" points="1.27416816 4.25169054 1.60445993 7.32594478 11.8398755 2.139275 2.95466369 2.33527232"></polygon>
                    <polygon id="Shape" fill="#000000" opacity="0.2" points="1.27416816 4.25169054 1.60445993 7.32594478 11.8398755 2.139275 2.95466369 2.33527232"></polygon>
                    <polygon id="Shape" fill="#6C63FF" points="1.04550462 0.781812086 11.8398755 2.139275 1.27416816 4.25169054"></polygon>
                    <polygon id="Shape" fill="#6C63FF" points="2.87118335 8.34948634 11.7818022 2.10660878 1.45201758 5.17723344"></polygon>
                </g>
                <g id="Group-22" transform="translate(249.000000, 94.000000)" fill-rule="nonzero">
                    <polygon id="Shape" fill="url(#linearGradient-18)" points="27.4664742 16.8949157 28.5335707 16.9602481 28.3557213 16.8223241 28.4464608 16.8150649 28.3012776 16.7787691 7.54008011 0.449288787 3.58383793 8.1875533 0.349882173 15.2144201 2.16104258 15.3233075 1.7037155 19.0109608"></polygon>
                    <polygon id="Shape" fill="#6C63FF" points="4.41864133 8.49243802 1.46779281 14.9204242 27.6588419 16.7315846 9.96826911 6.69942551"></polygon>
                    <polygon id="Shape" fill="#000000" opacity="0.2" points="4.41864133 8.49243802 1.46779281 14.9204242 27.6588419 16.7315846 9.96826911 6.69942551"></polygon>
                    <polygon id="Shape" fill="#5965EA" points="8.03733256 1.41475706 27.6588419 16.7315846 4.41864133 8.49243802"></polygon>
                    <polygon id="Shape" fill="#606CF2" points="2.74903454 18.4193393 27.5753616 16.5972901 3.67820701 10.5213732"></polygon>
                </g>
                <g id="Group-21" transform="translate(270.000000, 25.000000)" fill-rule="nonzero">
                    <polygon id="Shape" fill="url(#linearGradient-20)" points="25.7561703 5.89992558 26.7288977 5.45711683 26.5074933 5.41719145 26.5837145 5.37000691 26.4385313 5.40630271 0.450738666 0.680589578 0.574144385 9.37343362 0.998805242 17.0935502 2.65026413 16.3458568 3.97143124 19.8193648"></polygon>
                    <polygon id="Shape" fill="#6C63FF" points="1.45613232 9.2500279 1.85175654 16.3131905 25.8505393 5.66400289 5.52126189 5.06875177"></polygon>
                    <polygon id="Shape" fill="#000000" opacity="0.2" points="1.45613232 9.2500279 1.85175654 16.3131905 25.8505393 5.66400289 5.52126189 5.06875177"></polygon>
                    <polygon id="Shape" fill="#6C63FF" points="1.34361534 1.30124775 25.8505393 5.66400289 1.45613232 9.2500279"></polygon>
                    <polygon id="Shape" fill="#6C63FF" points="4.62112606 18.806712 25.7126153 5.58415213 1.7501283 11.3914801"></polygon>
                </g>
                <g id="Group-20" transform="translate(309.465582, 91.775078) rotate(14.000000) translate(-309.465582, -91.775078) translate(298.465582, 83.775078)" fill-rule="nonzero">
                    <polygon id="Shape" fill="url(#linearGradient-23)" points="20.2759284 4.65343231 21.0288264 4.31476815 20.8580949 4.2839805 20.9140724 4.24479622 20.8049162 4.27278499 0.764954253 0.628646663 0.860116083 7.33195795 1.18758473 13.2851701 2.46107394 12.7114002 3.4798653 15.387127"></polygon>
                    <polygon id="Shape" fill="#6C63FF" points="1.54024328 7.239595 1.84252204 12.6862104 20.3486992 4.47430416 4.67218705 4.01528827"></polygon>
                    <polygon id="Shape" fill="#000000" opacity="0.2" points="1.54024328 7.239595 1.84252204 12.6862104 20.3486992 4.47430416 4.67218705 4.01528827"></polygon>
                    <polygon id="Shape" fill="#626CDD" points="1.45067921 1.11005357 20.3486992 4.47430416 1.54024328 7.239595"></polygon>
                    <polygon id="Shape" fill="#626CDD" points="3.98086434 14.6062402 20.2423418 4.41272886 1.76695235 8.88813377"></polygon>
                </g>
                <g id="Group-25" transform="translate(202.000000, 68.000000)" fill-rule="nonzero">
                    <g id="Group-24" transform="translate(0.000000, 5.000000)">
                        <polygon id="Shape" fill="url(#linearGradient-21)" points="11.7763688 2.30688399 12.1937705 2.09273877 12.0957719 2.08185003 12.1248085 2.06007255 12.0631056 2.07822045 0.615410391 0.59735182 0.86585141 4.38663332 1.22155025 7.74762437 1.92568876 7.38466638 2.57901316 8.87279417"></polygon>
                        <polygon id="Shape" fill="#6C63FF" points="1.24695731 4.3176713 1.57724909 7.38829596 11.8126646 2.20525575 2.92745284 2.40125307"></polygon>
                        <polygon id="Shape" fill="#000000" opacity="0.2" points="1.24695731 4.3176713 1.57724909 7.38829596 11.8126646 2.20525575 2.92745284 2.40125307"></polygon>
                        <polygon id="Shape" fill="#6C63FF" points="1.01829377 0.847792839 11.8126646 2.20525575 1.24695731 4.3176713"></polygon>
                        <polygon id="Shape" fill="#6C63FF" points="2.84034292 8.41546709 11.7509618 2.17258953 1.42117715 5.24321419"></polygon>
                    </g>
                    <polygon id="Shape" fill="url(#linearGradient-22)" points="80.8254983 2.1202142 81.2392704 1.90606898 81.1449013 1.89155066 81.173938 1.86977318 81.1122351 1.88792108 69.6645399 0.407052454 69.9113513 4.19996353 70.2706797 7.56095459 70.9748182 7.19799659 71.6281426 8.6824948"></polygon>
                    <polygon id="Shape" fill="#6C63FF" points="70.2960868 4.12737193 70.6263786 7.20162617 80.8617941 2.01495638 71.9765823 2.2109537"></polygon>
                    <polygon id="Shape" fill="#000000" opacity="0.2" points="70.2960868 4.12737193 70.6263786 7.20162617 80.8617941 2.01495638 71.9765823 2.2109537"></polygon>
                    <polygon id="Shape" fill="#6C63FF" points="70.0674232 0.661123052 80.8617941 2.01495638 70.2960868 4.12737193"></polygon>
                    <polygon id="Shape" fill="#6C63FF" points="71.8894724 8.22516772 80.8000912 1.98229016 70.4703066 5.0565444"></polygon>
                </g>
            </g>
        </g>
    </g>
</svg>