<?xml version="1.0" encoding="UTF-8"?>
<svg width="60px" height="61px" viewBox="0 0 60 61" version="1.1" xmlns="http://www.w3.org/2000/svg" xmlns:xlink="http://www.w3.org/1999/xlink">
    <!-- Generator: Sketch 49.3 (51167) - http://www.bohemiancoding.com/sketch -->
    <title>Group</title>
    <desc>Created with Sketch.</desc>
    <defs></defs>
    <g id="Page-1" stroke="none" stroke-width="1" fill="none" fill-rule="evenodd">
        <g id="Artboard" transform="translate(-279.000000, -263.000000)">
            <g id="Group" transform="translate(279.000000, 263.000000)">
                <circle id="Oval" fill="#EAF7FF" cx="30" cy="30.5" r="30"></circle>
                <path d="M58.2566494,40.6020922 C55.1609748,49.2601429 48.1989612,56.0797808 39.4504419,58.9811723 C39.4674447,58.6313177 39.3347469,58.2830795 39.0735569,58.0276985 L19.6867623,39.0720831 C18.7686708,38.176812 18.7686708,36.7177595 19.7012983,35.8058745 C20.1615657,35.3582025 20.7623194,35.1331933 21.3655041,35.1331933 L21.3649522,35.1327991 C21.9681617,35.1327991 22.568903,35.3578205 23.0267395,35.8078451 L35.9554035,48.4489583 C36.4592667,48.9416151 37.2780366,48.9416151 37.7818997,48.4489583 C38.0338375,48.2002348 38.1598002,47.8781191 38.1598002,47.5536265 C38.1598002,47.2291097 38.0338313,46.9069879 37.7843245,46.6606595 L32.5058849,41.499617 C31.5877934,40.6043458 31.5877934,39.1452934 32.5204209,38.2334084 C33.4361186,37.3380766 34.9307163,37.3380766 35.846414,38.2334084 L41.1248536,43.3944509 C41.6287168,43.8871077 42.4474867,43.8871077 42.9513499,43.3944509 C43.2032877,43.1457274 43.3292504,42.8236117 43.3292504,42.4991191 C43.3292504,42.1770156 43.2008629,41.852523 42.965886,41.6180365 L40.2697064,38.9818223 C39.3516087,38.0865512 39.3516087,36.6274987 40.2842362,35.7156137 C41.1999339,34.8202819 42.6945316,34.8202819 43.6102293,35.7156137 L46.3064089,38.3518279 C46.3112522,38.3541987 46.3088336,38.3541987 46.3088336,38.3541987 L46.3112522,38.3565695 L46.3136769,38.3589343 L46.3161017,38.3589343 C46.3185202,38.3589343 46.3185202,38.3613051 46.3185202,38.3613051 C46.8248019,38.8279072 47.6217554,38.8208008 48.1183505,38.3352504 C48.6222137,37.8425936 48.6222137,37.0420338 48.1183505,36.549377 L48.0069177,36.4404225 C47.5611801,36.0045804 47.3165166,35.4266712 47.3165166,34.8132301 C47.3165166,34.199789 47.5587492,33.6242385 48.0190104,33.1742139 C48.9371266,32.2813015 50.4268872,32.2836662 51.3038262,33.1315817 L58.2566494,40.6020922 Z" id="Combined-Shape" fill="#626CDD"></path>
                <path d="M33.9999995,8.5 C29.038273,8.5 25,12.5377811 25,17.5012342 C25,22.4622806 29.0383347,26.5 33.9999995,26.5 C38.964133,26.5 42.9999989,22.4622189 42.9999989,17.5012342 C43.0024122,12.5377811 38.9640713,8.5 33.9999995,8.5 Z M37.4837806,20.9823779 C37.2306302,21.2306679 36.9027431,21.3584353 36.5724242,21.3584353 C36.2421053,21.3584353 35.9142429,21.2330869 35.6610678,20.9823779 L33.0885813,18.4102441 C32.8523113,18.1691868 32.7148857,17.8437514 32.7148857,17.5014194 L32.7148857,13.6444528 C32.7148857,12.9333516 33.2910967,12.3572134 33.9998945,12.3572134 C34.7086862,12.3572134 35.2849034,12.9333454 35.2849034,13.6420461 L35.2849034,16.9662575 L37.4812686,19.1623217 C37.9851563,19.6661403 37.9851563,20.4785038 37.4836819,20.9823162 L37.4837806,20.9823779 Z" id="Fill-1" fill="#3A7DE3"></path>
                <path d="M17.2805042,48.4993829 C17.1038685,48.4993829 16.9272329,48.4635763 16.7553697,48.3872033 C12.6521628,46.5325958 10,42.4367803 10,37.9568694 C10,31.641232 15.1415973,26.5 21.4575466,26.5 C25.9379053,26.5 30.0339016,29.1517612 31.8860521,33.2549702 C32.1772632,33.8970437 31.8908246,34.6513029 31.2487071,34.9400771 C30.6089788,35.231271 29.8522919,34.9448493 29.5635006,34.3027696 C28.1241273,31.1115274 24.9399073,29.0469079 21.4570577,29.0469079 C16.5422288,29.0469079 12.5464478,33.044897 12.5464478,37.9569916 C12.5464478,41.4393911 14.6111893,44.623362 17.8050031,46.0654 C18.4447314,46.3565939 18.7287563,47.1084334 18.4423482,47.7505069 C18.2251315,48.2207151 17.762045,48.5 17.2799114,48.5 L17.2805042,48.4993829 Z" id="Fill-3" fill="#A9C6E8"></path>
            </g>
        </g>
    </g>
</svg>