<svg id="Component_37_1" data-name="Component 37 – 1" xmlns="http://www.w3.org/2000/svg" xmlns:xlink="http://www.w3.org/1999/xlink" width="24" height="24" viewBox="0 0 24 24">
  <defs>
    <clipPath id="clip-path">
      <rect id="Rectangle_1818" data-name="Rectangle 1818" width="24" height="24" fill="none"/>
    </clipPath>
  </defs>
  <g id="Group_2113" data-name="Group 2113" clip-path="url(#clip-path)">
    <path id="Path_2209" data-name="Path 2209" d="M5.737,11.994a2,2,0,1,1-2-2,2,2,0,0,1,2,2" fill="#333"/>
    <path id="Path_2210" data-name="Path 2210" d="M14,11.994a2,2,0,1,1-2-2,2,2,0,0,1,2,2" fill="#333"/>
    <path id="Path_2211" data-name="Path 2211" d="M22.255,11.994a2,2,0,1,1-2-2,2,2,0,0,1,2,2" fill="#333"/>
  </g>
</svg>
