// Jest Snapshot v1, https://goo.gl/fbAQLP

exports[`it matches the snapshot: Initial state 1`] = `
<DocumentFragment>
  <button
    class="btn-link"
    data-testid="add-assignment-modal"
  >
    + Add Task
  </button>
</DocumentFragment>
`;
