// Jest Snapshot v1, https://goo.gl/fbAQLP

exports[`Integrated Inbox - Message Field renders the component 1`] = `
Object {
  "asFragment": [Function],
  "baseElement": <body>
    <div>
      <div
        class="MessageFieldstyles__MessageContainer-sc-rou8ed-0 hTONvk"
      >
        <div
          class="MessageFieldstyles__MessageTextContainer-sc-rou8ed-1 crqFrY"
        >
          <textarea
            class="MessageFieldstyles__MessageTextarea-sc-rou8ed-2 grLNtx scrollbar"
            placeholder="Message ..."
          />
        </div>
        <div
          class="MessageFieldstyles__MessageTextBar-sc-rou8ed-3 hXRkfa"
        >
          <div
            class="MessageFieldstyles__SendMessageButtonContainer-sc-rou8ed-4 gZHOYR"
          >
            <span
              class="MessageFieldstyles__NotifyText-sc-rou8ed-6 jacafZ"
            >
              0 person will be notified
            </span>
            <button
              class="MessageFieldstyles__SendMessageButton-sc-rou8ed-5 ixaCiz"
            >
              <i
                class="Iconstyle__Icon-sc-kciifn-0 cgMbuw icon"
                role="img"
              >
                <svg
                  aria-hidden="true"
                  height="24"
                  viewBox="0 0 24 24"
                  width="24"
                >
                  <defs>
                    <clippath
                      id="clipPath"
                    >
                      <rect
                        data-name="Rectangle 1907"
                        fill="none"
                        height="24"
                        id="Rectangle_1907"
                        width="24"
                      />
                    </clippath>
                  </defs>
                  <g
                    clip-path="url(#clipPath)"
                    data-name="Group 2265"
                    id="Group_2265"
                  >
                    <path
                      d="M21.8,11.327,5.3,4.868a.731.731,0,0,0-.781.164.718.718,0,0,0-.158.77L6.8,11.931,4.356,18.066a.718.718,0,0,0,.156.766.726.726,0,0,0,.518.216A.743.743,0,0,0,5.291,19l16.5-6.333a.718.718,0,0,0,0-1.34M5.523,17.84l2.159-5.408h6.64v-1H7.682l-2.155-5.4,15.227,5.962Z"
                      data-name="Path 2333"
                      fill="#333"
                      id="Path_2333"
                    />
                  </g>
                </svg>
              </i>
            </button>
          </div>
        </div>
      </div>
    </div>
  </body>,
  "container": <div>
    <div
      class="MessageFieldstyles__MessageContainer-sc-rou8ed-0 hTONvk"
    >
      <div
        class="MessageFieldstyles__MessageTextContainer-sc-rou8ed-1 crqFrY"
      >
        <textarea
          class="MessageFieldstyles__MessageTextarea-sc-rou8ed-2 grLNtx scrollbar"
          placeholder="Message ..."
        />
      </div>
      <div
        class="MessageFieldstyles__MessageTextBar-sc-rou8ed-3 hXRkfa"
      >
        <div
          class="MessageFieldstyles__SendMessageButtonContainer-sc-rou8ed-4 gZHOYR"
        >
          <span
            class="MessageFieldstyles__NotifyText-sc-rou8ed-6 jacafZ"
          >
            0 person will be notified
          </span>
          <button
            class="MessageFieldstyles__SendMessageButton-sc-rou8ed-5 ixaCiz"
          >
            <i
              class="Iconstyle__Icon-sc-kciifn-0 cgMbuw icon"
              role="img"
            >
              <svg
                aria-hidden="true"
                height="24"
                viewBox="0 0 24 24"
                width="24"
              >
                <defs>
                  <clippath
                    id="clipPath"
                  >
                    <rect
                      data-name="Rectangle 1907"
                      fill="none"
                      height="24"
                      id="Rectangle_1907"
                      width="24"
                    />
                  </clippath>
                </defs>
                <g
                  clip-path="url(#clipPath)"
                  data-name="Group 2265"
                  id="Group_2265"
                >
                  <path
                    d="M21.8,11.327,5.3,4.868a.731.731,0,0,0-.781.164.718.718,0,0,0-.158.77L6.8,11.931,4.356,18.066a.718.718,0,0,0,.156.766.726.726,0,0,0,.518.216A.743.743,0,0,0,5.291,19l16.5-6.333a.718.718,0,0,0,0-1.34M5.523,17.84l2.159-5.408h6.64v-1H7.682l-2.155-5.4,15.227,5.962Z"
                    data-name="Path 2333"
                    fill="#333"
                    id="Path_2333"
                  />
                </g>
              </svg>
            </i>
          </button>
        </div>
      </div>
    </div>
  </div>,
  "debug": [Function],
  "findAllByAltText": [Function],
  "findAllByDisplayValue": [Function],
  "findAllByLabelText": [Function],
  "findAllByPlaceholderText": [Function],
  "findAllByRole": [Function],
  "findAllByTestId": [Function],
  "findAllByText": [Function],
  "findAllByTitle": [Function],
  "findByAltText": [Function],
  "findByDisplayValue": [Function],
  "findByLabelText": [Function],
  "findByPlaceholderText": [Function],
  "findByRole": [Function],
  "findByTestId": [Function],
  "findByText": [Function],
  "findByTitle": [Function],
  "getAllByAltText": [Function],
  "getAllByDisplayValue": [Function],
  "getAllByLabelText": [Function],
  "getAllByPlaceholderText": [Function],
  "getAllByRole": [Function],
  "getAllByTestId": [Function],
  "getAllByText": [Function],
  "getAllByTitle": [Function],
  "getByAltText": [Function],
  "getByDisplayValue": [Function],
  "getByLabelText": [Function],
  "getByPlaceholderText": [Function],
  "getByRole": [Function],
  "getByTestId": [Function],
  "getByText": [Function],
  "getByTitle": [Function],
  "queryAllByAltText": [Function],
  "queryAllByDisplayValue": [Function],
  "queryAllByLabelText": [Function],
  "queryAllByPlaceholderText": [Function],
  "queryAllByRole": [Function],
  "queryAllByTestId": [Function],
  "queryAllByText": [Function],
  "queryAllByTitle": [Function],
  "queryByAltText": [Function],
  "queryByDisplayValue": [Function],
  "queryByLabelText": [Function],
  "queryByPlaceholderText": [Function],
  "queryByRole": [Function],
  "queryByTestId": [Function],
  "queryByText": [Function],
  "queryByTitle": [Function],
  "rerender": [Function],
  "unmount": [Function],
}
`;
