// Jest Snapshot v1, https://goo.gl/fbAQLP

exports[`Matches the snapshot 1`] = `
<DocumentFragment>
  <a
    class="ListContentstyle__BackLink-sc-1wxjiul-10 kUTrkF"
  >
    <i
      class="Iconstyle__Icon-sc-kciifn-0 cgMbuw icon"
      role="img"
    >
      <svg
        aria-hidden="true"
        height="32"
        viewBox="0 0 24 24"
        width="32"
      >
        <g
          data-name="Group 3026"
          id="Group_3026"
          transform="translate(632 -416) rotate(90)"
        >
          <rect
            class="cls-1"
            data-name="Rectangle 1876"
            fill="none"
            height="24"
            id="Rectangle_1876"
            transform="translate(416 608)"
            width="24"
          />
          <path
            class="cls-2"
            d="M12.014,17.257,4.589,9.832,5.3,9.125l6.718,6.718,6.718-6.718.707.707Z"
            data-name="Path 2254"
            fill="#333"
            id="Path_2254"
            transform="translate(415.986 606.744)"
          />
        </g>
      </svg>
    </i>
     My Listname
  </a>
  <table
    class="ListContentstyle__ListTable-sc-1wxjiul-0 kVAYWK"
  >
    <thead
      class="ListContentstyle__ListTableHead-sc-1wxjiul-1 gZLUZX"
    >
      <tr>
        <th
          class="ListContentstyle__ListTableTh-sc-1wxjiul-3 cPRsJd"
        >
          <div
            class="d-flex"
          >
            <div
              class="Checkboxstyle__CheckboxContainer-sc-ricret-0 igXKXh"
            >
              <input
                class="Checkboxstyle__HiddenCheckbox-sc-ricret-1 jMWsZB"
                type="checkbox"
              />
              <div
                class="Checkboxstyle__Checkbox-sc-ricret-3 kZMcBq"
              >
                <svg
                  class="Checkboxstyle__Icon-sc-ricret-2 hPJaoW"
                  viewBox="0 0 24 24"
                >
                  <polyline
                    points="20 6 9 17 4 12"
                  />
                </svg>
              </div>
            </div>
            <div
              class="Dropdownstyle__Wrapper-sc-1xblfu0-2 hEkjWo ListContentstyle__CustomDropdown-sc-1wxjiul-11 fgIvA-D"
            >
              <div
                class="Dropdownstyle__DropdownWrapper-sc-1xblfu0-3 bKgbqC left"
              >
                <button
                  aria-expanded="false"
                  aria-haspopup="true"
                  class="Dropdownstyle__Button-sc-1xblfu0-6 jOlVhD"
                  disabled=""
                >
                   
                  <i
                    class="Iconstyle__Icon-sc-kciifn-0 cgMbuw icon"
                    role="img"
                  >
                    <svg
                      aria-hidden="true"
                      height="16"
                      viewBox="0 0 16 16"
                      width="16"
                    >
                      <rect
                        data-name="Rectangle 1918"
                        fill="none"
                        id="Rectangle_1918"
                      />
                      <g
                        data-name="Group 2277"
                        id="Group_2277"
                        transform="translate(-499.913 -683.627)"
                      >
                        <path
                          d="M9.982,15.031,4.589,9.639,5.1,9.125,9.982,14l4.879-4.879.514.514Z"
                          data-name="Path 2346"
                          id="Path_2346"
                          transform="translate(497.93 679.549)"
                        />
                      </g>
                    </svg>
                  </i>
                </button>
                <div
                  class="Dropdownstyle__DropdownMenu-sc-1xblfu0-0 cpRPfO"
                >
                  <div
                    class="Dropdownstyle__DropdownItem-sc-1xblfu0-1 jqcbKc"
                  >
                    <a>
                      Delete
                    </a>
                  </div>
                </div>
              </div>
            </div>
          </div>
        </th>
        <th
          class="ListContentstyle__ListTableTh-sc-1wxjiul-3 cPRsJd"
        />
      </tr>
    </thead>
    <tbody
      class="ListContentstyle__ListTableBody-sc-1wxjiul-2 gEiOVl"
    >
      <tr
        class="ListContentstyle__ListTableTr-sc-1wxjiul-4 gQjLND"
      >
        <td
          class="ListContentstyle__ListTableTd-sc-1wxjiul-5 ljfBCf"
          width="30"
        >
          <div
            class="Checkboxstyle__CheckboxContainer-sc-ricret-0 igXKXh"
          >
            <input
              class="Checkboxstyle__HiddenCheckbox-sc-ricret-1 jMWsZB"
              type="checkbox"
            />
            <div
              class="Checkboxstyle__Checkbox-sc-ricret-3 kZMcBq"
            >
              <svg
                class="Checkboxstyle__Icon-sc-ricret-2 hPJaoW"
                viewBox="0 0 24 24"
              >
                <polyline
                  points="20 6 9 17 4 12"
                />
              </svg>
            </div>
          </div>
        </td>
        <td
          class="ListContentstyle__ListTableTd-sc-1wxjiul-5 ljfBCf"
        >
          <div
            class="ListContentstyle__InfluencerWrapper-sc-1wxjiul-6 klnBYN"
          >
            <figure
              aria-label="Avatar of: kalle_anka"
              class="Avatarstyle__FallbackAvatar-sc-1sy440j-1 dBAoRq avatar"
              name="kalle_anka"
              title="kalle_anka"
            >
              <figcaption>
                <span>
                  k
                </span>
              </figcaption>
            </figure>
            <div
              class="ListContentstyle__InfluencerData-sc-1wxjiul-7 cjvMvt"
            >
              <div
                class="ListContentstyle__Username-sc-1wxjiul-8 eEQjUa"
              >
                <span>
                  kalle_anka
                </span>
              </div>
              <div
                class="ListContentstyle__Followers-sc-1wxjiul-9 fYhndR"
              >
                <span>
                  0 followers
                </span>
              </div>
            </div>
          </div>
        </td>
      </tr>
    </tbody>
  </table>
</DocumentFragment>
`;
