// Jest Snapshot v1, https://goo.gl/fbAQLP

exports[`<MainNavigation /> test renders main navigation 1`] = `
Object {
  "asFragment": [Function],
  "baseElement": <body>
    <div>
      <div>
        <button
          class="MainNavigationstyle__hamburgerMenu-sc-6xls7u-5 iYMljX"
        >
          <span />
          <span />
          <span />
        </button>
        <div
          class="MainNavigationstyle__Wrapper-sc-6xls7u-0 icEmaW"
        >
          <ul
            class="MainNavigationstyle__MenuList-sc-6xls7u-1 ljYxzq"
          >
            <li
              class="MainNavigationstyle__MenuItem-sc-6xls7u-3 ftUTbu"
            >
              <div
                class="MainNavigationstyle__MenuItemRow-sc-6xls7u-4 gOrxZj"
              >
                <a
                  class="MenuLinkstyle__MenuItemLink-sc-hpc7b2-0 fACQNy"
                  href="/mocked-url-1"
                  tabindex="0"
                >
                  
                  <span>
                    Mocked menu item 1
                  </span>
                </a>
              </div>
            </li>
            <li
              class="MainNavigationstyle__MenuItem-sc-6xls7u-3 ftUTbu"
            >
              <div
                class="MainNavigationstyle__MenuItemRow-sc-6xls7u-4 gOrxZj"
              >
                <a
                  class="MenuLinkstyle__MenuItemLink-sc-hpc7b2-0 fACQNy"
                  href="/mocked-url-2"
                  tabindex="0"
                >
                  <i
                    class="Iconstyle__Icon-sc-kciifn-0 cgMbuw icon"
                    role="img"
                  >
                    <svg
                      aria-hidden="true"
                      height="32"
                      viewBox="0 0 32 32"
                      width="32"
                    >
                      <defs>
                        <clippath
                          id="clipPath"
                        >
                          <rect
                            data-name="Rectangle 1814"
                            fill="none"
                            height="32"
                            id="Rectangle_1814"
                            width="32"
                          />
                        </clippath>
                      </defs>
                      <rect
                        data-name="Rectangle 1806"
                        height="1.313"
                        id="Rectangle_1806"
                        transform="translate(2.834 9.51)"
                        width="25.84"
                      />
                      <rect
                        data-name="Rectangle 1807"
                        height="1.313"
                        id="Rectangle_1807"
                        transform="translate(7.22 20.742)"
                        width="13.128"
                      />
                      <rect
                        data-name="Rectangle 1808"
                        height="1.313"
                        id="Rectangle_1808"
                        transform="translate(7.22 15.798)"
                        width="17.068"
                      />
                      <g
                        data-name="Group 2104"
                        id="Group_2104"
                      >
                        <g
                          clip-path="url(#clipPath)"
                          data-name="Group 2103"
                          id="Group_2103"
                        >
                          <path
                            d="M28.631,4.82a1.611,1.611,0,0,0-.553-1.109,1.276,1.276,0,0,0-.915-.315H23.985V4.7h3.232a.238.238,0,0,1,.1.168l0,21.728c-.012.14-.083.21-.163.214l-23.979,0a.234.234,0,0,1-.1-.164l0-21.73a.285.285,0,0,1,.1-.219l.028,0H6.373V3.4H3.267a1.316,1.316,0,0,0-.944.314,1.643,1.643,0,0,0-.555,1.163V26.708a1.627,1.627,0,0,0,.555,1.109,1.318,1.318,0,0,0,.815.315.862.862,0,0,0,.1-.005l23.854,0a1.3,1.3,0,0,0,.979-.3,1.643,1.643,0,0,0,.561-1.164Z"
                            data-name="Path 2201"
                            id="Path_2201"
                            transform="translate(0.553 1.06)"
                          />
                          <rect
                            data-name="Rectangle 1809"
                            height="1.311"
                            id="Rectangle_1809"
                            transform="translate(10.865 4.455)"
                            width="9.735"
                          />
                          <path
                            d="M9.215,6.527V4.393H7.9v.822H6.589V4.393H5.276V6.527Z"
                            data-name="Path 2202"
                            id="Path_2202"
                            transform="translate(1.651 1.374)"
                          />
                          <path
                            d="M6.589,3.078H7.9V3.9H9.215V1.765H5.276V3.9H6.589Z"
                            data-name="Path 2203"
                            id="Path_2203"
                            transform="translate(1.651 0.552)"
                          />
                          <rect
                            data-name="Rectangle 1810"
                            height="1.312"
                            id="Rectangle_1810"
                            transform="translate(6.927 4.456)"
                            width="1.313"
                          />
                          <rect
                            data-name="Rectangle 1811"
                            height="1.312"
                            id="Rectangle_1811"
                            transform="translate(9.553 4.456)"
                            width="1.313"
                          />
                          <path
                            d="M17,3.078h1.313V3.9H19.63V1.765H15.691V3.9H17Z"
                            data-name="Path 2204"
                            id="Path_2204"
                            transform="translate(4.909 0.552)"
                          />
                          <path
                            d="M18.317,5.215H17V4.392H15.691V6.528H19.63V4.391H18.317Z"
                            data-name="Path 2205"
                            id="Path_2205"
                            transform="translate(4.909 1.373)"
                          />
                          <rect
                            data-name="Rectangle 1812"
                            height="1.31"
                            id="Rectangle_1812"
                            transform="translate(20.6 4.455)"
                            width="1.313"
                          />
                          <rect
                            data-name="Rectangle 1813"
                            height="1.31"
                            id="Rectangle_1813"
                            transform="translate(23.226 4.455)"
                            width="1.313"
                          />
                        </g>
                      </g>
                    </svg>
                  </i>
                  <span>
                    Mocked menu item 2
                  </span>
                </a>
              </div>
            </li>
          </ul>
        </div>
      </div>
    </div>
  </body>,
  "container": <div>
    <div>
      <button
        class="MainNavigationstyle__hamburgerMenu-sc-6xls7u-5 iYMljX"
      >
        <span />
        <span />
        <span />
      </button>
      <div
        class="MainNavigationstyle__Wrapper-sc-6xls7u-0 icEmaW"
      >
        <ul
          class="MainNavigationstyle__MenuList-sc-6xls7u-1 ljYxzq"
        >
          <li
            class="MainNavigationstyle__MenuItem-sc-6xls7u-3 ftUTbu"
          >
            <div
              class="MainNavigationstyle__MenuItemRow-sc-6xls7u-4 gOrxZj"
            >
              <a
                class="MenuLinkstyle__MenuItemLink-sc-hpc7b2-0 fACQNy"
                href="/mocked-url-1"
                tabindex="0"
              >
                
                <span>
                  Mocked menu item 1
                </span>
              </a>
            </div>
          </li>
          <li
            class="MainNavigationstyle__MenuItem-sc-6xls7u-3 ftUTbu"
          >
            <div
              class="MainNavigationstyle__MenuItemRow-sc-6xls7u-4 gOrxZj"
            >
              <a
                class="MenuLinkstyle__MenuItemLink-sc-hpc7b2-0 fACQNy"
                href="/mocked-url-2"
                tabindex="0"
              >
                <i
                  class="Iconstyle__Icon-sc-kciifn-0 cgMbuw icon"
                  role="img"
                >
                  <svg
                    aria-hidden="true"
                    height="32"
                    viewBox="0 0 32 32"
                    width="32"
                  >
                    <defs>
                      <clippath
                        id="clipPath"
                      >
                        <rect
                          data-name="Rectangle 1814"
                          fill="none"
                          height="32"
                          id="Rectangle_1814"
                          width="32"
                        />
                      </clippath>
                    </defs>
                    <rect
                      data-name="Rectangle 1806"
                      height="1.313"
                      id="Rectangle_1806"
                      transform="translate(2.834 9.51)"
                      width="25.84"
                    />
                    <rect
                      data-name="Rectangle 1807"
                      height="1.313"
                      id="Rectangle_1807"
                      transform="translate(7.22 20.742)"
                      width="13.128"
                    />
                    <rect
                      data-name="Rectangle 1808"
                      height="1.313"
                      id="Rectangle_1808"
                      transform="translate(7.22 15.798)"
                      width="17.068"
                    />
                    <g
                      data-name="Group 2104"
                      id="Group_2104"
                    >
                      <g
                        clip-path="url(#clipPath)"
                        data-name="Group 2103"
                        id="Group_2103"
                      >
                        <path
                          d="M28.631,4.82a1.611,1.611,0,0,0-.553-1.109,1.276,1.276,0,0,0-.915-.315H23.985V4.7h3.232a.238.238,0,0,1,.1.168l0,21.728c-.012.14-.083.21-.163.214l-23.979,0a.234.234,0,0,1-.1-.164l0-21.73a.285.285,0,0,1,.1-.219l.028,0H6.373V3.4H3.267a1.316,1.316,0,0,0-.944.314,1.643,1.643,0,0,0-.555,1.163V26.708a1.627,1.627,0,0,0,.555,1.109,1.318,1.318,0,0,0,.815.315.862.862,0,0,0,.1-.005l23.854,0a1.3,1.3,0,0,0,.979-.3,1.643,1.643,0,0,0,.561-1.164Z"
                          data-name="Path 2201"
                          id="Path_2201"
                          transform="translate(0.553 1.06)"
                        />
                        <rect
                          data-name="Rectangle 1809"
                          height="1.311"
                          id="Rectangle_1809"
                          transform="translate(10.865 4.455)"
                          width="9.735"
                        />
                        <path
                          d="M9.215,6.527V4.393H7.9v.822H6.589V4.393H5.276V6.527Z"
                          data-name="Path 2202"
                          id="Path_2202"
                          transform="translate(1.651 1.374)"
                        />
                        <path
                          d="M6.589,3.078H7.9V3.9H9.215V1.765H5.276V3.9H6.589Z"
                          data-name="Path 2203"
                          id="Path_2203"
                          transform="translate(1.651 0.552)"
                        />
                        <rect
                          data-name="Rectangle 1810"
                          height="1.312"
                          id="Rectangle_1810"
                          transform="translate(6.927 4.456)"
                          width="1.313"
                        />
                        <rect
                          data-name="Rectangle 1811"
                          height="1.312"
                          id="Rectangle_1811"
                          transform="translate(9.553 4.456)"
                          width="1.313"
                        />
                        <path
                          d="M17,3.078h1.313V3.9H19.63V1.765H15.691V3.9H17Z"
                          data-name="Path 2204"
                          id="Path_2204"
                          transform="translate(4.909 0.552)"
                        />
                        <path
                          d="M18.317,5.215H17V4.392H15.691V6.528H19.63V4.391H18.317Z"
                          data-name="Path 2205"
                          id="Path_2205"
                          transform="translate(4.909 1.373)"
                        />
                        <rect
                          data-name="Rectangle 1812"
                          height="1.31"
                          id="Rectangle_1812"
                          transform="translate(20.6 4.455)"
                          width="1.313"
                        />
                        <rect
                          data-name="Rectangle 1813"
                          height="1.31"
                          id="Rectangle_1813"
                          transform="translate(23.226 4.455)"
                          width="1.313"
                        />
                      </g>
                    </g>
                  </svg>
                </i>
                <span>
                  Mocked menu item 2
                </span>
              </a>
            </div>
          </li>
        </ul>
      </div>
    </div>
  </div>,
  "debug": [Function],
  "findAllByAltText": [Function],
  "findAllByDisplayValue": [Function],
  "findAllByLabelText": [Function],
  "findAllByPlaceholderText": [Function],
  "findAllByRole": [Function],
  "findAllByTestId": [Function],
  "findAllByText": [Function],
  "findAllByTitle": [Function],
  "findByAltText": [Function],
  "findByDisplayValue": [Function],
  "findByLabelText": [Function],
  "findByPlaceholderText": [Function],
  "findByRole": [Function],
  "findByTestId": [Function],
  "findByText": [Function],
  "findByTitle": [Function],
  "getAllByAltText": [Function],
  "getAllByDisplayValue": [Function],
  "getAllByLabelText": [Function],
  "getAllByPlaceholderText": [Function],
  "getAllByRole": [Function],
  "getAllByTestId": [Function],
  "getAllByText": [Function],
  "getAllByTitle": [Function],
  "getByAltText": [Function],
  "getByDisplayValue": [Function],
  "getByLabelText": [Function],
  "getByPlaceholderText": [Function],
  "getByRole": [Function],
  "getByTestId": [Function],
  "getByText": [Function],
  "getByTitle": [Function],
  "queryAllByAltText": [Function],
  "queryAllByDisplayValue": [Function],
  "queryAllByLabelText": [Function],
  "queryAllByPlaceholderText": [Function],
  "queryAllByRole": [Function],
  "queryAllByTestId": [Function],
  "queryAllByText": [Function],
  "queryAllByTitle": [Function],
  "queryByAltText": [Function],
  "queryByDisplayValue": [Function],
  "queryByLabelText": [Function],
  "queryByPlaceholderText": [Function],
  "queryByRole": [Function],
  "queryByTestId": [Function],
  "queryByText": [Function],
  "queryByTitle": [Function],
  "rerender": [Function],
  "unmount": [Function],
}
`;
