<?xml version="1.0" encoding="UTF-8"?>
<svg width="362px" height="313px" viewBox="0 0 362 313" version="1.1" xmlns="http://www.w3.org/2000/svg" xmlns:xlink="http://www.w3.org/1999/xlink">
    <!-- Generator: Sketch 49.3 (51167) - http://www.bohemiancoding.com/sketch -->
    <title>undraw_taken_yju1</title>
    <desc>Created with Sketch.</desc>
    <defs>
        <linearGradient x1="50%" y1="100.004407%" x2="50%" y2="-3.13124773e-15%" id="linearGradient-1">
            <stop stop-color="#808080" stop-opacity="0.25" offset="0%"></stop>
            <stop stop-color="#808080" stop-opacity="0.12" offset="54%"></stop>
            <stop stop-color="#808080" stop-opacity="0.1" offset="100%"></stop>
        </linearGradient>
        <linearGradient x1="45355%" y1="191601%" x2="45355%" y2="173058%" id="linearGradient-2">
            <stop stop-color="#808080" stop-opacity="0.25" offset="0%"></stop>
            <stop stop-color="#808080" stop-opacity="0.12" offset="54%"></stop>
            <stop stop-color="#808080" stop-opacity="0.1" offset="100%"></stop>
        </linearGradient>
        <linearGradient x1="49.4998976%" y1="26856%" x2="50.5001024%" y2="24903%" id="linearGradient-3">
            <stop stop-color="#808080" stop-opacity="0.25" offset="0%"></stop>
            <stop stop-color="#808080" stop-opacity="0.12" offset="54%"></stop>
            <stop stop-color="#808080" stop-opacity="0.1" offset="100%"></stop>
        </linearGradient>
        <linearGradient x1="46.5845126%" y1="25809%" x2="53.4154874%" y2="10327%" id="linearGradient-4">
            <stop stop-color="#808080" stop-opacity="0.25" offset="0%"></stop>
            <stop stop-color="#808080" stop-opacity="0.12" offset="54%"></stop>
            <stop stop-color="#808080" stop-opacity="0.1" offset="100%"></stop>
        </linearGradient>
        <path d="M142.415429,80.7570455 L142.415429,75.0930455 L143.791429,75.0930455 L143.791429,79.5650455 L145.983429,79.5650455 L145.983429,80.7570455 L142.415429,80.7570455 Z M152.452,80.7570455 L152.452,75.0930455 L153.828,75.0930455 L153.828,80.7570455 L152.452,80.7570455 Z M163.816572,76.5650455 C163.699238,76.4157114 163.545906,76.2970459 163.356572,76.2090455 C163.167237,76.121045 162.984573,76.0770455 162.808572,76.0770455 C162.717905,76.0770455 162.625906,76.0850454 162.532572,76.1010455 C162.439238,76.1170455 162.355239,76.1477119 162.280572,76.1930455 C162.205905,76.238379 162.143239,76.2970451 162.092572,76.3690455 C162.041905,76.4410458 162.016572,76.5330449 162.016572,76.6450455 C162.016572,76.7410459 162.036572,76.8210451 162.076572,76.8850455 C162.116572,76.9490458 162.175238,77.0050452 162.252572,77.0530455 C162.329905,77.1010457 162.421905,77.1450453 162.528572,77.1850455 C162.635239,77.2250457 162.755238,77.2663786 162.888572,77.3090455 C163.080573,77.3730458 163.280571,77.4437117 163.488572,77.5210455 C163.696573,77.5983792 163.885904,77.7010448 164.056572,77.8290455 C164.227239,77.9570461 164.368571,78.1157112 164.480572,78.3050455 C164.592572,78.4943797 164.648572,78.7303774 164.648572,79.0130455 C164.648572,79.3383804 164.588572,79.6197109 164.468572,79.8570455 C164.348571,80.09438 164.187239,80.290378 163.984572,80.4450455 C163.781904,80.5997129 163.549906,80.7143784 163.288572,80.7890455 C163.027237,80.8637125 162.757906,80.9010455 162.480572,80.9010455 C162.075236,80.9010455 161.68324,80.8303795 161.304572,80.6890455 C160.925903,80.5477114 160.61124,80.3463801 160.360572,80.0850455 L161.256572,79.1730455 C161.395239,79.343713 161.577904,79.4863782 161.804572,79.6010455 C162.03124,79.7157127 162.256571,79.7730455 162.480572,79.7730455 C162.581906,79.7730455 162.680571,79.7623789 162.776572,79.7410455 C162.872572,79.719712 162.956571,79.6850457 163.028572,79.6370455 C163.100572,79.5890452 163.157905,79.5250459 163.200572,79.4450455 C163.243239,79.3650451 163.264572,79.269046 163.264572,79.1570455 C163.264572,79.0503783 163.237905,78.9597125 163.184572,78.8850455 C163.131238,78.8103784 163.055239,78.7423791 162.956572,78.6810455 C162.857905,78.6197118 162.735239,78.5637124 162.588572,78.5130455 C162.441904,78.4623785 162.275239,78.4077124 162.088572,78.3490455 C161.907237,78.2903785 161.729906,78.2210459 161.556572,78.1410455 C161.383238,78.0610451 161.228572,77.9583794 161.092572,77.8330455 C160.956571,77.7077115 160.847239,77.555713 160.764572,77.3770455 C160.681905,77.1983779 160.640572,76.9810467 160.640572,76.7250455 C160.640572,76.4103772 160.704571,76.1410466 160.832572,75.9170455 C160.960572,75.6930443 161.128571,75.5090462 161.336572,75.3650455 C161.544573,75.2210447 161.779237,75.1157125 162.040572,75.0490455 C162.301906,74.9823785 162.565904,74.9490455 162.832572,74.9490455 C163.152573,74.9490455 163.479237,75.0077115 163.812572,75.1250455 C164.145907,75.2423794 164.437904,75.415711 164.688572,75.6450455 L163.816572,76.5650455 Z M173.701143,76.2610455 L173.701143,80.7570455 L172.333143,80.7570455 L172.333143,76.2610455 L170.733143,76.2610455 L170.733143,75.0930455 L175.301143,75.0930455 L175.301143,76.2610455 L173.701143,76.2610455 Z M185.113714,80.7570455 L184.673714,79.6450455 L182.481714,79.6450455 L182.065714,80.7570455 L180.577714,80.7570455 L182.953714,75.0930455 L184.281714,75.0930455 L186.633714,80.7570455 L185.113714,80.7570455 Z M183.593714,76.6050455 L182.873714,78.5490455 L184.297714,78.5490455 L183.593714,76.6050455 Z M195.926286,76.5650455 C195.808952,76.4157114 195.65562,76.2970459 195.466286,76.2090455 C195.276951,76.121045 195.094287,76.0770455 194.918286,76.0770455 C194.827619,76.0770455 194.735619,76.0850454 194.642286,76.1010455 C194.548952,76.1170455 194.464953,76.1477119 194.390286,76.1930455 C194.315619,76.238379 194.252953,76.2970451 194.202286,76.3690455 C194.151619,76.4410458 194.126286,76.5330449 194.126286,76.6450455 C194.126286,76.7410459 194.146285,76.8210451 194.186286,76.8850455 C194.226286,76.9490458 194.284952,77.0050452 194.362286,77.0530455 C194.439619,77.1010457 194.531618,77.1450453 194.638286,77.1850455 C194.744953,77.2250457 194.864952,77.2663786 194.998286,77.3090455 C195.190287,77.3730458 195.390285,77.4437117 195.598286,77.5210455 C195.806287,77.5983792 195.995618,77.7010448 196.166286,77.8290455 C196.336953,77.9570461 196.478285,78.1157112 196.590286,78.3050455 C196.702286,78.4943797 196.758286,78.7303774 196.758286,79.0130455 C196.758286,79.3383804 196.698286,79.6197109 196.578286,79.8570455 C196.458285,80.09438 196.296953,80.290378 196.094286,80.4450455 C195.891618,80.5997129 195.65962,80.7143784 195.398286,80.7890455 C195.136951,80.8637125 194.86762,80.9010455 194.590286,80.9010455 C194.18495,80.9010455 193.792954,80.8303795 193.414286,80.6890455 C193.035617,80.5477114 192.720954,80.3463801 192.470286,80.0850455 L193.366286,79.1730455 C193.504953,79.343713 193.687618,79.4863782 193.914286,79.6010455 C194.140953,79.7157127 194.366285,79.7730455 194.590286,79.7730455 C194.691619,79.7730455 194.790285,79.7623789 194.886286,79.7410455 C194.982286,79.719712 195.066285,79.6850457 195.138286,79.6370455 C195.210286,79.5890452 195.267619,79.5250459 195.310286,79.4450455 C195.352953,79.3650451 195.374286,79.269046 195.374286,79.1570455 C195.374286,79.0503783 195.347619,78.9597125 195.294286,78.8850455 C195.240952,78.8103784 195.164953,78.7423791 195.066286,78.6810455 C194.967618,78.6197118 194.844953,78.5637124 194.698286,78.5130455 C194.551618,78.4623785 194.384953,78.4077124 194.198286,78.3490455 C194.016951,78.2903785 193.83962,78.2210459 193.666286,78.1410455 C193.492951,78.0610451 193.338286,77.9583794 193.202286,77.8330455 C193.066285,77.7077115 192.956953,77.555713 192.874286,77.3770455 C192.791619,77.1983779 192.750286,76.9810467 192.750286,76.7250455 C192.750286,76.4103772 192.814285,76.1410466 192.942286,75.9170455 C193.070286,75.6930443 193.238285,75.5090462 193.446286,75.3650455 C193.654287,75.2210447 193.888951,75.1157125 194.150286,75.0490455 C194.41162,74.9823785 194.675618,74.9490455 194.942286,74.9490455 C195.262287,74.9490455 195.588951,75.0077115 195.922286,75.1250455 C196.255621,75.2423794 196.547618,75.415711 196.798286,75.6450455 L195.926286,76.5650455 Z M207.066857,80.7570455 L207.066857,78.3890455 L204.858857,78.3890455 L204.858857,80.7570455 L203.490857,80.7570455 L203.490857,75.0930455 L204.858857,75.0930455 L204.858857,77.2370455 L207.066857,77.2370455 L207.066857,75.0930455 L208.434857,75.0930455 L208.434857,80.7570455 L207.066857,80.7570455 Z M215.431428,80.7570455 L215.431428,75.0930455 L216.807428,75.0930455 L216.807428,80.7570455 L215.431428,80.7570455 Z M228.1,76.8370455 C228.1,77.1677138 228.038667,77.4463777 227.916,77.6730455 C227.793332,77.8997133 227.628001,78.0823781 227.42,78.2210455 C227.211999,78.3597128 226.972001,78.4610451 226.7,78.5250455 C226.427998,78.5890458 226.145334,78.6210455 225.852,78.6210455 L225.172,78.6210455 L225.172,80.7570455 L223.804,80.7570455 L223.804,75.0930455 L225.884,75.0930455 C226.193334,75.0930455 226.482665,75.1237118 226.752,75.1850455 C227.021334,75.2463791 227.255999,75.3450448 227.456,75.4810455 C227.656001,75.6170461 227.813332,75.795711 227.928,76.0170455 C228.042667,76.2383799 228.1,76.5117105 228.1,76.8370455 Z M226.732,76.8450455 C226.732,76.7117115 226.705333,76.6023792 226.652,76.5170455 C226.598666,76.4317117 226.526667,76.3650457 226.436,76.3170455 C226.345332,76.2690452 226.242667,76.2370455 226.128,76.2210455 C226.013332,76.2050454 225.894667,76.1970455 225.772,76.1970455 L225.172,76.1970455 L225.172,77.5330455 L225.748,77.5330455 C225.876,77.5330455 225.998666,77.5223789 226.116,77.5010455 C226.233334,77.479712 226.338666,77.4423791 226.432,77.3890455 C226.525333,77.3357119 226.598666,77.2650459 226.652,77.1770455 C226.705333,77.089045 226.732,76.9783795 226.732,76.8450455 Z" id="path-5"></path>
        <filter x="-1.2%" y="-16.8%" width="102.3%" height="133.6%" filterUnits="objectBoundingBox" id="filter-6">
            <feGaussianBlur stdDeviation="0.5" in="SourceAlpha" result="shadowBlurInner1"></feGaussianBlur>
            <feOffset dx="0" dy="1" in="shadowBlurInner1" result="shadowOffsetInner1"></feOffset>
            <feComposite in="shadowOffsetInner1" in2="SourceAlpha" operator="arithmetic" k2="-1" k3="1" result="shadowInnerInner1"></feComposite>
            <feColorMatrix values="0 0 0 0 0   0 0 0 0 0   0 0 0 0 0  0 0 0 0.15 0" type="matrix" in="shadowInnerInner1"></feColorMatrix>
        </filter>
    </defs>
    <g id="Page-1" stroke="none" stroke-width="1" fill="none" fill-rule="evenodd">
        <g id="Artboard" transform="translate(-752.000000, -792.000000)">
            <g id="undraw_taken_yju1" transform="translate(752.500000, 792.242955)">
                <g id="Group" opacity="0.8" transform="translate(122.431856, 7.732538)" fill="url(#linearGradient-1)" fill-rule="nonzero">
                    <ellipse id="Oval" cx="63.1490628" cy="49.105914" rx="62.9170866" ry="48.7407664"></ellipse>
                </g>
                <ellipse id="Oval" fill="#4A80F7" fill-rule="nonzero" cx="185.580919" cy="56.8384523" rx="61.5209339" ry="47.658211"></ellipse>
                <path d="M134.004889,62.1352411 C134.004889,35.8145399 161.549908,14.47703 195.525823,14.47703 C206.072917,14.4193163 216.514798,16.5750121 226.176745,20.8048239 C215.364079,13.501871 201.21783,9.05995737 185.73557,9.05995737 C151.759656,9.05995737 124.214636,30.3974672 124.214636,56.7181684 C124.214636,74.3913143 136.633952,89.822024 155.080351,98.0485856 C142.167012,89.3151132 134.004889,76.4662121 134.004889,62.1352411 Z" id="Shape" fill="#FFFFFF" fill-rule="nonzero" opacity="0.1"></path>
                <polygon id="Shape" fill="#77A6F5" fill-rule="nonzero" opacity="0.2" points="185.580919 75.993668 253.781907 194.121078 321.982895 312.244192 185.580919 312.244192 49.1789436 312.244192 117.379931 194.121078"></polygon>
                <g id="Group" opacity="0.3" transform="translate(146.488642, 192.024701)" fill="url(#linearGradient-2)" fill-rule="nonzero">
                    <path d="M55.2747613,51.2151787 L60.57155,35.4966466 C64.3125602,24.2583973 60.2665556,11.8954118 50.6051673,5.04333331 L50.6481258,5.01755818 C48.5633577,3.55300823 46.2789628,2.39562006 43.8649714,1.5808745 L43.7919419,1.55939522 L43.7103207,1.52932424 C41.3656278,0.738554745 38.922078,0.278762523 36.4503264,0.163242475 C35.5711081,0.123147832 34.6947538,0.123147832 33.8212633,0.163242475 C32.3056366,0.2429076 30.7995273,0.451291051 29.3192077,0.786141394 C28.898214,0.880650195 28.4800841,0.986614609 28.0648182,1.10403463 C27.6495522,1.22145466 27.2371502,1.34603444 26.827612,1.47777399 C26.0113997,1.74698087 25.2095068,2.05485045 24.4219335,2.40138273 C24.0295787,2.57321691 23.6400879,2.75507476 23.253461,2.94695626 C22.0985885,3.52003731 20.9860099,4.17466421 19.9241737,4.90586596 C19.5690497,5.14929773 19.2210855,5.4013212 18.880281,5.66193638 C14.6328712,8.88997761 11.4538626,13.3202343 9.75588582,18.377666 L1.43911129,43.1003093 C0.128367595,46.9841765 -0.26567774,51.1187119 0.287822259,55.1802525 C0.373739351,55.8045833 0.479703765,56.4231864 0.6057155,57.0360617 C0.731727235,57.6489369 0.874922389,58.2560844 1.03530096,58.857504 C1.14699318,59.2584504 1.26870906,59.656533 1.4004486,60.0517516 C1.59805791,60.6445795 1.81571455,61.2288158 2.0534185,61.8044603 C2.21093317,62.1882233 2.37703955,62.5691224 2.55173764,62.9471576 C2.90399772,63.7003641 3.28919268,64.4363872 3.70732253,65.1552269 C4.12545238,65.8740665 4.57651711,66.5728589 5.06051673,67.2516039 C5.42423242,67.7585148 5.80513153,68.25397 6.20321406,68.7379696 C6.73303612,69.3823478 7.29436113,70.0023828 7.88718906,70.5980747 C10.4534467,73.1833937 13.5242156,75.2130257 16.9084837,76.5607209 L17.0545428,76.6208628 C17.2360349,76.2969074 17.4368716,75.9841759 17.6559624,75.6843665 C18.9447188,73.9230661 21.1871549,72.6772683 23.3221947,73.1412206 C23.4768454,73.1755874 23.6314962,73.218546 23.786147,73.2700962 C24.8687023,73.6524273 25.9340743,74.3311723 26.9779669,74.6705448 C27.7465284,75.0158813 28.6282359,75.0048796 29.3879414,74.6404738 C31.4714309,73.5278475 30.698177,70.0181343 32.4938443,68.4759225 C32.5757947,68.4063587 32.6618682,68.3418036 32.7515955,68.282609 L32.6828619,68.1795085 C34.0618312,67.3203376 35.9820782,67.8916863 37.5758403,68.4501474 C39.2941821,69.051567 41.5366182,69.4596732 42.7308658,68.0549287 C43.5384865,67.0926573 43.4826404,65.6277709 44.2473025,64.618245 C45.1408402,63.4583643 46.8248152,63.3294887 48.28111,63.5356897 C49.0500679,63.6559736 53.7969873,69.1203007 57.469943,67.3031542 C51.5502553,62.2770043 54.810809,52.594148 55.2747613,51.2151787 Z" id="Shape"></path>
                </g>
                <path d="M164.621444,266.433199 C165.875834,264.714857 168.028057,263.512018 170.090067,263.980266 C172.152078,264.448514 174.106691,266.411719 175.945317,265.427969 C177.955777,264.354005 177.212594,260.964576 178.952415,259.482506 C180.297018,258.331217 182.333253,258.924045 184.00434,259.503985 C185.675428,260.083926 187.827651,260.479144 188.966053,259.12595 C189.743602,258.198045 189.692052,256.784709 190.430939,255.822438 C191.29011,254.705516 192.931126,254.563752 194.322983,254.778545 C195.066166,254.894533 199.645547,260.174139 203.189627,258.417134 C197.454661,253.537043 200.612114,244.189264 201.0417,242.861845 L206.145175,227.697478 C210.655377,214.16053 203.387114,199.522283 189.876774,194.932995 C176.339826,190.422792 161.701579,197.691055 157.112291,211.201396 L149.066155,235.051981 C144.730114,248.076726 151.287612,262.225333 164.028617,267.335328 C164.207846,267.022935 164.405818,266.721674 164.621444,266.433199 Z" id="Shape" fill="#FFFFFF" fill-rule="nonzero"></path>
                <circle id="Oval" fill="#000000" fill-rule="nonzero" opacity="0.2" transform="translate(174.142094, 208.836876) rotate(-71.400000) translate(-174.142094, -208.836876) " cx="174.142094" cy="208.836876" r="2.79660135"></circle>
                <circle id="Oval" fill="#000000" fill-rule="nonzero" opacity="0.2" transform="translate(190.048384, 214.188586) rotate(-71.400000) translate(-190.048384, -214.188586) " cx="190.048384" cy="214.188586" r="2.79660135"></circle>
                <ellipse id="Oval" fill="#E0E0E0" fill-rule="nonzero" transform="translate(178.527692, 222.116133) rotate(-71.400000) translate(-178.527692, -222.116133) " cx="178.527692" cy="222.116133" rx="4.1927541" ry="2.79660135"></ellipse>
                <circle id="Oval" fill="#FFFFFF" fill-rule="nonzero" transform="translate(237.372442, 209.458377) rotate(-71.400000) translate(-237.372442, -209.458377) " cx="237.372442" cy="209.458377" r="4.1927541"></circle>
                <circle id="Oval" fill="#FFFFFF" fill-rule="nonzero" transform="translate(250.656933, 202.859504) rotate(-71.400000) translate(-250.656933, -202.859504) " cx="250.656933" cy="202.859504" r="2.09637705"></circle>
                <g id="Group" opacity="0.8" transform="translate(143.481544, 106.966780)" fill="url(#linearGradient-3)" fill-rule="nonzero">
                    <rect id="Rectangle-path" x="0.154650766" y="0.0128875638" width="83.8894488" height="8.38980405"></rect>
                </g>
                <rect id="Rectangle-path" fill="#E0E0E0" fill-rule="nonzero" x="143.636195" y="105.583515" width="83.8894488" height="8.38980405"></rect>
                <path d="M244.657512,42.7136824 C245.455571,45.7889247 245.859752,48.953088 245.860351,52.1301957 C245.860351,78.4508969 218.315331,99.7884067 184.339417,99.7884067 C156.53235,99.8055901 133.038321,85.5175777 125.438955,65.9112973 C131.083708,87.7213511 155.939522,104.144403 185.757049,104.144403 C219.732963,104.144403 247.277983,82.8068935 247.277983,56.4861923 C247.270238,51.772183 246.381488,47.1011473 244.657512,42.7136824 Z" id="Shape" fill="#000000" fill-rule="nonzero" opacity="0.1"></path>
                <g id="Group" opacity="0.8" transform="translate(57.994037, 44.247302)" fill="url(#linearGradient-4)" fill-rule="nonzero">
                    <ellipse id="Oval" cx="127.586882" cy="33.3701986" rx="127.234622" ry="33.2542105"></ellipse>
                </g>
                <path d="M185.580919,45.4630293 C117.629091,45.4630293 62.5390514,59.862734 62.5390514,77.6217969 L308.622787,77.6217969 C308.622787,59.8584381 253.532747,45.4630293 185.580919,45.4630293 Z" id="Shape" fill="#FFFFFF" fill-rule="nonzero"></path>
                <path d="M185.580919,109.776269 C253.532747,109.776269 308.622787,95.376564 308.622787,77.6175011 L62.5390514,77.6175011 C62.5390514,95.3808599 117.629091,109.776269 185.580919,109.776269 Z" id="Shape" fill="#FFFFFF" fill-rule="nonzero"></path>
                <path d="M185.580919,109.776269 C253.532747,109.776269 308.622787,95.376564 308.622787,77.6175011 L62.5390514,77.6175011 C62.5390514,95.3808599 117.629091,109.776269 185.580919,109.776269 Z" id="Shape" fill="#000000" fill-rule="nonzero" opacity="0.05"></path>
                <rect id="Rectangle-path" fill="#000000" fill-rule="nonzero" opacity="0.05" x="126.856587" y="69.227697" width="117.448665" height="16.7796081" rx="8.38980405"></rect>
                <path d="M57.5171974,24.8343355 C56.7894977,24.5074788 56.4206182,23.6885661 56.6580264,22.9269761 C56.6763942,22.8698284 56.6879301,22.8107067 56.6923933,22.750846 C56.7149107,22.4017089 56.5052312,22.079305 56.1769571,21.9583097 C55.848683,21.8373144 55.479922,21.9465167 55.2704654,22.2267518 C55.2359064,22.2747833 55.2070723,22.3266848 55.1845483,22.3814025 C54.8576916,23.1091021 54.0387789,23.4779817 53.2771889,23.2405734 C53.2200412,23.2222057 53.1609196,23.2106698 53.1010588,23.2062066 C52.7519217,23.1836891 52.4295178,23.3933687 52.3085225,23.7216428 C52.1875272,24.0499169 52.2967295,24.4186779 52.5769646,24.6281345 C52.6249961,24.6626935 52.6768976,24.6915276 52.7316153,24.7140516 C53.459315,25.0409083 53.8281945,25.859821 53.5907863,26.621411 C53.5724185,26.6785587 53.5608826,26.7376803 53.5564194,26.7975411 C53.533902,27.1466782 53.7435815,27.4690821 54.0718556,27.5900774 C54.4001297,27.7110727 54.7688907,27.6018704 54.9783473,27.3216353 C55.0129063,27.2736037 55.0417404,27.2217023 55.0642644,27.1669846 C55.3911211,26.4392849 56.2100338,26.0704053 56.9716238,26.3078136 C57.0287715,26.3261813 57.0878931,26.3377173 57.1477539,26.3421805 C57.496891,26.3646979 57.8192949,26.1550184 57.9402902,25.8267443 C58.0612855,25.4984701 57.9520832,25.1297092 57.6718481,24.9202526 C57.6238166,24.8856936 57.5719151,24.8568595 57.5171974,24.8343355 Z" id="Shape" fill="#4D8AF0" fill-rule="nonzero" opacity="0.5"></path>
                <path d="M276.176197,156.287487 C275.448497,155.96063 275.079618,155.141717 275.317026,154.380127 C275.335394,154.322979 275.34693,154.263858 275.351393,154.203997 C275.37391,153.85486 275.164231,153.532456 274.835957,153.411461 C274.507683,153.290465 274.138922,153.399668 273.929465,153.679903 C273.894906,153.727934 273.866072,153.779836 273.843548,153.834554 C273.516691,154.562253 272.697779,154.931133 271.936189,154.693724 C271.879041,154.675357 271.819919,154.663821 271.760058,154.659358 C271.410921,154.63684 271.088517,154.84652 270.967522,155.174794 C270.846527,155.503068 270.955729,155.871829 271.235964,156.081286 C271.283996,156.115845 271.335897,156.144679 271.390615,156.167203 C272.118315,156.494059 272.487194,157.312972 272.249786,158.074562 C272.231418,158.13171 272.219882,158.190831 272.215419,158.250692 C272.192902,158.599829 272.402581,158.922233 272.730855,159.043228 C273.059129,159.164224 273.42789,159.055021 273.637347,158.774786 C273.671906,158.726755 273.70074,158.674853 273.723264,158.620136 C274.050121,157.892436 274.869033,157.523556 275.630623,157.760965 C275.687771,157.779332 275.746893,157.790868 275.806754,157.795332 C276.155891,157.817849 276.478295,157.608169 276.59929,157.279895 C276.720285,156.951621 276.611083,156.58286 276.330848,156.373404 C276.282816,156.338845 276.230915,156.310011 276.176197,156.287487 Z" id="Shape" fill="#4D8AF0" fill-rule="nonzero" opacity="0.5"></path>
                <path d="M34.7491679,217.288622 C34.0214683,216.961765 33.6525887,216.142853 33.889997,215.381263 C33.9083647,215.324115 33.9199007,215.264993 33.9243639,215.205133 C33.9468813,214.855995 33.7372018,214.533592 33.4089277,214.412596 C33.0806535,214.291601 32.7118926,214.400803 32.502436,214.681038 C32.467877,214.72907 32.4390428,214.780971 32.4165189,214.835689 C32.0896621,215.563389 31.2707495,215.932268 30.5091594,215.69486 C30.4520118,215.676492 30.3928901,215.664956 30.3330294,215.660493 C29.9838923,215.637976 29.6614884,215.847655 29.5404931,216.175929 C29.4194978,216.504203 29.5287001,216.872964 29.8089351,217.082421 C29.8569667,217.11698 29.9088682,217.145814 29.9635859,217.168338 C30.6912855,217.495195 31.0601651,218.314108 30.8227568,219.075698 C30.8043891,219.132845 30.7928532,219.191967 30.78839,219.251828 C30.7658725,219.600965 30.9755521,219.923369 31.3038262,220.044364 C31.6321003,220.165359 32.0008613,220.056157 32.2103179,219.775922 C32.2448769,219.72789 32.273711,219.675989 32.296235,219.621271 C32.6230917,218.893571 33.4420044,218.524692 34.2035944,218.7621 C34.2607421,218.780468 34.3198637,218.792004 34.3797244,218.796467 C34.7288616,218.818984 35.0512655,218.609305 35.1722608,218.281031 C35.2932561,217.952757 35.1840538,217.583996 34.9038187,217.374539 C34.8557871,217.33998 34.8038857,217.311146 34.7491679,217.288622 Z" id="Shape" fill="#4D8AF0" fill-rule="nonzero" opacity="0.5"></path>
                <path d="M11.1219676,75.0958344 C10.394268,74.7689777 10.0253884,73.950065 10.2627967,73.188475 C10.2811644,73.1313273 10.2927003,73.0722057 10.2971635,73.0123449 C10.319681,72.6632078 10.1100014,72.3408039 9.7817273,72.2198086 C9.45345317,72.0988133 9.08469221,72.2080156 8.87523562,72.4882507 C8.84067663,72.5362823 8.81184248,72.5881837 8.78931853,72.6429015 C8.46246179,73.3706011 7.64354912,73.7394807 6.88195908,73.5020724 C6.82481143,73.4837047 6.76568978,73.4721687 6.70582905,73.4677055 C6.35669192,73.4451881 6.03428802,73.6548676 5.91329273,73.9831417 C5.79229743,74.3114159 5.9014997,74.6801768 6.18173478,74.8896334 C6.22976637,74.9241924 6.28166784,74.9530266 6.33638555,74.9755505 C7.06408517,75.3024072 7.43296475,76.1213199 7.19555647,76.8829099 C7.17718875,76.9400576 7.16565282,76.9991793 7.16118963,77.05904 C7.13867218,77.4081771 7.3483517,77.730581 7.67662583,77.8515763 C8.00489996,77.9725716 8.37366092,77.8633693 8.58311751,77.5831343 C8.6176765,77.5351027 8.64651065,77.4832012 8.6690346,77.4284835 C8.99589134,76.7007839 9.81480402,76.3319043 10.576394,76.5693126 C10.6335417,76.5876803 10.6926634,76.5992162 10.7525241,76.6036794 C11.1016612,76.6261969 11.4240651,76.4165173 11.5450604,76.0882432 C11.6660557,75.7599691 11.5568534,75.3912081 11.2766184,75.1817515 C11.2285868,75.1471925 11.1766853,75.1183584 11.1219676,75.0958344 Z" id="Shape" fill="#4D8AF0" fill-rule="nonzero" opacity="0.5"></path>
                <path d="M271.880342,2.92547699 C271.152643,2.59862025 270.783763,1.77970757 271.021171,1.01811754 C271.039539,0.960969886 271.051075,0.90184824 271.055538,0.841987504 C271.078056,0.49285038 270.868376,0.170446482 270.540102,0.0494511832 C270.211828,-0.0715441155 269.843067,0.0376581555 269.63361,0.317893241 C269.599051,0.365924823 269.570217,0.417826294 269.547693,0.472544007 C269.220837,1.20024363 268.401924,1.56912321 267.640334,1.33171493 C267.583186,1.31334721 267.524065,1.30181128 267.464204,1.29734809 C267.081525,1.21707214 266.697658,1.42865333 266.56119,1.79507346 C266.424723,2.1614936 266.576669,2.57263013 266.91863,2.76223451 C266.966662,2.7967935 267.018563,2.82562765 267.073281,2.84815161 C267.800981,3.17500835 268.16986,3.99392102 267.932452,4.75551105 C267.914084,4.81265871 267.902548,4.87178036 267.898085,4.93164109 C267.860705,5.29579249 268.07825,5.63796635 268.423859,5.75862274 C268.769468,5.87927912 269.152705,5.74684588 269.350084,5.43855194 C269.384643,5.39052035 269.413477,5.33861888 269.436001,5.28390117 C269.762858,4.55620155 270.581771,4.18732197 271.343361,4.42473025 C271.400508,4.44309797 271.45963,4.4546339 271.519491,4.45909708 C271.868628,4.48161454 272.191032,4.27193501 272.312027,3.94366088 C272.433022,3.61538675 272.32382,3.2466258 272.043585,3.03716921 C271.994266,2.99298964 271.939388,2.95544129 271.880342,2.92547699 Z" id="Shape" fill="#4D8AF0" fill-rule="nonzero" opacity="0.5"></path>
                <g id="Group" opacity="0.5" transform="translate(44.247302, 110.403463)" fill="#47E6B1" fill-rule="nonzero">
                    <rect id="Rectangle-path" x="3.00709823" y="0.365147642" width="1.28875638" height="7.30295284"></rect>
                    <rect id="Rectangle-path" transform="translate(3.651476, 4.016624) rotate(90.000000) translate(-3.651476, -4.016624) " x="3.00709823" y="0.365147642" width="1.28875638" height="7.30295284"></rect>
                </g>
                <g id="Group" opacity="0.5" transform="translate(353.548834, 76.036627)" fill="#47E6B1" fill-rule="nonzero">
                    <rect id="Rectangle-path" x="3.00709823" y="0.365147642" width="1.28875638" height="7.30295284"></rect>
                    <rect id="Rectangle-path" transform="translate(3.651476, 4.016624) rotate(90.000000) translate(-3.651476, -4.016624) " x="3.00709823" y="0.365147642" width="1.28875638" height="7.30295284"></rect>
                </g>
                <g id="Group" opacity="0.5" transform="translate(310.590288, 195.890970)" fill="#47E6B1" fill-rule="nonzero">
                    <rect id="Rectangle-path" x="3.00709823" y="0.365147642" width="1.28875638" height="7.30295284"></rect>
                    <rect id="Rectangle-path" transform="translate(3.651476, 4.016624) rotate(90.000000) translate(-3.651476, -4.016624) " x="3.00709823" y="0.365147642" width="1.28875638" height="7.30295284"></rect>
                </g>
                <circle id="Oval" fill="#F55F44" fill-rule="nonzero" opacity="0.5" cx="310.590288" cy="35.16157" r="2.57751277"></circle>
                <circle id="Oval" fill="#F55F44" fill-rule="nonzero" opacity="0.5" cx="2.57751277" cy="5.52017317" r="2.57751277"></circle>
                <circle id="Oval" fill="#F55F44" fill-rule="nonzero" opacity="0.5" cx="79.9028957" cy="153.727157" r="2.57751277"></circle>
                <path d="M142.415429,79.7570455 L142.415429,74.0930455 L143.791429,74.0930455 L143.791429,78.5650455 L145.983429,78.5650455 L145.983429,79.7570455 L142.415429,79.7570455 Z M152.452,79.7570455 L152.452,74.0930455 L153.828,74.0930455 L153.828,79.7570455 L152.452,79.7570455 Z M163.816572,75.5650455 C163.699238,75.4157114 163.545906,75.2970459 163.356572,75.2090455 C163.167237,75.121045 162.984573,75.0770455 162.808572,75.0770455 C162.717905,75.0770455 162.625906,75.0850454 162.532572,75.1010455 C162.439238,75.1170455 162.355239,75.1477119 162.280572,75.1930455 C162.205905,75.238379 162.143239,75.2970451 162.092572,75.3690455 C162.041905,75.4410458 162.016572,75.5330449 162.016572,75.6450455 C162.016572,75.7410459 162.036572,75.8210451 162.076572,75.8850455 C162.116572,75.9490458 162.175238,76.0050452 162.252572,76.0530455 C162.329905,76.1010457 162.421905,76.1450453 162.528572,76.1850455 C162.635239,76.2250457 162.755238,76.2663786 162.888572,76.3090455 C163.080573,76.3730458 163.280571,76.4437117 163.488572,76.5210455 C163.696573,76.5983792 163.885904,76.7010448 164.056572,76.8290455 C164.227239,76.9570461 164.368571,77.1157112 164.480572,77.3050455 C164.592572,77.4943797 164.648572,77.7303774 164.648572,78.0130455 C164.648572,78.3383804 164.588572,78.6197109 164.468572,78.8570455 C164.348571,79.09438 164.187239,79.290378 163.984572,79.4450455 C163.781904,79.5997129 163.549906,79.7143784 163.288572,79.7890455 C163.027237,79.8637125 162.757906,79.9010455 162.480572,79.9010455 C162.075236,79.9010455 161.68324,79.8303795 161.304572,79.6890455 C160.925903,79.5477114 160.61124,79.3463801 160.360572,79.0850455 L161.256572,78.1730455 C161.395239,78.343713 161.577904,78.4863782 161.804572,78.6010455 C162.03124,78.7157127 162.256571,78.7730455 162.480572,78.7730455 C162.581906,78.7730455 162.680571,78.7623789 162.776572,78.7410455 C162.872572,78.719712 162.956571,78.6850457 163.028572,78.6370455 C163.100572,78.5890452 163.157905,78.5250459 163.200572,78.4450455 C163.243239,78.3650451 163.264572,78.269046 163.264572,78.1570455 C163.264572,78.0503783 163.237905,77.9597125 163.184572,77.8850455 C163.131238,77.8103784 163.055239,77.7423791 162.956572,77.6810455 C162.857905,77.6197118 162.735239,77.5637124 162.588572,77.5130455 C162.441904,77.4623785 162.275239,77.4077124 162.088572,77.3490455 C161.907237,77.2903785 161.729906,77.2210459 161.556572,77.1410455 C161.383238,77.0610451 161.228572,76.9583794 161.092572,76.8330455 C160.956571,76.7077115 160.847239,76.555713 160.764572,76.3770455 C160.681905,76.1983779 160.640572,75.9810467 160.640572,75.7250455 C160.640572,75.4103772 160.704571,75.1410466 160.832572,74.9170455 C160.960572,74.6930443 161.128571,74.5090462 161.336572,74.3650455 C161.544573,74.2210447 161.779237,74.1157125 162.040572,74.0490455 C162.301906,73.9823785 162.565904,73.9490455 162.832572,73.9490455 C163.152573,73.9490455 163.479237,74.0077115 163.812572,74.1250455 C164.145907,74.2423794 164.437904,74.415711 164.688572,74.6450455 L163.816572,75.5650455 Z M173.701143,75.2610455 L173.701143,79.7570455 L172.333143,79.7570455 L172.333143,75.2610455 L170.733143,75.2610455 L170.733143,74.0930455 L175.301143,74.0930455 L175.301143,75.2610455 L173.701143,75.2610455 Z M185.113714,79.7570455 L184.673714,78.6450455 L182.481714,78.6450455 L182.065714,79.7570455 L180.577714,79.7570455 L182.953714,74.0930455 L184.281714,74.0930455 L186.633714,79.7570455 L185.113714,79.7570455 Z M183.593714,75.6050455 L182.873714,77.5490455 L184.297714,77.5490455 L183.593714,75.6050455 Z M195.926286,75.5650455 C195.808952,75.4157114 195.65562,75.2970459 195.466286,75.2090455 C195.276951,75.121045 195.094287,75.0770455 194.918286,75.0770455 C194.827619,75.0770455 194.735619,75.0850454 194.642286,75.1010455 C194.548952,75.1170455 194.464953,75.1477119 194.390286,75.1930455 C194.315619,75.238379 194.252953,75.2970451 194.202286,75.3690455 C194.151619,75.4410458 194.126286,75.5330449 194.126286,75.6450455 C194.126286,75.7410459 194.146285,75.8210451 194.186286,75.8850455 C194.226286,75.9490458 194.284952,76.0050452 194.362286,76.0530455 C194.439619,76.1010457 194.531618,76.1450453 194.638286,76.1850455 C194.744953,76.2250457 194.864952,76.2663786 194.998286,76.3090455 C195.190287,76.3730458 195.390285,76.4437117 195.598286,76.5210455 C195.806287,76.5983792 195.995618,76.7010448 196.166286,76.8290455 C196.336953,76.9570461 196.478285,77.1157112 196.590286,77.3050455 C196.702286,77.4943797 196.758286,77.7303774 196.758286,78.0130455 C196.758286,78.3383804 196.698286,78.6197109 196.578286,78.8570455 C196.458285,79.09438 196.296953,79.290378 196.094286,79.4450455 C195.891618,79.5997129 195.65962,79.7143784 195.398286,79.7890455 C195.136951,79.8637125 194.86762,79.9010455 194.590286,79.9010455 C194.18495,79.9010455 193.792954,79.8303795 193.414286,79.6890455 C193.035617,79.5477114 192.720954,79.3463801 192.470286,79.0850455 L193.366286,78.1730455 C193.504953,78.343713 193.687618,78.4863782 193.914286,78.6010455 C194.140953,78.7157127 194.366285,78.7730455 194.590286,78.7730455 C194.691619,78.7730455 194.790285,78.7623789 194.886286,78.7410455 C194.982286,78.719712 195.066285,78.6850457 195.138286,78.6370455 C195.210286,78.5890452 195.267619,78.5250459 195.310286,78.4450455 C195.352953,78.3650451 195.374286,78.269046 195.374286,78.1570455 C195.374286,78.0503783 195.347619,77.9597125 195.294286,77.8850455 C195.240952,77.8103784 195.164953,77.7423791 195.066286,77.6810455 C194.967618,77.6197118 194.844953,77.5637124 194.698286,77.5130455 C194.551618,77.4623785 194.384953,77.4077124 194.198286,77.3490455 C194.016951,77.2903785 193.83962,77.2210459 193.666286,77.1410455 C193.492951,77.0610451 193.338286,76.9583794 193.202286,76.8330455 C193.066285,76.7077115 192.956953,76.555713 192.874286,76.3770455 C192.791619,76.1983779 192.750286,75.9810467 192.750286,75.7250455 C192.750286,75.4103772 192.814285,75.1410466 192.942286,74.9170455 C193.070286,74.6930443 193.238285,74.5090462 193.446286,74.3650455 C193.654287,74.2210447 193.888951,74.1157125 194.150286,74.0490455 C194.41162,73.9823785 194.675618,73.9490455 194.942286,73.9490455 C195.262287,73.9490455 195.588951,74.0077115 195.922286,74.1250455 C196.255621,74.2423794 196.547618,74.415711 196.798286,74.6450455 L195.926286,75.5650455 Z M207.066857,79.7570455 L207.066857,77.3890455 L204.858857,77.3890455 L204.858857,79.7570455 L203.490857,79.7570455 L203.490857,74.0930455 L204.858857,74.0930455 L204.858857,76.2370455 L207.066857,76.2370455 L207.066857,74.0930455 L208.434857,74.0930455 L208.434857,79.7570455 L207.066857,79.7570455 Z M215.431428,79.7570455 L215.431428,74.0930455 L216.807428,74.0930455 L216.807428,79.7570455 L215.431428,79.7570455 Z M228.1,75.8370455 C228.1,76.1677138 228.038667,76.4463777 227.916,76.6730455 C227.793332,76.8997133 227.628001,77.0823781 227.42,77.2210455 C227.211999,77.3597128 226.972001,77.4610451 226.7,77.5250455 C226.427998,77.5890458 226.145334,77.6210455 225.852,77.6210455 L225.172,77.6210455 L225.172,79.7570455 L223.804,79.7570455 L223.804,74.0930455 L225.884,74.0930455 C226.193334,74.0930455 226.482665,74.1237118 226.752,74.1850455 C227.021334,74.2463791 227.255999,74.3450448 227.456,74.4810455 C227.656001,74.6170461 227.813332,74.795711 227.928,75.0170455 C228.042667,75.2383799 228.1,75.5117105 228.1,75.8370455 Z M226.732,75.8450455 C226.732,75.7117115 226.705333,75.6023792 226.652,75.5170455 C226.598666,75.4317117 226.526667,75.3650457 226.436,75.3170455 C226.345332,75.2690452 226.242667,75.2370455 226.128,75.2210455 C226.013332,75.2050454 225.894667,75.1970455 225.772,75.1970455 L225.172,75.1970455 L225.172,76.5330455 L225.748,76.5330455 C225.876,76.5330455 225.998666,76.5223789 226.116,76.5010455 C226.233334,76.479712 226.338666,76.4423791 226.432,76.3890455 C226.525333,76.3357119 226.598666,76.2650459 226.652,76.1770455 C226.705333,76.089045 226.732,75.9783795 226.732,75.8450455 Z" id="LISTASHIP" fill="#FFFFFF"></path>
                <g id="LISTASHIP">
                    <use fill="#BEC8CC" fill-rule="evenodd" xlink:href="#path-5"></use>
                    <use fill="black" fill-opacity="1" filter="url(#filter-6)" xlink:href="#path-5"></use>
                </g>
            </g>
        </g>
    </g>
</svg>