<?xml version="1.0" encoding="UTF-8"?>
<svg width="191px" height="43px" viewBox="0 0 191 43" version="1.1" xmlns="http://www.w3.org/2000/svg" xmlns:xlink="http://www.w3.org/1999/xlink">
    <!-- Generator: Sketch 50.2 (55047) - http://www.bohemiancoding.com/sketch -->
    <title>Group 2</title>
    <desc>Created with Sketch.</desc>
    <defs></defs>
    <g id="Page-1" stroke="none" stroke-width="1" fill="none" fill-rule="evenodd">
        <g id="Artboard" transform="translate(-281.000000, -36.000000)">
            <g id="Group-2" transform="translate(281.078125, 34.799529)">
                <g id="Group" transform="translate(0.361990, 0.998347)" fill="#026BFA">
                    <path d="M11.5027628,0.850768339 C20.9425217,-2.39960132 43.6311547,18.3493059 41.8911901,27.7743292 C40.1512255,37.1993525 11.8872777,47.6466976 4.13215447,40.7758078 C-3.62296882,33.9049181 2.06300387,4.101138 11.5027628,0.850768339 Z" id="Triangle" opacity="0.100000001"></path>
                    <path d="M5.28819403,7.75587579 C12.0016043,2.12265572 37.1221266,11.9890991 38.6611213,20.26028 C40.200116,28.5314609 20.3242476,45.9842828 11.8074802,42.7931603 C3.2907129,39.6020377 -1.42521623,13.3890959 5.28819403,7.75587579 Z" id="Triangle" opacity="0.0823660729"></path>
                    <path d="M27.4990809,9.70774362 C33.3132575,13.3408444 32.0452303,34.4162073 26.2633502,37.560783 C20.4814701,40.7053586 2.69128532,30.1364724 3.00664365,23.0283798 C3.32200199,15.9202873 21.6849043,6.07464283 27.4990809,9.70774362 Z" id="Triangle"></path>
                </g>
                <path d="M70.3869368,39.137305 C68.4556635,39.137305 66.628783,38.798027 64.9062958,38.1194716 C63.1838086,37.4409163 61.6766323,36.4752793 60.384767,35.2225614 C59.0929016,33.9698434 58.0685435,32.4561424 57.3116932,30.6814588 C56.554843,28.9067753 56.1764176,26.910256 56.1764176,24.6919011 C56.1764176,22.4735462 56.5613672,20.4705028 57.331267,18.6827697 C58.1011667,16.8950366 59.1385738,15.3748114 60.4434881,14.1220934 C61.7484024,12.8693755 63.2555787,11.9037385 64.965017,11.2251832 C66.6744552,10.5466278 68.4556635,10.2073498 70.308642,10.2073498 C72.2138174,10.2073498 73.9036813,10.4748571 75.3782349,11.0098723 C76.8527885,11.5448874 78.1055065,12.2495413 79.1363887,13.1238338 C80.167271,13.9981264 81.0024167,14.983337 81.6418246,16.0794652 C82.2812326,17.1755934 82.7444776,18.2847706 83.0315586,19.4069973 L77.942392,21.0120421 C77.7858022,20.3595847 77.5248191,19.6940783 77.1594432,19.0155229 C76.7940674,18.3369676 76.3047244,17.7367065 75.6914144,17.2147409 C75.0781044,16.6927753 74.3277789,16.2621535 73.4404368,15.9228755 C72.5530947,15.5835975 71.5091635,15.4139588 70.308642,15.4139588 C69.2647101,15.4139588 68.2338278,15.6031712 67.2159945,15.9815966 C66.1981612,16.360022 65.2847212,16.9276599 64.475674,17.6845101 C63.6666268,18.4413603 63.0141699,19.4069973 62.5183022,20.5814204 C62.0224345,21.7558434 61.7745009,23.1260037 61.7745009,24.6919011 C61.7745009,26.1795037 62.0159103,27.4909428 62.4987285,28.6262184 C62.9815467,29.7614941 63.6209552,30.7140815 64.4169528,31.4839813 C65.2129505,32.253881 66.1263911,32.8410926 67.1572734,33.2456159 C68.1881556,33.6501392 69.2647101,33.8524011 70.3869368,33.8524011 C71.5613599,33.8524011 72.598767,33.6762377 73.499158,33.3239107 C74.399549,32.9715838 75.162924,32.5213883 75.789283,31.9733242 C76.415642,31.4252601 76.9245586,30.8184748 77.316033,30.1529684 C77.7075073,29.487462 77.9945883,28.8284804 78.1772766,28.1760229 L83.2272958,29.7027729 C82.9663127,30.7728026 82.5161172,31.8624067 81.8767093,32.9715838 C81.2373013,34.080761 80.3891067,35.0920701 79.3321259,36.0055101 C78.2751452,36.9189501 77.0093783,37.6692761 75.5348246,38.2564877 C74.060271,38.8436992 72.3443086,39.137305 70.3869368,39.137305 Z M95.9893599,34.4004652 C96.6157189,34.4004652 97.2290289,34.2830229 97.8292894,34.0481383 C98.4295499,33.8132537 98.9515161,33.4674515 99.3951868,33.0107313 C99.8388576,32.554011 100.197709,31.9863731 100.471741,31.3078178 C100.745773,30.6292624 100.882789,29.8332642 100.882789,28.9198242 C100.882789,28.0063842 100.745773,27.210386 100.471741,26.5318306 C100.197709,25.8532753 99.8388576,25.2856374 99.3951868,24.8289171 C98.9515161,24.3721969 98.4295499,24.0263947 97.8292894,23.7915101 C97.2290289,23.5566255 96.6157189,23.4391832 95.9893599,23.4391832 C95.3630009,23.4391832 94.7496909,23.5566255 94.1494304,23.7915101 C93.5491699,24.0263947 93.0272037,24.3721969 92.583533,24.8289171 C92.1398622,25.2856374 91.7810105,25.8532753 91.5069785,26.5318306 C91.2329464,27.210386 91.0959304,28.0063842 91.0959304,28.9198242 C91.0959304,29.8332642 91.2329464,30.6292624 91.5069785,31.3078178 C91.7810105,31.9863731 92.1398622,32.554011 92.583533,33.0107313 C93.0272037,33.4674515 93.5491699,33.8132537 94.1494304,34.0481383 C94.7496909,34.2830229 95.3630009,34.4004652 95.9893599,34.4004652 Z M95.9893599,18.7023434 C97.4247661,18.7023434 98.7623031,18.9568018 100.001972,19.4657184 C101.241641,19.9746351 102.311671,20.6792889 103.212062,21.57968 C104.112453,22.480071 104.817107,23.5566255 105.326023,24.8093434 C105.83494,26.0620614 106.089398,27.4322216 106.089398,28.9198242 C106.089398,30.4074268 105.83494,31.7710622 105.326023,33.0107313 C104.817107,34.2504003 104.112453,35.3269547 103.212062,36.2403947 C102.311671,37.1538347 101.241641,37.8650133 100.001972,38.37393 C98.7623031,38.8828466 97.4247661,39.137305 95.9893599,39.137305 C94.5539537,39.137305 93.2164167,38.8828466 91.9767477,38.37393 C90.7370787,37.8650133 89.667049,37.1538347 88.766658,36.2403947 C87.866267,35.3269547 87.1616131,34.2504003 86.6526964,33.0107313 C86.1437798,31.7710622 85.8893214,30.4074268 85.8893214,28.9198242 C85.8893214,27.4322216 86.1437798,26.0620614 86.6526964,24.8093434 C87.1616131,23.5566255 87.866267,22.480071 88.766658,21.57968 C89.667049,20.6792889 90.7370787,19.9746351 91.9767477,19.4657184 C93.2164167,18.9568018 94.5539537,18.7023434 95.9893599,18.7023434 Z M110.199879,38.5500934 L110.199879,10.2073498 L115.406488,10.2073498 L115.406488,38.5500934 L110.199879,38.5500934 Z M120.965424,38.5500934 L120.965424,10.2073498 L126.172033,10.2073498 L126.172033,38.5500934 L120.965424,38.5500934 Z M130.556546,33.304337 C130.556546,32.4430934 130.706611,31.6797184 131.006741,31.014212 C131.306872,30.3487056 131.71792,29.7680188 132.239886,29.2721511 C132.761851,28.7762834 133.368636,28.384809 134.060241,28.097728 C134.751846,27.810647 135.502172,27.6018603 136.311219,27.4713691 L141.048059,26.7667152 C141.596123,26.6884204 141.974548,26.5253058 142.183334,26.2773723 C142.39212,26.0294387 142.496514,25.7358329 142.496514,25.396555 C142.496514,24.7179996 142.229006,24.1307881 141.693991,23.6349204 C141.158976,23.1390526 140.343405,22.8911191 139.247277,22.8911191 C138.098952,22.8911191 137.218135,23.2042986 136.604825,23.8306575 C135.991515,24.4570165 135.645712,25.1877688 135.567418,26.0229139 L130.94802,25.044228 C131.026315,24.2873778 131.2612,23.530527 131.652674,22.7736768 C132.044148,22.0168265 132.579164,21.3382706 133.257719,20.7380101 C133.936274,20.1377496 134.77142,19.6484067 135.763155,19.2699813 C136.75489,18.8915558 137.903215,18.7023434 139.208129,18.7023434 C140.72183,18.7023434 142.013696,18.9046054 143.083725,19.3091287 C144.153755,19.713652 145.021523,20.2486671 145.68703,20.9141736 C146.352536,21.57968 146.835354,22.3561039 147.135485,23.243446 C147.435615,24.1307881 147.58568,25.057277 147.58568,26.0229139 L147.58568,35.4965934 C147.58568,36.018559 147.611779,36.5731479 147.663975,37.1603595 C147.716172,37.747571 147.768369,38.2108155 147.820565,38.5500934 L143.044578,38.5500934 C142.992381,38.2891103 142.946709,37.9302592 142.907562,37.4735389 C142.868414,37.0168187 142.848841,36.6057706 142.848841,36.2403947 C142.352973,36.9972449 141.641795,37.6627514 140.715305,38.2369139 C139.788816,38.8110765 138.607869,39.0981575 137.172462,39.0981575 C136.154629,39.0981575 135.234664,38.935043 134.412568,38.6088146 C133.590472,38.2825862 132.892343,37.8519644 132.31818,37.3169492 C131.744018,36.781934 131.306872,36.1686246 131.006741,35.4770197 C130.706611,34.7854148 130.556546,34.0611872 130.556546,33.304337 Z M138.268591,35.2225614 C138.816655,35.2225614 139.345145,35.1507913 139.854062,35.0072505 C140.362978,34.8637097 140.813174,34.6157761 141.204648,34.2634492 C141.596123,33.9111223 141.909302,33.454402 142.144187,32.8932889 C142.379071,32.3321759 142.496514,31.6209973 142.496514,30.7597537 L142.496514,29.8985101 L138.151148,30.5640165 C137.472593,30.6684099 136.904955,30.9098187 136.448235,31.2882441 C135.991515,31.6666695 135.763155,32.2343073 135.763155,32.9911575 C135.763155,33.5653201 135.971941,34.080761 136.389514,34.5374813 C136.807087,34.9942015 137.433446,35.2225614 138.268591,35.2225614 Z M152.831437,38.5500934 L152.831437,10.2073498 L157.959751,10.2073498 L157.959751,21.4035165 C158.403422,20.7249612 159.127649,20.1181759 160.132434,19.5831607 C161.137218,19.0481456 162.357313,18.7806383 163.792719,18.7806383 C165.202027,18.7806383 166.454745,19.0350966 167.550873,19.5440133 C168.647001,20.05293 169.580015,20.7575838 170.349914,21.6579748 C171.119814,22.5583659 171.700501,23.6218714 172.091975,24.8484909 C172.48345,26.0751103 172.679187,27.4061231 172.679187,28.8415293 C172.679187,30.3030334 172.463876,31.6536199 172.033254,32.8932889 C171.602632,34.1329579 170.989322,35.2095124 170.193325,36.1229524 C169.397327,37.0363924 168.438215,37.747571 167.315988,38.2564877 C166.193761,38.7654043 164.954093,39.0198627 163.596982,39.0198627 C162.265969,39.0198627 161.11112,38.7588796 160.132434,38.2369139 C159.153748,37.7149483 158.403422,37.0363924 157.881456,36.2012473 L157.881456,38.5500934 L152.831437,38.5500934 Z M167.472578,28.8806768 C167.472578,27.1059932 167.009333,25.7554067 166.082844,24.8289171 C165.156354,23.9024276 164.027603,23.4391832 162.696591,23.4391832 C162.044133,23.4391832 161.424299,23.5566255 160.837087,23.7915101 C160.249876,24.0263947 159.740959,24.3721969 159.310337,24.8289171 C158.879716,25.2856374 158.533914,25.8532753 158.27293,26.5318306 C158.011947,27.210386 157.881456,27.9933347 157.881456,28.8806768 C157.881456,29.7419204 158.011947,30.5118201 158.27293,31.1903755 C158.533914,31.8689308 158.879716,32.4430934 159.310337,32.9128627 C159.740959,33.3826319 160.249876,33.7414836 160.837087,33.9894171 C161.424299,34.2373507 162.044133,34.3613178 162.696591,34.3613178 C164.027603,34.3613178 165.156354,33.8915486 166.082844,32.9520101 C167.009333,32.0124716 167.472578,30.6553603 167.472578,28.8806768 Z M179.608283,32.2082088 C179.660479,32.965059 179.973659,33.643615 180.547821,34.2438755 C181.121984,34.844136 181.983228,35.1442665 183.131552,35.1442665 C183.992796,35.1442665 184.632204,34.9550541 185.049777,34.5766287 C185.467349,34.1982033 185.676136,33.7480078 185.676136,33.2260421 C185.676136,32.7823714 185.519546,32.3974212 185.206366,32.0711928 C184.893187,31.7449644 184.358172,31.503555 183.601321,31.3469652 L181.056738,30.7597537 C179.177661,30.3421808 177.807501,29.6179533 176.946257,28.587071 C176.085014,27.5561887 175.654392,26.3621919 175.654392,25.0050806 C175.654392,24.143837 175.83708,23.3282656 176.202456,22.5583659 C176.567832,21.7884661 177.070224,21.1229597 177.709632,20.5618466 C178.34904,20.0007336 179.105891,19.5505381 179.980184,19.2112601 C180.854476,18.8719821 181.813588,18.7023434 182.85752,18.7023434 C184.214631,18.7023434 185.362956,18.8915558 186.302495,19.2699813 C187.242033,19.6484067 188.005408,20.1247001 188.59262,20.6988627 C189.179831,21.2730253 189.616978,21.8798105 189.904059,22.5192184 C190.19114,23.1586264 190.360779,23.7393137 190.412975,24.2612793 L186.06761,25.2399652 C186.015414,24.9528842 185.930594,24.6592785 185.813152,24.3591479 C185.695709,24.0590174 185.506497,23.7784612 185.245514,23.517478 C184.984531,23.2564949 184.664827,23.0477088 184.286402,22.8911191 C183.907976,22.7345293 183.444732,22.6562345 182.896668,22.6562345 C182.218112,22.6562345 181.637425,22.8389227 181.154607,23.2042986 C180.671789,23.5696744 180.430379,24.0263947 180.430379,24.5744588 C180.430379,25.044228 180.593494,25.4226535 180.919722,25.7097345 C181.245951,25.9968155 181.670048,26.1925526 182.192014,26.296946 L184.932334,26.8841575 C186.83751,27.2756319 188.266391,28.0063842 189.218978,29.0764139 C190.171566,30.1464437 190.64786,31.3861127 190.64786,32.7954204 C190.64786,33.5783691 190.497795,34.3482688 190.197664,35.1051191 C189.897534,35.8619693 189.434289,36.5405253 188.80793,37.1407857 C188.181571,37.7410462 187.398623,38.223865 186.459084,38.5892409 C185.519546,38.9546167 184.423418,39.137305 183.1707,39.137305 C181.709196,39.137305 180.482576,38.9285188 179.490841,38.510946 C178.499106,38.0933731 177.690059,37.5844565 177.0637,36.984196 C176.437341,36.3839355 175.974096,35.7380028 175.673966,35.0463979 C175.373835,34.354793 175.197672,33.7349588 175.145475,33.1868947 L179.608283,32.2082088 Z" id="Collabs" fill="#292E37"></path>
            </g>
        </g>
    </g>
</svg>