<?xml version="1.0" encoding="UTF-8"?>
<svg width="60px" height="60px" viewBox="0 0 60 60" version="1.1" xmlns="http://www.w3.org/2000/svg" xmlns:xlink="http://www.w3.org/1999/xlink">
    <!-- Generator: Sketch 50.2 (55047) - http://www.bohemiancoding.com/sketch -->
    <title>Group 13</title>
    <desc>Created with Sketch.</desc>
    <defs>
        <circle id="path-1" cx="30" cy="30" r="30"></circle>
    </defs>
    <g id="Page-1" stroke="none" stroke-width="1" fill="none" fill-rule="evenodd">
        <g id="Artboard" transform="translate(-1061.000000, -467.000000)">
            <g id="Group-11-Copy-2" transform="translate(1040.000000, 444.000000)">
                <g id="Group-13" transform="translate(21.000000, 23.000000)">
                    <mask id="mask-2" fill="white">
                        <use xlink:href="#path-1"></use>
                    </mask>
                    <use id="Oval" fill="#EAF7FF" xlink:href="#path-1"></use>
                    <path d="M-4.95956621,38.2746029 L-10.0127164,38.2746029 L-10.0127164,30.3293702 L-5.02209072,30.3293702 L-5.02209072,38.2746029 L-4.95956621,38.2746029 Z M22.2672398,16.591411 C17.0937832,21.7648675 16.9084889,30.0209364 21.7137962,35.3795641 L21.8365167,35.5022847 C21.3432322,36.6115865 20.4192124,38.0288909 19.001908,38.705018 C18.5086235,38.950459 18.631344,39.6290255 19.18719,39.6916116 C20.7272026,39.9370526 22.9458063,39.6916116 25.0392377,38.0890129 C30.2752804,41.1690381 37.1739207,40.4904469 41.6713733,35.9329954 C47.0301489,30.5742445 47.0301489,21.8874649 41.6713733,16.5288372 C36.3126224,11.2326108 27.6258428,11.2326108 22.2672151,16.5913986 L22.2672398,16.591411 Z M32.0007351,35.9327366 C26.7021063,35.9327366 22.3300723,31.6207015 22.3300723,26.2620738 C22.3300723,20.963445 26.6421074,16.591411 32.0007351,16.591411 C37.2993639,16.591411 41.671398,20.9034461 41.671398,26.2620738 C41.6088365,31.6208247 37.2967767,35.9327366 32.0007351,35.9327366 Z" id="Fill-1" fill="#3A7DE3" mask="url(#mask-2)"></path>
                    <path d="M14.7525945,30.0811201 L14.7525945,22.4438899 C14.7525945,21.7652987 14.25931,21.1492937 13.5831706,21.0891716 C12.7818712,21.0266102 12.1658662,21.5824561 12.1057441,22.3211817 C7.91641717,26.3252143 1.81907626,27.8652269 -1.81720139,28.4812319 L-1.81720139,27.2492218 L-10.1961005,27.2492218 C-11.8588212,27.2492218 -13.2135395,28.6039401 -13.2135395,30.2666608 L-13.2159456,31.4986709 L-14.077367,31.4986709 C-14.6308106,31.4986709 -15.0639608,31.9293939 -15.0639608,32.4852645 L-15.0639608,36.2438808 C-15.0639608,36.7973243 -14.6332376,37.2304744 -14.077367,37.2304744 L-13.1533595,37.2304744 L-13.1533595,38.3998984 C-13.1533595,40.0626191 -11.7986412,41.4173374 -10.1359205,41.4173374 L-9.39720725,41.4173374 L-5.94659106,52.8762628 L-5.45330655,52.7535423 L-3.72799969,52.3228192 L-3.23471519,52.2000987 L-4.65201954,41.4200108 L-1.87999694,41.4200108 L-1.87999694,40.1880008 C1.75344708,40.8040058 7.7906659,42.3440184 12.0429486,46.348051 C12.10551,47.0867642 12.7215397,47.7027692 13.520375,47.580061 C14.1989661,47.5174996 14.689799,46.9014699 14.689799,46.2253428 L14.689799,38.4605995 C16.4151058,37.8445945 17.5845298,36.1818737 17.5845298,34.2712725 C17.6470912,32.3606714 16.4151058,30.6979506 14.7523235,30.0819456 L14.7525945,30.0811201 Z" id="Path" fill="#626CDD" mask="url(#mask-2)"></path>
                    <polygon id="Path" fill="#3A7DE3" mask="url(#mask-2)" points="35.3259302 21.8876373 37.3592396 23.9209467 32.6164937 28.6035705 30.5831844 30.6368799 26.5791517 26.6328472 28.6124611 24.5995378 30.5831844 26.5702611"></polygon>
                </g>
            </g>
        </g>
    </g>
</svg>