<?xml version="1.0" encoding="UTF-8"?>
<svg width="341px" height="307px" viewBox="0 0 341 307" version="1.1" xmlns="http://www.w3.org/2000/svg" xmlns:xlink="http://www.w3.org/1999/xlink">
    <!-- Generator: Sketch 51.2 (57519) - http://www.bohemiancoding.com/sketch -->
    <title>undraw_upload_87y9</title>
    <desc>Created with Sketch.</desc>
    <defs>
        <linearGradient x1="50%" y1="100%" x2="50%" y2="0%" id="linearGradient-1">
            <stop stop-color="#808080" stop-opacity="0.25" offset="0%"></stop>
            <stop stop-color="#808080" stop-opacity="0.12" offset="54%"></stop>
            <stop stop-color="#808080" stop-opacity="0.1" offset="100%"></stop>
        </linearGradient>
        <linearGradient x1="4.32548939e-14%" y1="50%" x2="100%" y2="50%" id="linearGradient-2">
            <stop stop-color="#808080" stop-opacity="0.25" offset="0%"></stop>
            <stop stop-color="#808080" stop-opacity="0.12" offset="54%"></stop>
            <stop stop-color="#808080" stop-opacity="0.1" offset="100%"></stop>
        </linearGradient>
        <linearGradient x1="0.00381898033%" y1="50%" x2="100.003819%" y2="50%" id="linearGradient-3">
            <stop stop-color="#808080" stop-opacity="0.25" offset="0%"></stop>
            <stop stop-color="#808080" stop-opacity="0.12" offset="54%"></stop>
            <stop stop-color="#808080" stop-opacity="0.1" offset="100%"></stop>
        </linearGradient>
        <linearGradient x1="6.51251696e-14%" y1="49.987556%" x2="100%" y2="49.987556%" id="linearGradient-4">
            <stop stop-color="#808080" stop-opacity="0.25" offset="0%"></stop>
            <stop stop-color="#808080" stop-opacity="0.12" offset="54%"></stop>
            <stop stop-color="#808080" stop-opacity="0.1" offset="100%"></stop>
        </linearGradient>
        <path d="M171,196.828057 C171,196.828057 143.250593,202.253315 115.00496,198.913324 C103.838081,197.601567 92.6069435,194.899631 82.9787239,189.944896 C74.9284328,185.806443 68.0490931,181.304406 62.0443971,175.904101 C42.7236984,158.548267 32.520713,131.949533 22,78.2352048 C22,78.2352048 68.1312025,89.3530619 113.748329,65 C113.734049,65.0178228 129.109926,160.826019 171,196.828057 Z" id="path-5"></path>
        <filter x="-1.3%" y="-0.7%" width="102.7%" height="103.0%" filterUnits="objectBoundingBox" id="filter-6">
            <feOffset dx="0" dy="1" in="SourceAlpha" result="shadowOffsetOuter1"></feOffset>
            <feGaussianBlur stdDeviation="0.5" in="shadowOffsetOuter1" result="shadowBlurOuter1"></feGaussianBlur>
            <feColorMatrix values="0 0 0 0 0.407525374   0 0 0 0 0.45014199   0 0 0 0 0.548416241  0 0 0 0.0926460598 0" type="matrix" in="shadowBlurOuter1"></feColorMatrix>
        </filter>
        <linearGradient x1="0%" y1="50.0032742%" x2="100%" y2="50.0032742%" id="linearGradient-7">
            <stop stop-color="#808080" stop-opacity="0.25" offset="0%"></stop>
            <stop stop-color="#808080" stop-opacity="0.12" offset="54%"></stop>
            <stop stop-color="#808080" stop-opacity="0.1" offset="100%"></stop>
        </linearGradient>
    </defs>
    <g id="Page-1" stroke="none" stroke-width="1" fill="none" fill-rule="evenodd">
        <g id="Artboard-2" transform="translate(-523.000000, -534.000000)">
            <g id="undraw_upload_87y9" transform="translate(523.000000, 534.000000)">
                <path d="M231.305,66.4326531 C231.38,66.2938776 231.44,66.1469388 231.5,66 C231.309036,66.3248892 231.142071,66.6588199 231,67 C231.105,66.8081633 231.21,66.6204082 231.305,66.4326531 Z" id="Shape" fill="url(#linearGradient-1)" fill-rule="nonzero"></path>
                <path d="M215.633899,76.0909764 C215.633899,76.0909764 214.539921,81.4634348 212.523228,82.1583975 C210.506535,82.8533603 214.969823,89 214.969823,89 L224.221446,88.4778777 L224.389213,86.4866113 C224.389213,86.4866113 222.641645,82.5004777 225.567074,77.6501416 C228.492502,72.7998055 215.633899,76.0909764 215.633899,76.0909764 Z" id="Shape" fill="#F6BAC2" fill-rule="nonzero"></path>
                <path d="M199.971894,201.841647 C199.837215,203.514727 195.740717,202.883092 195.740717,202.883092 C188.946891,203.830544 190.06922,197.138225 190.06922,197.138225 L190.06922,196.79609 L190.304908,190.554939 L190.372248,188.814184 C190.372248,188.814184 197.854435,185.377791 197.66364,186.099659 C197.592559,186.37036 197.749685,187.020793 197.966668,187.723862 C198.340777,188.893138 198.875754,190.216563 198.875754,190.216563 C198.875754,190.216563 198.920647,192.976205 198.696181,193.788306 C198.471716,194.600408 199.867144,196.773532 199.867144,196.773532 C199.867144,196.773532 199.867144,196.908882 199.88959,197.149505 C200.000308,198.710956 200.027782,200.277244 199.971894,201.841647 Z" id="Shape" fill="#B77983" fill-rule="nonzero"></path>
                <path d="M213.266353,203.881995 C213.266353,203.881995 209.168512,204.516887 209.033788,202.841373 C208.971561,201.274682 208.995299,199.705739 209.104893,198.141668 C209.104893,197.916262 209.123604,197.765992 209.123604,197.765992 C209.123604,197.765992 210.51949,195.594586 210.294951,194.783126 C210.070411,193.971666 210.115319,191.210449 210.115319,191.210449 C210.115319,191.210449 210.26127,190.86107 210.452128,190.357664 C210.852556,189.302015 211.45507,187.588934 211.331573,187.100555 C211.151942,186.375501 218.625357,189.809178 218.625357,189.809178 L218.700203,191.755179 L218.928485,197.784776 L218.928485,198.126641 C218.928485,198.126641 220.06615,204.832455 213.266353,203.881995 Z" id="Shape" fill="#B77983" fill-rule="nonzero"></path>
                <path d="M239.73894,39.2971225 C237.480357,46.5803106 230.62648,48.5818517 230.62648,48.5818517 C230.62648,48.5818517 226.038288,51.9937315 225.384861,53.0621699 C224.731435,54.1306082 219.092079,58.7177702 217.607664,59.3196571 C216.123249,59.9215441 214.990406,60.9187532 215.388144,62.2578626 C215.743267,63.5008125 211.858219,69.5837882 211.272266,70.4883993 L211.201242,70.6023661 L209.976067,71.8880535 L205.817574,74 L202.429699,72.9137543 L202,68.8323199 L203.796923,65.6270048 C204.836216,64.8924399 205.704813,63.9411556 206.343157,62.8383807 C207.511512,60.893823 208.310539,59.5547136 208.310539,59.5547136 C208.310539,59.5547136 209.592534,56.4989799 211.613185,54.6968805 C213.011188,53.4915381 214.517413,52.4185249 216.112595,51.4915655 L224.461541,46.5055199 C224.461541,46.5055199 226.340143,45.1058657 227.65765,44.7247893 C228.975157,44.343713 241.990421,32.0139345 239.73894,39.2971225 Z" id="Shape" fill="#F6BAC2" fill-rule="nonzero"></path>
                <path d="M206.073513,71.4887282 L212,70.4236495 C211.935791,70.4832974 211.898059,70.561955 211.893899,70.644832 L211.818113,70.7537218 L210.5108,71.9821353 L206.073513,74 L202.458507,72.9621438 L202,69.0625266 L203.917393,66 C202.102311,69.4028073 203.871921,71.8188005 203.871921,71.8188005 L206.073513,71.4887282 Z" id="Shape" fill="#000000" fill-rule="nonzero" opacity="0.05"></path>
                <path d="M238,90.9099226 C237.986142,90.9503504 237.974256,90.9917053 237.964401,91.033779 C237.916373,91.1721277 237.853258,91.302273 237.776699,91.4208304 L235.734628,92.6129486 L232.618123,93 L231,88.3128079 L232.07767,83.1766362 L232.673139,82.2167488 L232.838188,82 C232.899676,82.9289233 233.213592,87.7748065 233.194175,89.2301196 C233.168285,90.8441239 234.165049,90.9718508 234.165049,90.9718508 L238,90.9099226 Z" id="Shape" fill="#000000" fill-rule="nonzero" opacity="0.05"></path>
                <path d="M238,90.9529667 C237.984695,90.9907564 237.971569,91.0294127 237.960685,91.068741 C237.789131,91.6186686 235.612535,93.9413893 235.612535,93.9413893 C235.612535,93.9413893 229.361523,98.2648336 227.356482,99.0065123 C225.35144,99.748191 222.710218,103.619392 222.710218,103.619392 L220.07257,109.129522 C220.07257,109.129522 215.344103,112.747467 214.886625,113.717077 C214.568534,114.375543 214.593553,115.526049 214.640015,116.206223 C214.640015,116.506512 214.682904,116.705499 214.682904,116.705499 L213.289025,118.178003 L212.177495,119.350217 L210.612062,121 L208.063765,120.638205 L200.122228,119.361071 L198.599683,118.492764 L190.147057,113.673661 C190.147057,113.673661 190.147057,113.373372 190.125613,112.913893 C190.125613,112.711288 190.125613,112.47974 190.104168,112.222865 C190.07915,111.441389 190.04341,110.468162 190.004095,109.639653 C189.918318,107.928365 191.20855,104.997829 191.20855,104.997829 L193.585292,99.0752533 C193.356553,97.9464544 194.675377,94.9544139 194.675377,94.9544139 C194.446638,94.5202605 195.822647,90.1968162 196.165756,89.7916064 C196.508864,89.3863965 197.084286,86.3364689 197.084286,86.3364689 C197.799096,85.2945007 198.831996,79.9833575 198.831996,79.9833575 C198.831996,79.9833575 200.007858,73.2503618 200.261616,71.5680174 C200.515373,69.8856729 203.406779,66.1157742 203.499704,66 C201.437478,69.8277858 203.242373,72.6136035 203.242373,72.6136035 L205.308173,72.251809 L210.90156,71.1483357 C210.644228,71.3219971 210.815783,73.23589 210.815783,73.23589 C211.31105,73.6171926 211.639411,74.1794062 211.730739,74.8024602 C211.78435,75.6526773 212.802954,76.9732272 212.992379,77.2083936 L213.020971,77.2409551 C213.166512,76.4235578 213.659086,75.7119947 214.368388,75.2945007 L215.658619,77.0383502 L216.091079,79.1259045 C216.091079,79.1259045 215.973136,79.418958 215.229733,79.9978292 C214.486331,80.5767004 215.54425,82.0853835 215.54425,82.0853835 C215.901655,82.6968162 216.005302,84.9580318 216.005302,84.9580318 C216.952425,84.1186686 218.439229,84.1186686 218.439229,84.1186686 C219.044674,83.5034719 219.539363,82.7859943 219.901015,81.9985528 C219.962146,81.7374043 220.138219,81.5190627 220.378736,81.4061485 C220.619254,81.2932343 220.897643,81.2982221 221.134062,81.4196816 C221.565706,81.0401368 222.036647,80.708977 222.538664,80.4319826 C223.228455,80.0701881 224.029042,80.7937771 224.029042,80.7937771 L224.114819,83.4674385 C224.114819,83.4674385 224.182726,83.5759768 224.293522,83.7243126 C224.518687,84.0426918 224.922554,84.5311143 225.176312,84.4479016 C225.533717,84.3321274 228.4144,84.621563 228.4144,84.621563 C228.4144,84.621563 229.418708,85.0557164 229.790409,84.5057887 C230.16211,83.9558611 232.292244,82.5050651 232.292244,82.5050651 C232.292244,82.5050651 232.703259,87.8921852 232.703259,89.3972504 C232.703259,90.9023155 233.775474,91.0253256 233.775474,91.0253256 L238,90.9529667 Z" id="Shape" fill="#D39999" fill-rule="nonzero"></path>
                <path d="M238.105,90.2222222 L238,90.2222222 C238.19,89.7222222 238.105,90.2222222 238.105,90.2222222 Z" id="Shape"></path>
                <circle id="Oval" fill="#4B4442" fill-rule="nonzero" cx="214.5" cy="86.5" r="1"></circle>
                <circle id="Oval" fill="#4B4442" fill-rule="nonzero" cx="211.5" cy="95.5" r="1"></circle>
                <circle id="Oval" fill="#4B4442" fill-rule="nonzero" cx="203.5" cy="110.5" r="1"></circle>
                <circle id="Oval" fill="#4B4442" fill-rule="nonzero" cx="207.5" cy="102.5" r="1"></circle>
                <path d="M198,187.799865 C195.429688,191.309255 192.654297,191.250373 191,190.755761 L191.061523,188.938258 C191.061523,188.938258 197.897461,185.350358 197.723145,186.104053 C197.658203,186.386688 197.788086,187.065798 198,187.799865 Z" id="Shape" fill="#000000" fill-rule="nonzero" opacity="0.05"></path>
                <path d="M219,191.875758 C214.356364,194.718549 211.632727,191.386551 211,190.442806 C211.389091,189.360389 211.974545,187.603867 211.854545,187.103105 C211.68,186.359665 218.941818,189.880411 218.941818,189.880411 L219,191.875758 Z" id="Shape" fill="#000000" fill-rule="nonzero" opacity="0.05"></path>
                <path d="M219.68903,186.700224 C218.788707,188.027605 218.84146,191.315481 218.84146,191.315481 C213.031562,195.585403 209.985938,190.390991 209.985938,190.390991 C209.985938,190.390991 210.379829,187.045559 209.704587,184.390797 C209.304441,182.667973 209.266084,180.877931 209.592046,179.138829 C209.592046,179.138829 209.479506,173.829304 209.194638,173.081079 C208.90977,172.332853 208.800746,170.138538 208.913287,169.329159 C209.025827,168.51978 208.181774,166.677994 208.181774,166.677994 C208.181774,166.677994 208.181774,164.368567 207.784366,163.850565 C207.386958,163.332562 206.940313,159.634601 206.940313,159.634601 L204.235827,149.249373 C204.235827,149.249373 203.106906,142.9614 202.656744,141.576463 C202.206582,140.191526 201.640364,140.479306 201.640364,140.479306 L200.015562,147.921992 L198.7741,160.616647 C198.151611,162.055543 198.422412,165.408169 198.422412,165.408169 L198.816303,170.311205 L198.162162,178.735938 C198.160433,178.750273 198.160433,178.76477 198.162162,178.779105 C198.161036,178.943552 198.236847,179.098638 198.366141,179.196384 C199.475851,181.749243 199.805606,184.585477 199.312184,187.333338 C195.025098,193.682464 189.834172,190.390991 189.834172,190.390991 C189.720982,188.941325 189.37893,187.51999 188.821309,186.182222 C187.861199,183.757683 188.990119,173.951611 188.990119,173.951611 L188.14255,167.602484 C188.14255,167.602484 188.086279,163.793009 187.917469,163.285798 C187.748658,162.778588 187.804928,159.015876 187.804928,159.015876 L187.917469,155.033733 C186.450927,149.954432 187.182439,141.936187 187.182439,141.936187 C187.182439,141.936187 186.957359,129.126421 187.411037,128.547265 C187.738108,128.129985 187.530611,126.230644 187.671287,124.860096 C187.686213,124.444046 187.799657,124.03792 188.001874,123.676604 L188.058144,123.619048 C188.793174,122.694558 188.793174,119.003791 188.733387,117.557701 C188.705252,116.795087 189.2152,115.557637 189.700531,114.564799 C190.052219,113.866934 190.372256,113.291376 190.49183,113.082736 L190.541067,113 C190.541067,113 193.755502,113.809379 202.273403,117.964189 C203.798731,118.736438 205.434695,119.254955 207.119674,119.50021 C207.95812,119.614805 208.806836,119.628086 209.648316,119.53978 C210.932245,119.413477 212.173515,119.000909 213.284778,118.331108 C213.872273,117.988393 214.402885,117.552504 214.856827,117.039699 C214.740769,117.399423 214.811107,118.629678 214.856827,119.363515 C214.877928,119.698058 214.902546,119.924684 214.902546,119.924684 L215.841555,124.205398 C215.994496,124.713041 216.112021,125.231145 216.193244,125.755808 C216.260065,126.137115 216.316335,126.550798 216.369088,126.989661 C217.026746,132.464658 216.675057,141.691575 216.675057,141.691575 C216.675057,141.691575 218.081812,154.328674 217.410087,154.904232 C216.738361,155.47979 217.29403,157.443883 217.29403,157.443883 C217.804665,158.569895 218.110924,159.781477 218.19787,161.019538 C218.193052,161.98649 218.426489,162.939099 218.876629,163.789412 L218.648031,169.501826 L219.238868,181.894313 C219.238868,181.894313 220.59287,185.372843 219.68903,186.700224 Z" id="Shape" fill="#8499F0" fill-rule="nonzero"></path>
                <path d="M213,164 C213,164 217.836165,162.499375 218.890967,163.174656 C219.945768,163.849937 213,164 213,164 Z" id="Shape" fill="#000000" fill-rule="nonzero" opacity="0.05"></path>
                <path d="M215.10408,167 C215.10408,167 214.643993,167.390975 215.658486,167.891422 C216.672979,168.39187 215.10408,167 215.10408,167 Z" id="Shape" fill="#000000" fill-rule="nonzero" opacity="0.05"></path>
                <path d="M189.004144,159.040912 C188.857876,159.072812 192.61088,160.928329 196,159.391812 C195.98573,159.391812 189.84964,158.849512 189.004144,159.040912 Z" id="Shape" fill="#000000" fill-rule="nonzero" opacity="0.05"></path>
                <path d="M197,164 C197,164 195.868176,165.723779 193.549508,165.979605 C191.230841,166.235431 197,164 197,164 Z" id="Shape" fill="#000000" fill-rule="nonzero" opacity="0.05"></path>
                <path d="M211,169 C211,169 215.802558,176.926977 214.882993,178.797023 C213.963428,180.667069 211,169 211,169 Z" id="Shape" fill="#000000" fill-rule="nonzero" opacity="0.05"></path>
                <path d="M201.574621,121 L201,137 C201,137 204.407821,136.866264 204.990423,131.594846 C205.573025,126.323427 206,122.029023 206,122.029023 L201.574621,121 Z" id="Shape" fill="#000000" fill-rule="nonzero" opacity="0.05"></path>
                <path d="M201.573705,120 L201,136 C201,136 204.40239,135.866264 204.984064,130.591131 C205.565737,125.315997 206,121.029023 206,121.029023 L201.573705,120 Z" id="Shape" fill="#8499F0" fill-rule="nonzero"></path>
                <path d="M196,121.509887 C196,121.509887 193.566787,128.437445 188,125.082927 C188.014745,124.639428 188.131235,124.206458 188.33935,123.821629 C189.862816,124.5002 193.393502,125.493137 194.837545,121 L196,121.509887 Z" id="Shape" fill="#000000" fill-rule="nonzero" opacity="0.05"></path>
                <path d="M196,120.506441 C196,120.506441 193.566787,127.439316 188,124.082224 C188.015322,123.638481 188.131773,123.205323 188.33935,122.819957 C189.862816,123.502886 193.393502,124.492748 194.837545,120 L196,120.506441 Z" id="Shape" fill="#000000" fill-rule="nonzero" opacity="0.05"></path>
                <path d="M196,120.506441 C196,120.506441 193.566787,127.439316 188,124.082224 C188.015322,123.638481 188.131773,123.205323 188.33935,122.819957 C189.862816,123.502886 193.393502,124.492748 194.837545,120 L196,120.506441 Z" id="Shape" fill="#8499F0" fill-rule="nonzero"></path>
                <path d="M216,126.229747 C210.146004,129.345996 208,122 208,122 L209.382289,122.046396 C209.62419,126.743967 214.251404,125.479682 215.837581,124.903602 C215.892873,125.328896 215.948164,125.758057 216,126.229747 Z" id="Shape" fill="#000000" fill-rule="nonzero" opacity="0.05"></path>
                <path d="M216,126.231775 C210.14946,129.342806 208,122 208,122 L209.382289,122.046376 C209.62419,126.741907 214.251404,125.482036 215.837581,124.906205 C215.892873,125.315857 215.948164,125.76029 216,126.231775 Z" id="Shape" fill="#000000" fill-rule="nonzero" opacity="0.05"></path>
                <path d="M216,126.231775 C210.14946,129.342806 208,122 208,122 L209.382289,122.046376 C209.62419,126.745772 214.251404,125.482036 215.837581,124.906205 C215.892873,125.315857 215.948164,125.76029 216,126.231775 Z" id="Shape" fill="#8499F0" fill-rule="nonzero"></path>
                <path d="M196,120.506441 C196,120.506441 193.566787,127.439316 188,124.082224 C188.015322,123.638481 188.131773,123.205323 188.33935,122.819957 C189.862816,123.502886 193.393502,124.492748 194.837545,120 L196,120.506441 Z" id="Shape" fill="#FFFFFF" fill-rule="nonzero" opacity="0.1"></path>
                <path d="M216,126.231775 C210.14946,129.342806 208,122 208,122 L209.382289,122.046376 C209.62419,126.745772 214.251404,125.482036 215.837581,124.906205 C215.892873,125.315857 215.948164,125.76029 216,126.231775 Z" id="Shape" fill="#FFFFFF" fill-rule="nonzero" opacity="0.1"></path>
                <path d="M200,199.7112 C200,200.150327 200,200.560894 199.955174,200.900058 C199.820698,202.488772 195.73037,201.888988 195.73037,201.888988 C191.994912,202.385238 190.650146,200.671568 190.205627,199.032872 C190.065918,198.500603 189.996891,197.953639 190.000177,197.404886 C189.997756,197.077687 190.020228,196.750752 190.067415,196.426667 L190.067415,196.101784 C190.872392,195.86973 191.745506,196.040114 192.39087,196.555192 C194.053149,197.844014 196.25707,196.855084 196.25707,196.855084 C196.25707,196.855084 197.874524,196.983609 198.498346,197.49771 C198.849479,197.786892 199.428475,197.090714 199.869259,196.426667 C199.895407,196.855084 199.936497,197.629805 199.962645,198.458079 C199.992529,198.882926 200,199.311343 200,199.7112 Z" id="Shape" fill="#000000" fill-rule="nonzero" opacity="0.05"></path>
                <path d="M194,199.736142 C194,199.736142 192.697111,200.564755 190.238993,199.285196 C190.076563,198.865002 189.996311,198.433207 190.00013,198 C191.255247,198.620051 193.583075,199.736142 194,199.736142 Z" id="Shape" fill="#000000" fill-rule="nonzero" opacity="0.05"></path>
                <path d="M201,199.882101 C200.848184,199.977469 200.654757,200.017554 200.465436,199.992884 C200.276116,199.968214 200.107702,199.880976 200,199.75179 C200.35897,199.529335 200.688909,199.277414 200.984615,199 C200.993846,199.300716 201,199.601432 201,199.882101 Z" id="Shape" fill="#000000" fill-rule="nonzero" opacity="0.05"></path>
                <path d="M208.000887,199.709584 C208.000887,200.152376 208.000887,200.563029 208.041975,200.898694 C208.176441,202.491315 212.266473,201.887833 212.266473,201.887833 C216.001662,202.387759 217.34633,200.673727 217.790817,199.031113 C218.01097,198.178659 218.057887,197.293724 217.929019,196.424357 L217.929019,196.099405 C217.12272,195.871292 216.250556,196.041264 215.601997,196.552909 C213.939838,197.842004 211.739811,196.852865 211.739811,196.852865 C211.739811,196.852865 210.122475,196.984988 209.498698,197.499198 C209.14759,197.788441 208.568636,197.092115 208.131619,196.427928 C208.105473,196.856436 208.060651,197.631321 208.034504,198.45977 C208.004623,198.877565 207.997152,199.306073 208.000887,199.709584 Z" id="Shape" fill="#000000" fill-rule="nonzero" opacity="0.05"></path>
                <path d="M215,200.735769 C215,200.735769 216.302915,201.565552 218.75674,200.284187 C218.920593,199.864475 219.002308,199.433006 218.99995,199 C217.740465,199.618103 215.41259,200.735769 215,200.735769 Z" id="Shape" fill="#000000" fill-rule="nonzero" opacity="0.05"></path>
                <path d="M208.000802,200.882245 C208.152461,200.977516 208.345856,201.017558 208.535116,200.992871 C208.724377,200.968185 208.892642,200.88097 209,200.751913 C208.639869,200.52975 208.309137,200.277758 208.013138,200 C208.003886,200.298259 207.997718,200.599024 208.000802,200.882245 Z" id="Shape" fill="#000000" fill-rule="nonzero" opacity="0.05"></path>
                <path d="M204,91 C204,91 198.311465,106.576448 200.501921,107.928532 C202.692376,109.280616 204,91 204,91 Z" id="Shape" fill="#000000" fill-rule="nonzero" opacity="0.05"></path>
                <path d="M208,86 C208,86 206.4375,91.4763801 207.21875,91.9728225 C208,92.4692649 208,86 208,86 Z" id="Shape" fill="#000000" fill-rule="nonzero" opacity="0.05"></path>
                <path d="M219,98 C219,98 212.587437,104.443563 213.021038,104.973221 C213.45464,105.502879 219,98 219,98 Z" id="Shape" fill="#000000" fill-rule="nonzero" opacity="0.05"></path>
                <path d="M223,84.3738238 C220.621891,85.1649024 215.063018,87.0143647 215,86.9999158 L215.308458,85.6200436 C216.187396,84.7820059 217.567164,84.7820059 217.567164,84.7820059 C218.129022,84.1677808 218.588098,83.4514363 218.923715,82.6652385 C218.980445,82.4045024 219.143842,82.1865057 219.367044,82.0737698 C219.590246,81.9610339 219.848594,81.9660139 220.067993,82.0872816 C220.469479,81.7096207 220.906385,81.3790829 221.371476,81.1011425 C222.011609,80.7399194 222.754561,81.4623656 222.754561,81.4623656 L222.834163,84.1281921 C222.834163,84.1281921 222.897181,84.2257224 223,84.3738238 Z" id="Shape" fill="#000000" fill-rule="nonzero" opacity="0.05"></path>
                <path d="M223,84.3758297 C220.621891,85.1673786 215.063018,87.0179405 215,86.9998686 L215.308458,85.6227903 C216.187396,84.7842545 217.567164,84.7842545 217.567164,84.7842545 C218.129022,84.1696642 218.588098,83.4528938 218.923715,82.6662286 C218.980445,82.4053375 219.143842,82.1872111 219.367044,82.0744082 C219.590246,81.9616053 219.848594,81.9665882 220.067993,82.087928 C220.468563,81.7087573 220.9056,81.377924 221.371476,81.1012026 C222.011609,80.7397647 222.754561,81.4626405 222.754561,81.4626405 L222.834163,84.1336663 C222.834163,84.1336663 222.897181,84.2204114 223,84.3758297 Z" id="Shape" fill="#D39999" fill-rule="nonzero"></path>
                <path d="M216.298731,83.1395509 C216.760092,83.7816926 216.889273,86.1564767 216.889273,86.1564767 L215.602076,87 L213.156863,81.1941278 L213.046136,78.1772021 L213,78.0062176 L213.036909,78.0404145 C213.223665,77.1825525 213.859991,76.4360764 214.77624,76 L216.441753,77.8276339 L217,80.0200345 C217,80.0200345 216.847751,80.3278066 215.88812,80.9357513 C214.928489,81.543696 216.298731,83.1395509 216.298731,83.1395509 Z" id="Shape" fill="#000000" fill-rule="nonzero" opacity="0.05"></path>
                <path d="M216.298731,83.129489 C216.760092,83.7714088 216.893887,86.1453729 216.893887,86.1453729 L215.60669,87 L213.161476,81.1961326 L213.05075,78.1802486 L213,78.0093232 L213.036909,78.0435083 C213.224783,77.185354 213.860628,76.438311 214.77624,76 L216.441753,77.8308011 L217,80.0224448 C217,80.0224448 216.847751,80.3301105 215.88812,80.9378453 C214.928489,81.5455801 216.298731,83.129489 216.298731,83.129489 Z" id="Shape" fill="#D39999" fill-rule="nonzero"></path>
                <path d="M228.999686,73.003836 C228.997646,77.4215546 225.415091,81.0013598 220.99738,80.9999996 C216.57967,80.9986394 212.99932,77.4166288 213,72.9989098 C213.00068,68.5811908 216.582132,65.0002823 220.999843,65.0002818 C223.127619,64.9823584 225.173404,65.8199506 226.677675,67.3249195 C228.181947,68.8298884 229.018592,70.8760639 228.999686,73.003836 Z" id="Shape" fill="#000000" fill-rule="nonzero" opacity="0.05"></path>
                <path d="M228.999876,72.9962523 C229.001369,76.2325497 227.052823,79.1509418 224.06316,80.3901093 C221.073497,81.6292768 217.631735,80.9450808 215.343327,78.6566727 C213.054919,76.3682647 212.370723,72.9265035 213.609891,69.9368401 C214.849058,66.9471768 217.76745,64.9986306 221.003748,65.0001244 C223.12807,64.9882509 225.168823,65.8268842 226.670969,67.3290307 C228.173116,68.8311772 229.011749,70.8719296 228.999876,72.9962523 Z" id="Shape" fill="#F6BAC2" fill-rule="nonzero"></path>
                <path d="M227.999989,72.7079981 C228.00238,74.119162 227.626286,75.5035493 226.913247,76.708249 C226.802848,76.5055696 226.737299,76.2708882 226.6269,76.0646531 C226.471651,75.776635 226.112854,75.5348421 225.847206,75.7090752 C225.735963,75.8026888 225.651331,75.9255449 225.602258,76.0646531 C225.384909,76.5375716 224.998513,77.0104902 224.491367,76.9998229 C224.039908,76.9500008 223.664476,76.6195426 223.546074,76.1677707 C223.439591,75.7233821 223.420819,75.2614729 223.490875,74.8094632 C223.566774,73.8849608 223.580574,72.8182272 222.914729,72.195966 C222.484926,71.8719537 221.993465,71.6453467 221.472641,71.5310353 C220.965495,71.360358 220.437649,71.0901188 220.23065,70.5851982 C220.092652,70.2296204 220.127151,69.8527078 220.002952,69.5184647 C219.74235,68.975 219.241932,68.5957999 218.660913,68.501512 C218.001466,69.0627482 217.166286,69.3572638 216.311482,69.3300084 C215.528148,69.3109417 214.750788,69.1841847 214,68.9530958 C215.656311,65.8900663 219.111038,64.3668543 222.404246,65.2476083 C225.697455,66.1283622 227.997692,69.190714 227.999989,72.6973307 L227.999989,72.7079981 Z" id="Shape" fill="#000000" fill-rule="nonzero" opacity="0.05"></path>
                <path d="M220.268477,68.1768914 C220.393644,68.5400956 220.358875,68.9323561 220.497949,69.266504 C220.703084,69.782254 221.238519,70.0582892 221.749616,70.2326273 C222.274028,70.34892 222.769178,70.5790843 223.202941,70.9081871 C223.873973,71.5474266 223.860066,72.6370392 223.783575,73.5813702 C223.712974,74.0430745 223.731892,74.5148907 223.839205,74.9688104 C223.96025,75.4291324 224.337695,75.7658639 224.791863,75.8187083 C225.30296,75.8187083 225.692367,75.3465428 225.911409,74.8634811 C225.96117,74.721557 226.046408,74.5961443 226.158266,74.5002769 C226.425983,74.3150428 226.787576,74.5620216 226.944034,74.8634811 C227.05353,75.1780299 227.204489,75.4750872 227.392548,75.7460674 C227.643929,75.9725565 227.986421,76.0541789 228.306961,75.9639899 C228.621473,75.8742112 228.914177,75.7157563 229.165743,75.4990885 C229.862462,74.992463 230.415081,74.2984657 230.765096,73.4905692 C231.110571,72.672584 231.073328,71.7334702 230.664267,70.9481396 C230.403503,70.4905023 229.989757,70.123666 229.826345,69.6188121 C229.541243,68.750754 230.076679,67.8572716 230.40698,67.0073737 C230.723523,66.2301419 230.825882,65.3759771 230.702512,64.5412171 C230.573047,63.7015377 230.125735,62.9515379 229.461276,62.4600568 C228.140072,61.5411502 226.352969,62.046004 224.823154,61.6028949 C224.275822,61.4152092 223.742428,61.185773 223.227279,60.9164389 C222.446538,60.5541759 221.630506,60.2813901 220.793482,60.1028614 C219.962514,59.9285234 218.957704,59.9067311 218.432699,60.6004512 C218.289102,60.8228457 218.161276,61.0559187 218.050245,61.2978033 C217.718893,61.8783817 217.177371,62.2947947 216.548245,62.4527928 C216.099731,62.5653861 215.630356,62.5363297 215.157504,62.6053385 C214.690265,62.6392421 214.263638,62.8948662 213.999712,63.2990586 C213.770239,63.7349037 213.867591,64.2651818 213.923221,64.7518755 C213.978851,65.2385692 213.951036,65.8196959 213.575536,66.1211554 C213.398216,66.2628051 213.154836,66.3318139 213.047054,66.5315762 C212.945307,66.7725503 213.012523,67.0549108 213.210466,67.2180322 C213.405953,67.3725583 213.633399,67.4770517 213.874545,67.5231237 C214.73919,67.8051628 215.63605,67.9651794 216.541291,67.9989213 C217.456226,68.0299784 218.346729,67.6873232 219.023764,67.0436942 C218.964657,67.1054389 218.582204,67.0800146 218.512667,67.0763826 C219.187176,67.1526554 220.014667,67.4650111 220.268477,68.1768914 Z" id="Shape" fill="#7E646B" fill-rule="nonzero"></path>
                <g id="Group" opacity="0.05" transform="translate(213.000000, 64.000000)" fill="#000000" fill-rule="nonzero">
                    <path d="M17.1800905,11.5137838 C16.917424,11.7230674 16.6130129,11.8773785 16.2859729,11.967027 C15.9527514,12.0508313 15.5983719,11.9707482 15.3375566,11.7527027 C15.1398785,11.4911442 14.9814366,11.2036846 14.8669683,10.8989189 C14.7040724,10.6143243 14.3276018,10.3754054 14.0488688,10.5475676 C13.9338938,10.6416418 13.8454517,10.7625469 13.7918552,10.8989189 C13.5674208,11.3662162 13.158371,11.8335135 12.6262443,11.822973 C12.153073,11.774291 11.7599425,11.4472261 11.638009,11.0008108 C11.5250754,10.5619412 11.5041484,10.1055203 11.5764706,9.65864865 C11.6597285,8.74513514 11.6705882,7.69459459 10.9755656,7.07621622 C10.523189,6.75615874 10.0063666,6.53228001 9.45882353,6.41918919 C8.93031674,6.25054054 8.37285068,5.98351351 8.15565611,5.48459459 C8.01085973,5.13324324 8.04705882,4.76081081 7.91674208,4.43054054 C7.70316742,3.87189189 7.09864253,3.56621622 6.50859729,3.42567568 C5.81427685,3.97645695 4.93990822,4.26807018 4.04343891,4.24783784 C3.10097841,4.21228089 2.16745353,4.05634418 1.26696833,3.78405405 C1.01667519,3.73906889 0.780227016,3.63933917 0.575565611,3.49243243 C0.533373297,3.45450503 0.495729015,3.41207399 0.463348416,3.36594595 C0.303418321,3.43237991 0.16379646,3.53764845 0.057918552,3.67162162 C-0.0480152824,3.90473169 0.0219667999,4.17787762 0.228054299,4.33567568 C0.431584487,4.4851589 0.668389084,4.58624233 0.919457014,4.63081081 C1.81967838,4.90364572 2.75343991,5.05844033 3.6959276,5.09108108 C4.59115284,5.11427735 5.46502197,4.82364944 6.15746606,4.27243243 C6.74751131,4.41297297 7.35565611,4.71513514 7.56923077,5.27378378 C7.69954751,5.62513514 7.66334842,6.00459459 7.8081448,6.32783784 C8.02533937,6.82675676 8.57918552,7.09378378 9.11131222,7.26243243 C9.65730132,7.37493006 10.1728244,7.59758311 10.6244344,7.91594595 C11.3230769,8.53432432 11.3085973,9.58837838 11.2289593,10.5018919 C11.1554533,10.9485288 11.1751492,11.4049476 11.2868778,11.8440541 C11.4129031,12.2893539 11.8058784,12.6150963 12.278733,12.6662162 C12.8108597,12.6662162 13.2162896,12.2094595 13.4443439,11.7421622 C13.4961519,11.6048696 13.5848974,11.4835496 13.7013575,11.3908108 C13.9800905,11.2116216 14.3565611,11.4505405 14.519457,11.7421622 C14.6332441,12.047223 14.7917361,12.3347736 14.9900452,12.5959459 C15.2503518,12.8150078 15.6058769,12.8940328 15.9384615,12.8067568 C16.2659152,12.7199078 16.5706621,12.566624 16.8325792,12.357027 C17.5579651,11.8669348 18.133322,11.1955855 18.4977376,10.4140541 C18.5620687,10.263659 18.6141146,10.1085864 18.6533937,9.95027027 C18.282745,10.5674254 17.7804127,11.1005155 17.1800905,11.5137838 Z" id="Shape"></path>
                    <path d="M17.9040724,4.62027027 C18.0276018,4.45864865 18.1452489,4.29702703 18.2570136,4.13891892 C18.3687783,3.98081081 18.4099548,3.89297297 18.4746606,3.76648649 C18.2582226,4.04457128 18.0677348,4.32960232 17.9040724,4.62027027 Z" id="Shape"></path>
                    <path d="M1.00679053,2.41027027 C1.48743551,2.11162162 1.52108066,1.57756757 1.44417746,1.1172973 C1.38750918,0.84867666 1.35699167,0.577454798 1.35285491,0.305675676 C1.25037182,0.378834062 1.16149191,0.461524668 1.08850018,0.551621622 C0.771274491,0.973243243 0.905855085,1.48621622 0.982758281,1.95702703 C1.00791014,2.10736183 1.01594849,2.25896335 1.00679053,2.41027027 Z" id="Shape"></path>
                </g>
                <path d="M214,118.823766 C213.350559,118.869587 212.439246,118.918933 211.342877,118.957704 C210.581704,118.982377 209.729749,119 208.818436,119 C208.022346,119 207.180866,119 206.307961,118.961229 C203.547007,118.889273 200.795634,118.602929 198.078212,118.104733 C194.450419,117.399799 191.094972,116.183787 189,114.125378 C189.349162,113.441591 189.666899,112.874119 189.785615,112.673212 C189.785615,112.475831 189.785615,112.246727 189.764665,112 C193.448324,113.762336 204.932263,118.658107 213.734637,115.87714 C213.734637,116.169688 213.776536,116.363545 213.776536,116.363545 L213.975559,116.532729 C213.874302,116.899295 213.937151,118.104733 214,118.823766 Z" id="Shape" fill="#000000" fill-rule="nonzero" opacity="0.05"></path>
                <path d="M214,118.827291 C213.350559,118.873112 212.439246,118.922457 211.342877,118.957704 C210.581704,118.985901 209.729749,119 208.818436,119 C208.022346,119 207.180866,119 206.307961,118.961229 C203.547094,118.890493 200.795717,118.605327 198.078212,118.108258 C194.450419,117.403323 191.094972,116.183787 189,114.125378 C189.349162,113.441591 189.666899,112.877644 189.785615,112.673212 C189.785615,112.475831 189.785615,112.250252 189.764665,112 C193.448324,113.762336 204.932263,118.661631 213.734637,115.894763 C213.734637,116.187311 213.776536,116.381168 213.776536,116.381168 L213.975559,116.550352 C213.874302,116.90282 213.937151,118.108258 214,118.827291 Z" id="Shape" fill="#4B4442" fill-rule="nonzero"></path>
                <path d="M36.1298578,275 C35.2670388,273.956599 34.8715238,272.601512 35.0368608,271.255247 L50.7518078,142.077359 L52.0548596,131.347407 C52.3569375,128.878372 54.4349054,127.017339 56.9110417,126.9982 L102.941524,126.690608 C104.265619,126.682455 105.530642,126.138889 106.451061,125.1826 C107.371481,124.226311 107.869716,122.937905 107.833309,121.608188 L107.815508,121.118187 C107.770147,119.777086 108.268695,118.474946 109.196947,117.510052 C110.1252,116.545159 111.403612,116.000196 112.739334,116 L161.108902,116 C163.824091,115.999994 166.026839,118.208088 166.032729,120.935778 C166.032453,121.158213 166.018183,121.380408 165.990006,121.601035 C165.804557,122.99323 166.217011,124.398983 167.124461,125.467555 C168.031911,126.536127 169.348778,127.166745 170.746501,127.20207 L217.200653,128.393094 C218.629968,128.428404 219.973308,129.086552 220.881058,130.196252 C221.788808,131.305952 222.171183,132.757442 221.928666,134.172961 L198.70515,270.443347 L198.267239,273.018536 C198.158996,273.676434 197.916576,274.304759 197.555189,274.864087 L36.1298578,275 Z" id="Shape" fill="#B7B6CC" fill-rule="nonzero"></path>
                <g id="Group" opacity="0.5" transform="translate(123.000000, 87.000000)" fill="url(#linearGradient-2)" fill-rule="nonzero">
                    <rect id="Rectangle-path" transform="translate(39.010838, 47.966939) rotate(-55.360000) translate(-39.010838, -47.966939) " x="-8.22588961" y="33.606026" width="94.4734562" height="28.7218251"></rect>
                </g>
                <rect id="Rectangle-path" fill="#F9FAFB" fill-rule="nonzero" transform="translate(161.500000, 135.500000) rotate(34.640000) translate(-161.500000, -135.500000) " x="148" y="89" width="27" height="93"></rect>
                <rect id="Rectangle-path" fill="#F7B643" fill-rule="nonzero" transform="translate(180.500000, 105.500000) rotate(34.804012) translate(-180.500000, -105.500000) " x="171" y="96" width="19" height="19"></rect>
                <rect id="Rectangle-path" fill="#F7B643" fill-rule="nonzero" opacity="0.5" transform="translate(168.500000, 124.500000) rotate(34.640000) translate(-168.500000, -124.500000) " x="159" y="115" width="19" height="19"></rect>
                <rect id="Rectangle-path" fill="#F7B643" fill-rule="nonzero" opacity="0.3" transform="translate(155.500000, 143.500000) rotate(34.640000) translate(-155.500000, -143.500000) " x="146" y="134" width="19" height="19"></rect>
                <g id="Group" opacity="0.5" transform="translate(119.000000, 83.000000)" fill="url(#linearGradient-3)" fill-rule="nonzero">
                    <rect id="Rectangle-path" transform="translate(27.099357, 49.004861) rotate(-73.710000) translate(-27.099357, -49.004861) " x="-19.4134715" y="34.6861705" width="93.0256579" height="28.6373818"></rect>
                </g>
                <rect id="Rectangle-path" fill="#F9FAFB" fill-rule="nonzero" transform="translate(145.500000, 132.000000) rotate(16.290000) translate(-145.500000, -132.000000) " x="132" y="86" width="27" height="92"></rect>
                <rect id="Rectangle-path" fill="#F97878" fill-rule="nonzero" transform="translate(155.500000, 98.500000) rotate(16.290000) translate(-155.500000, -98.500000) " x="146" y="89" width="19" height="19"></rect>
                <rect id="Rectangle-path" fill="#F97878" fill-rule="nonzero" opacity="0.5" transform="translate(148.500000, 121.500000) rotate(16.290000) translate(-148.500000, -121.500000) " x="139" y="112" width="19" height="19"></rect>
                <rect id="Rectangle-path" fill="#F97878" fill-rule="nonzero" opacity="0.3" transform="translate(142.500000, 143.500000) rotate(16.290000) translate(-142.500000, -143.500000) " x="133" y="134" width="19" height="19"></rect>
                <g id="Group" opacity="0.5" transform="translate(119.000000, 84.000000)" fill="url(#linearGradient-4)" fill-rule="nonzero">
                    <rect id="Rectangle-path" transform="translate(18.382415, 48.560633) rotate(-85.400000) translate(-18.382415, -48.560633) " x="-29.1099867" y="34.1295221" width="94.9848039" height="28.8622224"></rect>
                </g>
                <rect id="Rectangle-path" fill="#F9FAFB" fill-rule="nonzero" transform="translate(136.500000, 132.000000) rotate(4.600000) translate(-136.500000, -132.000000) " x="123" y="86" width="27" height="92"></rect>
                <rect id="Rectangle-path" fill="#73B53B" fill-rule="nonzero" transform="translate(140.500000, 97.500000) rotate(4.600000) translate(-140.500000, -97.500000) " x="131" y="88" width="19" height="19"></rect>
                <rect id="Rectangle-path" fill="#73B53B" fill-rule="nonzero" opacity="0.5" transform="translate(137.500000, 121.500000) rotate(4.600000) translate(-137.500000, -121.500000) " x="128" y="112" width="19" height="19"></rect>
                <rect id="Rectangle-path" fill="#73B53B" fill-rule="nonzero" opacity="0.3" transform="translate(135.500000, 143.500000) rotate(4.600000) translate(-135.500000, -143.500000) " x="126" y="134" width="19" height="19"></rect>
                <g id="Group" opacity="0.5" transform="translate(114.000000, 86.000000)" fill="url(#linearGradient-1)" fill-rule="nonzero">
                    <rect id="Rectangle-path" transform="translate(16.555396, 48.034346) rotate(-2.610000) translate(-16.555396, -48.034346) " x="2.29797699" y="0.960188416" width="28.5148387" height="94.1483146"></rect>
                </g>
                <rect id="Rectangle-path" fill="#FFFFFF" fill-rule="nonzero" transform="translate(130.500000, 135.000000) rotate(-2.610000) translate(-130.500000, -135.000000) " x="117" y="89" width="27" height="92"></rect>
                <rect id="Rectangle-path" fill="#4285F4" fill-rule="nonzero" transform="translate(129.500000, 99.500000) rotate(-2.610000) translate(-129.500000, -99.500000) " x="120" y="90" width="19" height="19"></rect>
                <rect id="Rectangle-path" fill="#4285F4" fill-rule="nonzero" opacity="0.5" transform="translate(130.500000, 122.500000) rotate(-2.862405) translate(-130.500000, -122.500000) " x="121" y="113" width="19" height="19"></rect>
                <rect id="Rectangle-path" fill="#4285F4" fill-rule="nonzero" opacity="0.3" transform="translate(130.500000, 146.500000) rotate(-2.610000) translate(-130.500000, -146.500000) " x="121" y="137" width="19" height="19"></rect>
                <path d="M127,211.753113 L102.561968,221.201546 L66.8445685,235 C65.4945005,232.481377 63.5072004,229.077639 61.0482764,225.01546 C52.5878501,211.004722 38.5903447,189.211441 26.1265166,170.059115 C12.085809,148.470921 0,130.254083 0,130.254083 L8.74844087,127.73546 L80.2120422,107 L127,211.753113 Z" id="Shape" fill="#E6ECF8" fill-rule="nonzero"></path>
                <path d="M126,210.812297 L101.819881,220.175871 C88.3121968,222.992832 74.5279758,224.260888 60.7336276,223.955531 C52.3624905,210.070628 38.5127112,188.473077 26.1804232,169.492764 L9,127.534967 L79.7058304,107 L126,210.812297 Z" id="Shape" fill="#000000" fill-rule="nonzero" opacity="0.1"></path>
                <path d="M143,204.943935 C143,204.943935 105.533213,227.315133 49.5941813,222.254896 L5,112.514807 L26.3715242,108.806597 L100.253399,96 L142.179248,202.8101 L143,204.943935 Z" id="Shape" fill="#4285F4" fill-rule="nonzero"></path>
                <path d="M144,201.750115 C135.085885,202.183299 124.771648,202.140691 114.396379,200.915704 C103.166677,199.609051 91.8723535,196.91763 82.1899662,191.982175 C74.0943848,187.859827 67.1727524,183.375309 61.1378644,177.996018 C45.4385394,164.031166 35.7238417,144.055 27,108.679504 L101.651672,96 L144,201.750115 Z" id="Shape" fill="#000000" fill-rule="nonzero" opacity="0.1"></path>
                <g id="Shape" fill-rule="nonzero">
                    <use fill="black" fill-opacity="1" filter="url(#filter-6)" xlink:href="#path-5"></use>
                    <use fill="#FFFFFF" xlink:href="#path-5"></use>
                </g>
                <path d="M115,198 C103.824806,196.700899 92.585305,194.025032 82.9499157,189.1181 C74.8936299,185.019576 68.0091675,180.560976 62,175.212773 C78.4626896,173.89249 80.8277722,165 80.8277722,165 C93.0318841,184.137035 115,198 115,198 Z" id="Shape" fill="#000000" fill-rule="nonzero" opacity="0.1"></path>
                <path d="M46,98.7291391 C46,98.7291391 83.8339454,96.5 94.3977821,88 L96,93.3664459 C96,93.3664459 71.0018002,104.861148 46,105 L46,98.7291391 Z" id="Shape" fill="#4285F4" fill-rule="nonzero" opacity="0.3"></path>
                <path d="M46,123.109102 C46,123.109102 81.9326748,121.138195 109.081728,108 L110,110.101828 C110,110.101828 88.4559351,122.702182 46,126 L46,123.109102 Z" id="Shape" fill="#4285F4" fill-rule="nonzero" opacity="0.3"></path>
                <path d="M49,133.109102 C49,133.109102 84.9346578,131.138195 112.081678,118 L113,120.101828 C113,120.101828 91.4547461,132.698644 49,136 L49,133.109102 Z" id="Shape" fill="#4285F4" fill-rule="nonzero" opacity="0.3"></path>
                <path d="M52,142.109102 C52,142.109102 87.9346578,140.138195 115.08521,127 L116,129.101828 C116,129.101828 94.4547461,141.702182 52,145 L52,142.109102 Z" id="Shape" fill="#4285F4" fill-rule="nonzero" opacity="0.3"></path>
                <path d="M55,153.109102 C55,153.109102 90.9346578,151.138195 118.081678,138 L119,140.101828 C119,140.101828 97.4547461,152.702182 55,156 L55,153.109102 Z" id="Shape" fill="#4285F4" fill-rule="nonzero" opacity="0.3"></path>
                <path d="M58,162.109102 C58,162.109102 93.9346578,160.138195 121.08521,147 L122,149.101828 C122,149.101828 100.454746,161.698644 58,165 L58,162.109102 Z" id="Shape" fill="#4285F4" fill-rule="nonzero" opacity="0.3"></path>
                <path d="M313.71122,285.018992 C313.71122,285.018992 298.337452,284.138289 300.148269,294.371707 C300.148269,294.371707 299.784651,296.178011 301.515473,297 C301.515473,297 301.540926,296.240178 303.089939,296.499208 C303.64234,296.58746 304.203835,296.612966 304.762582,296.575191 C305.516511,296.527203 306.233079,296.245737 306.802479,295.773924 C306.802479,295.773924 311.125897,294.07814 312.805812,287.370985 C312.805812,287.370985 314.049385,285.906602 313.998479,285.530144 L311.405882,286.566265 C311.405882,286.566265 312.29311,288.344939 311.594964,289.819684 C311.594964,289.819684 311.511332,286.631886 311.013175,286.711322 C310.911362,286.711322 309.664152,287.326087 309.664152,287.326087 C309.664152,287.326087 311.187712,290.434449 310.02777,292.672469 C310.02777,292.672469 310.464112,288.856092 309.176904,287.55058 L307.358814,288.562524 C307.358814,288.562524 309.140542,291.760683 307.933331,294.371707 C307.933331,294.371707 308.242406,290.368828 306.973379,288.807739 L305.318917,290.033815 C305.318917,290.033815 306.995196,293.187076 305.97343,295.352568 C305.97343,295.352568 305.838891,290.690025 304.958935,290.337744 C304.958935,290.337744 303.504463,291.550005 303.293565,292.064612 C303.293565,292.064612 304.438962,294.350985 303.72627,295.559792 C303.72627,295.559792 303.289929,292.45143 302.933583,292.45143 C302.933583,292.45143 301.479111,294.523672 301.340936,295.905166 C301.340936,295.905166 301.402751,293.805295 302.58451,292.240752 C301.751973,292.391751 300.983759,292.769787 300.373712,293.328679 C300.373712,293.328679 300.599156,291.871203 302.940855,291.746868 C302.940855,291.746868 304.133522,290.18578 304.44987,290.089075 C304.44987,290.089075 302.122715,289.906027 300.711877,290.50007 C300.711877,290.50007 301.955451,289.118576 304.878939,289.750609 L306.511584,288.486542 C306.511584,288.486542 303.446284,288.085909 302.148168,288.527987 C302.148168,288.527987 303.642638,287.312272 306.951562,288.182613 L308.729654,287.174122 C308.729654,287.174122 306.118877,286.638793 304.562592,286.828749 C304.562592,286.828749 306.202509,285.986037 309.253264,286.897824 L310.522291,286.355587 C310.522291,286.355587 308.60966,286.010214 308.049688,285.941139 C307.489717,285.872064 307.456991,285.740822 307.456991,285.740822 C308.669567,285.546585 309.915165,285.678173 311.053173,286.120733 C311.053173,286.120733 313.754855,285.181317 313.71122,285.018992 Z" id="Shape" fill="#4285F4" fill-rule="nonzero"></path>
                <ellipse id="Oval" fill="#4285F4" fill-rule="nonzero" opacity="0.1" cx="302.5" cy="299" rx="10.5" ry="2"></ellipse>
                <ellipse id="Oval" fill="#4285F4" fill-rule="nonzero" opacity="0.1" cx="227.5" cy="292.5" rx="36.5" ry="3.5"></ellipse>
                <path d="M319.847648,250.01112 C319.847648,250.01112 312.162644,249.496602 313.075299,255.467163 C312.978827,256.08742 313.253446,256.706041 313.755759,257 C313.755759,257 313.771883,256.556942 314.545866,256.70701 C314.82182,256.757371 315.102147,256.771762 315.381122,256.749887 C315.757564,256.722897 316.115593,256.559707 316.4002,256.285391 C316.4002,256.285391 318.560902,255.295657 319.402608,251.38317 C319.402608,251.38317 320.025019,250.529212 319.99922,250.311256 L318.709248,250.922247 C318.709248,250.922247 319.151063,251.962004 318.802771,252.823108 C318.802771,252.823108 318.760847,250.961551 318.512528,251.004427 C318.460929,251.004427 317.838518,251.361732 317.838518,251.361732 C317.838518,251.361732 318.599601,253.148255 318.025564,254.481002 C318.025564,254.481002 318.244859,252.254994 317.599873,251.490362 L316.687218,252.083488 C316.687218,252.083488 317.577298,253.948618 316.974237,255.470736 C316.974237,255.470736 317.129033,253.133963 316.493723,252.226409 L315.668141,252.941019 C315.668141,252.941019 316.503397,254.781138 315.990634,256.042423 C315.990634,256.042423 315.92291,253.323335 315.48432,253.119671 C315.171087,253.413952 314.890684,253.748614 314.649064,254.116551 C314.649064,254.116551 315.223101,255.452871 314.868359,256.156761 C314.868359,256.156761 314.649064,254.345226 314.471693,254.33808 C314.471693,254.33808 313.749309,255.535051 313.675135,256.356852 C313.71014,255.594297 313.924724,254.855183 314.297547,254.213023 C313.880453,254.300055 313.495731,254.521259 313.191396,254.849026 C313.191396,254.849026 313.304269,253.998641 314.481367,253.92718 C314.481367,253.92718 315.077979,253.016053 315.236001,252.958884 C315.236001,252.958884 314.071802,252.851693 313.365542,253.198278 C313.365542,253.198278 313.987953,252.397916 315.448846,252.762366 L316.267978,252.022746 C316.267978,252.022746 314.732912,251.790498 314.084701,252.047757 C314.084701,252.047757 314.832885,251.333148 316.487273,251.854813 L317.377353,251.26526 C316.692561,251.099169 315.991094,251.033102 315.290824,251.068742 C315.290824,251.068742 316.113181,250.575662 317.635347,251.108046 L318.280333,250.793618 C318.280333,250.793618 317.312854,250.582808 317.04196,250.55065 C316.771066,250.518493 316.745267,250.43274 316.745267,250.43274 C317.352055,250.320914 317.974944,250.397595 318.544777,250.654269 C318.544777,250.654269 319.873447,250.10402 319.847648,250.01112 Z" id="Shape" fill="#4285F4" fill-rule="nonzero"></path>
                <ellipse id="Oval" fill="#4285F4" fill-rule="nonzero" opacity="0.1" cx="314" cy="257" rx="6" ry="1"></ellipse>
                <path d="M270.774066,255.012745 C270.774066,255.012745 259.811212,254.424104 261.106338,261.247608 C260.968355,261.956956 261.360548,262.664507 262.077681,263 C262.077681,263 262.077681,262.492551 263.220439,262.6617 C263.614163,262.720792 264.014434,262.737828 264.412716,262.712445 C264.950582,262.680632 265.461805,262.492842 265.867827,262.177932 C265.867827,262.177932 268.949463,261.048011 270.149358,256.57569 C270.149358,256.57569 271.0369,255.601387 270.998808,255.347662 L269.128495,256.051325 C269.128495,256.051325 269.760821,257.235374 269.261817,258.219826 C269.261817,258.219826 269.20087,256.095304 268.846615,256.142666 C268.77424,256.142666 267.886699,256.555392 267.886699,256.555392 C267.886699,256.555392 268.972318,258.61902 268.153342,260.12107 C268.153342,260.12107 268.465696,257.577057 267.54768,256.704243 L266.244937,257.380843 C266.244937,257.380843 267.513398,259.515514 266.65252,261.254374 C266.65252,261.254374 266.873454,258.58519 265.970675,257.533078 L264.789826,258.351763 C264.789826,258.351763 265.985912,260.452604 265.254547,261.897143 C265.254547,261.897143 265.163127,258.788169 264.53461,258.554743 C264.53461,258.554743 263.502319,259.363279 263.346142,259.694812 C263.346142,259.694812 264.161309,261.220544 263.654687,262.025697 C263.654687,262.025697 263.342333,259.955303 263.087117,259.945154 C263.087117,259.945154 262.062445,261.318651 261.94436,262.255741 C261.9957,261.386823 262.30164,260.544873 262.831901,259.813217 C262.238651,259.913699 261.69165,260.166597 261.258705,260.540562 C261.258705,260.540562 261.418691,259.569642 263.087117,259.485067 C263.087117,259.485067 263.936567,258.443104 264.165118,258.38221 C264.165118,258.38221 262.504311,258.257039 261.498684,258.652849 C261.498684,258.652849 262.382417,257.73944 264.466045,258.155549 L265.631657,257.3098 C265.631657,257.3098 263.44899,257.045926 262.519548,257.336864 C262.519548,257.336864 263.586121,256.528328 265.94782,257.120352 L267.216281,256.443753 C267.216281,256.443753 265.353586,256.088538 264.241302,256.217092 C264.241302,256.217092 265.414533,255.655515 267.585772,256.264454 L268.49236,255.902473 C268.49236,255.902473 267.128669,255.665664 266.728704,255.628451 C266.328739,255.591238 266.309693,255.493131 266.309693,255.493131 C267.173802,255.363039 268.061643,255.44974 268.873279,255.743472 C268.873279,255.743472 270.808348,255.117618 270.774066,255.012745 Z" id="Shape" fill="#4285F4" fill-rule="nonzero"></path>
                <ellipse id="Oval" fill="#4285F4" fill-rule="nonzero" opacity="0.1" cx="263" cy="264" rx="7" ry="1"></ellipse>
                <ellipse id="Oval" fill="#4285F4" fill-rule="nonzero" opacity="0.1" cx="123.5" cy="293" rx="10.5" ry="2"></ellipse>
                <path d="M116,284.424603 C116,284.424603 122.178468,284.231026 124.043598,282.868542 C125.908728,281.506058 133.550327,279.890435 134.013893,282.060731 C134.477459,284.231026 143.303325,292.938267 136.324481,292.997829 C129.345636,293.057392 120.110528,291.881039 118.24902,290.715855 C116.387512,289.55067 116,284.424603 116,284.424603 Z" id="Shape" fill="#A8A8A8" fill-rule="nonzero"></path>
                <path d="M136.449694,292.272001 C129.472612,292.327407 120.239836,291.233144 118.378798,290.14927 C116.966726,289.325109 116.401897,286.364366 116.20638,285 L116,285 C116,285 116.391035,289.768355 118.248453,290.85223 C120.10587,291.936104 129.367612,293.03383 136.32659,292.999202 C138.339698,292.981887 139.034871,292.30663 138.998664,291.267773 C138.71625,291.877236 137.948662,292.261613 136.449694,292.272001 Z" id="Shape" fill="#000000" fill-rule="nonzero" opacity="0.2"></path>
                <polygon id="Rectangle-path" fill="url(#linearGradient-7)" fill-rule="nonzero" transform="translate(279.500000, 46.499993) rotate(-71.990000) translate(-279.500000, -46.499993) " points="249.145842 -8.00000683 310 -8.00000683 309.854158 100.999993 249 100.999993"></polygon>
                <rect id="Rectangle-path" fill="#FFFFFF" fill-rule="nonzero" transform="translate(280.000000, 46.000000) rotate(-71.990000) translate(-280.000000, -46.000000) " x="250" y="-8" width="60" height="108"></rect>
                <g id="Group" opacity="0.2" transform="translate(238.000000, 21.000000)" fill="#4285F4" fill-rule="nonzero">
                    <ellipse id="Oval" cx="11.4784375" cy="11.4525397" rx="11.27" ry="11.4488889"></ellipse>
                </g>
                <g id="Group" opacity="0.2" transform="translate(276.000000, 27.000000)" fill="#4285F4" fill-rule="nonzero">
                    <rect id="Rectangle-path" transform="translate(24.095649, 8.997622) rotate(-71.990000) translate(-24.095649, -8.997622) " x="22.557142" y="-14.8623968" width="3.07701493" height="47.7200368"></rect>
                </g>
                <g id="Group" opacity="0.2" transform="translate(274.000000, 34.000000)" fill="#4285F4" fill-rule="nonzero">
                    <rect id="Rectangle-path" transform="translate(12.364980, 5.403144) rotate(-71.990000) translate(-12.364980, -5.403144) " x="10.831051" y="-6.94524311" width="3.06785714" height="24.6967742"></rect>
                </g>
                <g id="Group" opacity="0.2" transform="translate(270.000000, 42.000000)" fill="#4285F4" fill-rule="nonzero">
                    <rect id="Rectangle-path" transform="translate(20.419571, 7.894785) rotate(-71.990000) translate(-20.419571, -7.894785) " x="18.9105167" y="-12.5724875" width="3.01810811" height="40.9345455"></rect>
                </g>
                <g id="Group" opacity="0.2" transform="translate(269.000000, 49.000000)" fill="#4285F4" fill-rule="nonzero">
                    <rect id="Rectangle-path" transform="translate(23.979078, 9.010978) rotate(-71.990000) translate(-23.979078, -9.010978) " x="22.4405709" y="-14.8490401" width="3.07701493" height="47.7200368"></rect>
                </g>
                <g id="Group" opacity="0.5" transform="translate(298.000000, 71.000000)" fill="#4285F4" fill-rule="nonzero">
                    <rect id="Rectangle-path" transform="translate(7.967311, 5.475301) rotate(-71.990000) translate(-7.967311, -5.475301) " x="4.80350162" y="-1.69556108" width="6.32761905" height="14.3417241"></rect>
                </g>
                <path d="M239,161.714637 L232.839373,157.237223 C232.839373,157.237223 223.05732,153.339727 220.339499,159.379905 C217.621678,165.420083 232.114387,162.302086 232.114387,162.302086 L238.275014,166 L239,161.714637 Z" id="Shape" fill="#AE6E79" fill-rule="nonzero"></path>
                <rect id="Rectangle-path" fill="#F9FAFB" fill-rule="nonzero" transform="translate(226.000000, 196.500000) rotate(-57.264774) translate(-226.000000, -196.500000) " x="196" y="150" width="60" height="93"></rect>
                <rect id="Rectangle-path" fill="#B7B6CC" fill-rule="nonzero" transform="translate(189.500000, 187.000000) rotate(-57.570000) translate(-189.500000, -187.000000) " x="181" y="185" width="17" height="4"></rect>
                <rect id="Rectangle-path" fill="#B7B6CC" fill-rule="nonzero" transform="translate(205.500000, 182.000000) rotate(-57.570000) translate(-205.500000, -182.000000) " x="187" y="180" width="37" height="4"></rect>
                <rect id="Rectangle-path" fill="#B7B6CC" fill-rule="nonzero" transform="translate(211.500000, 185.000000) rotate(-57.570000) translate(-211.500000, -185.000000) " x="193" y="183" width="37" height="4"></rect>
                <rect id="Rectangle-path" fill="#B7B6CC" fill-rule="nonzero" transform="translate(218.500000, 190.000000) rotate(-57.570000) translate(-218.500000, -190.000000) " x="200" y="188" width="37" height="4"></rect>
                <rect id="Rectangle-path" fill="#B7B6CC" fill-rule="nonzero" transform="translate(225.500000, 196.000000) rotate(-57.264774) translate(-225.500000, -196.000000) " x="207" y="194" width="37" height="4"></rect>
                <rect id="Rectangle-path" fill="#FFFFFF" fill-rule="nonzero" transform="translate(231.500000, 198.000000) rotate(-57.570000) translate(-231.500000, -198.000000) " x="213" y="196" width="37" height="4"></rect>
                <rect id="Rectangle-path" fill="#FFFFFF" fill-rule="nonzero" transform="translate(238.500000, 202.000000) rotate(-57.570000) translate(-238.500000, -202.000000) " x="220" y="200" width="37" height="4"></rect>
                <rect id="Rectangle-path" fill="#B7B6CC" fill-rule="nonzero" transform="translate(261.000000, 198.000000) rotate(-57.570000) translate(-261.000000, -198.000000) " x="256" y="193" width="10" height="10"></rect>
                <path d="M258.304067,290.940418 C255.204533,290.179022 250.425629,289.068193 247.994193,288.821751 C244.215609,288.453926 244.215609,283.672213 246.862443,284.253375 C248.293559,284.566025 249.564039,283.753134 250.421978,282.947599 C250.68243,282.695309 250.926331,282.42623 251.152139,282.142064 C251.464307,281.759599 251.895069,281.494017 252.375159,281.388025 C253.791672,281.079053 256.756126,280.608238 258.548671,281.590328 C258.967764,281.852734 259.306445,282.227064 259.527087,282.671731 C260.341216,284.143028 260.76471,286.589058 260.987409,288.556917 C261.063494,289.26933 260.791564,289.974617 260.258103,290.448468 C259.724642,290.922319 258.996057,291.105748 258.304067,290.940418 Z" id="Shape" fill="#BEBED0" fill-rule="nonzero"></path>
                <path d="M212.296446,293.938273 C209.201624,293.175841 204.424358,292.063499 201.993755,291.816721 C198.216467,291.448396 198.216467,286.660171 200.858744,287.245808 C202.588632,287.614133 204.07765,286.358145 204.8988,285.444699 C205.000988,285.334201 205.092226,285.227387 205.168867,285.127939 C205.482765,284.752483 205.911669,284.493283 206.387818,284.391289 C207.803845,284.078213 210.767283,283.606757 212.562863,284.593868 C213.095698,284.881162 213.519046,285.514681 213.858455,286.336045 C214.46793,287.809345 214.803689,289.871965 214.989817,291.57731 C215.057993,292.288849 214.78093,292.989722 214.246164,293.458489 C213.711398,293.927256 212.984989,294.10601 212.296446,293.938273 Z" id="Shape" fill="#BEBED0" fill-rule="nonzero"></path>
                <path d="M211,286.664807 C206.97556,292.047402 203.524644,286.563328 203,285.658477 C203.091242,285.531629 203.172709,285.409009 203.241141,285.294845 C203.521417,284.863831 203.904382,284.566276 204.329532,284.44919 C205.59389,284.089787 208.239919,283.548567 209.843177,284.681745 C210.318941,284.994638 210.713238,285.721901 211,286.664807 Z" id="Shape" fill="#000000" fill-rule="nonzero" opacity="0.1"></path>
                <path d="M258,282.229504 C256.287315,283.216912 250.521809,282.973442 250.521809,282.973442 C250.331812,282.804593 250.157367,282.623718 250,282.432396 C250.228382,282.246845 250.442252,282.048946 250.640256,281.839951 C250.913986,281.558661 251.291708,281.363334 251.712685,281.28538 C252.954782,281.058141 255.554222,280.711872 257.12605,281.434167 C257.499444,281.625213 257.802163,281.900702 258,282.229504 Z" id="Shape" fill="#000000" fill-rule="nonzero" opacity="0.1"></path>
                <path d="M259,282.187025 C257.701436,283.855178 250.303557,283.482886 250.303557,283.482886 C250.303557,283.482886 248.082047,281.259875 247.155523,276.448722 C246.229,271.637568 238.27306,256.266219 238.27306,256.266219 C236.42359,253.857062 234.942583,249.41462 234.942583,249.41462 L231.798127,229.232117 C231.798127,229.232117 216.626751,249.228474 216.812771,253.48835 C216.998791,257.748226 213.478717,274.608742 213.478717,274.608742 C212.18373,276.831753 212.18373,284.989951 212.18373,284.989951 C207.375824,290.00157 203.304844,284.062802 203.304844,284.062802 C202.378321,280.175218 203.859327,267.399171 203.859327,267.399171 C203.859327,267.399171 206.080838,256.659989 206.26328,249.994536 C206.445723,243.329084 208.670811,241.66451 208.670811,241.66451 C210.39885,234.794107 213.341669,228.288617 217.360099,222.455693 C218.47622,220.855555 219.216724,220 219.216724,220 L249.191013,223.518872 C248.616232,224.791646 248.184313,226.124294 247.903181,227.492369 C245.953547,235.868932 245.306053,250.921685 245.306053,250.921685 C252.153027,255.364127 254.188517,267.388432 254.188517,267.388432 C254.188517,270.520693 259,282.187025 259,282.187025 Z" id="Shape" fill="#5C5C8E" fill-rule="nonzero"></path>
                <g id="Group" opacity="0.05" transform="translate(207.000000, 220.000000)" fill="#000000" fill-rule="nonzero">
                    <path d="M23.4615753,11.8568617 L23.0695205,9.40138298 C23.0695205,9.40138298 7.67410959,29.3089362 7.86287671,33.5498936 C8.05164384,37.7908511 4.48321918,54.5764894 4.48321918,54.5764894 C3.16547945,56.7896277 3.16547945,64.9115957 3.16547945,64.9115957 C2.37932003,65.7825554 1.3628265,66.422758 0.22869863,66.7612234 C1.70616438,67.1425532 3.49582192,66.8610106 5.41979452,64.9115957 C5.41979452,64.9115957 5.41979452,56.8003191 6.73390411,54.5764894 C6.73390411,54.5764894 10.3023288,37.8015426 10.1135616,33.5498936 C9.96835616,30.2319681 19.3667808,17.3095213 23.4615753,11.8568617 Z" id="Shape"></path>
                    <path d="M48.0412329,47.3739894 C48.0412329,47.3739894 45.9756849,35.3923936 39.0312329,30.9803723 C39.0312329,30.9803723 39.6882877,15.9944681 41.6630822,7.65510638 C41.9493871,6.29292651 42.3889077,4.96617691 42.9735616,3.69925532 L12.5566438,0.203138298 C12.5566438,0.203138298 12.4840411,0.281542553 12.3533562,0.438351064 L40.7192466,3.70638298 C40.1359776,4.97350434 39.6976811,6.30023412 39.4123973,7.66223404 C37.4339726,16.0015957 36.7769178,30.9875 36.7769178,30.9875 C43.725,35.4102128 45.7905479,47.381117 45.7905479,47.381117 C45.7905479,50.5137234 50.6730822,62.1282447 50.6730822,62.1282447 C49.8962329,63.104734 46.9703425,63.3791489 44.6942466,63.439734 C46.5093151,63.4860638 51.834726,63.503883 52.9237671,62.1282447 C52.9237671,62.121117 48.0412329,50.5065957 48.0412329,47.3739894 Z" id="Shape"></path>
                </g>
                <path d="M215,216.868442 C214.778818,217.363547 214.4879,217.829924 214.134673,218.255666 C213.036237,219.613719 210.751066,221.409331 206.569239,220.916672 C205.94253,220.842965 205.403991,220.472757 205.150739,219.941551 C204.897488,219.410346 204.966705,218.796134 205.333057,218.32373 C206.675594,216.526819 208.602888,215.165463 210.839365,214.434318 C211.596061,214.205139 212.379768,214.059343 213.173983,214 L215,216.868442 Z" id="Shape" fill="#AE6E79" fill-rule="nonzero"></path>
                <path d="M254,166.263445 L239.00785,161 C239.00785,161 234.706824,163.154647 236.391091,166.204461 L250.989281,175 L254,166.263445 Z" id="Shape" fill="#42383C" fill-rule="nonzero"></path>
                <path d="M254,166.26475 L239.007247,161 C239.007247,161 234.707084,163.15171 236.391013,166.205751 L250.968204,175 L254,166.26475 Z" id="Shape" fill="#000000" fill-rule="nonzero" opacity="0.1"></path>
                <path d="M253.76661,156.372867 C253.76661,156.372867 253.585149,165.252603 257.37838,168.277047 C261.171611,171.30149 246.365099,173 246.365099,173 C246.365099,173 248.713622,163.930323 246.365099,159.207369 C244.016576,154.484416 253.76661,156.372867 253.76661,156.372867 Z" id="Shape" fill="#AE6E79" fill-rule="nonzero"></path>
                <path d="M250,223.47726 C249.422166,224.734983 248.987953,226.051872 248.705327,227.40377 C230.723758,230.106341 218.190605,222.745019 218.190605,222.745019 C218.122275,222.638898 218.057541,222.532776 218,222.426654 C219.12205,220.845438 219.866487,220 219.866487,220 L250,223.47726 Z" id="Shape" fill="#000000" fill-rule="nonzero" opacity="0.1"></path>
                <path d="M216,217.363914 C215.734197,217.94784 215.384589,218.497883 214.960102,219 C212.926995,218.69419 211.301358,215.17737 211,214.512232 C211.909352,214.24194 212.851164,214.069989 213.805603,214 L216,217.363914 Z" id="Shape" fill="#000000" fill-rule="nonzero" opacity="0.1"></path>
                <path d="M256.047439,164 L249.346286,166.402298 L246.553539,170.102265 C246.553539,170.102265 240.795298,171.950462 240.039529,171.950462 C239.28376,171.950462 237.246782,172.690455 235.94398,175.646854 C234.641178,178.603253 229.9878,193.034914 225.892251,195.433637 C221.796702,197.83236 211,213.92275 211,213.92275 C211,213.92275 212.860632,218.927537 215.095549,218.176819 L220.306757,213.92275 C220.306757,213.92275 216.211208,217.990926 218.629669,221.690894 C218.629669,221.690894 233.896206,230.749558 254.93178,225.201394 L255.115324,219.656806 L256.047439,224.093192 L266.484251,217.622717 C266.484251,217.622717 265.552136,205.6863 263.871449,199.612634 C263.175274,197.058562 263.430871,194.340688 264.591229,191.958885 C267.294004,186.364248 271.465129,177.019596 270.957684,173.612766 C270.356668,169.598212 268.078564,167.853686 267.200432,167.328183 C267.001325,167.207623 266.777466,167.133095 266.545432,167.110118 L263.137273,166.774082 L256.047439,164 Z" id="Shape" fill="#42383C" fill-rule="nonzero"></path>
                <path d="M244,183 C244,183 240.318435,200.14332 236.270492,202.909061 C232.222549,205.674803 221.369935,214.524463 221,216" id="Shape" fill="#000000" fill-rule="nonzero" opacity="0.05"></path>
                <path d="M242,182 C242,182 238.321423,199.145172 234.272854,201.911212 C230.224285,204.677252 219.366435,213.527868 219,215" id="Shape" fill="#42383C" fill-rule="nonzero"></path>
                <path d="M245,171 C245,171 258.189783,165.890121 262,167.221266" id="Shape" fill="#000000" fill-rule="nonzero" opacity="0.1"></path>
                <g id="Group" opacity="0.05" transform="translate(255.000000, 164.000000)" fill="#000000" fill-rule="nonzero">
                    <path d="M9.48,28.3595858 C12.2109091,22.7107692 16.4254545,13.2756213 15.9127273,9.83579882 C15.3054545,5.78236686 13.0036364,4.02094675 12.1163636,3.49035503 C11.9151836,3.3686272 11.6889947,3.29337734 11.4545455,3.27017751 L10,3.12579882 C10.1541744,3.16081308 10.3015636,3.22055187 10.4363636,3.30266272 C11.3163636,3.83686391 13.6254545,5.59467456 14.2290909,9.65171598 C14.7418182,13.087929 10.5272727,22.5266864 7.8,28.175503 C6.62781556,30.5791576 6.36955203,33.3221378 7.07272727,35.8997633 C8.77454545,42.035858 9.71636364,54.0842604 9.71636364,54.0842604 L0.647272727,59.7114201 L0.876363636,60.7942604 L11.4218182,54.2611243 C11.4218182,54.2611243 10.48,42.2091124 8.78181818,36.0766272 C8.07208643,33.5046362 8.31995727,30.7649064 9.48,28.3595858 Z" id="Shape"></path>
                    <polygon id="Shape" points="6.32 2.7395858 7.94909091 2.90201183 0.865454545 0.126331361 0.229090909 0.353727811"></polygon>
                </g>
                <path d="M242,200 C242,200 247.975395,197.571823 249.921134,198.143646 C251.866872,198.71547 259,198 259,198" id="Shape" fill="#000000" fill-rule="nonzero" opacity="0.05"></path>
                <path d="M253.349321,158.88308 C253.137221,157.080174 254,157.354605 254,157.354605 C254,157.354605 243.95941,155.558647 246.375191,160.050279 C246.984338,161.288006 247.331449,162.630858 247.396146,163.999997 L247.493209,163.999997 C250.282861,164.003471 251.911356,160.988207 253.349321,158.88308 Z" id="Shape" fill="#000000" fill-rule="nonzero" opacity="0.05"></path>
                <circle id="Oval" fill="#AE6E79" fill-rule="nonzero" cx="247" cy="155" r="8"></circle>
                <path d="M255.822731,157.830355 C256.541587,156.225145 257.077135,154.485866 256.990873,152.724846 C256.90461,150.963826 256.121056,149.177442 254.668966,148.19185 C253.921355,147.68456 253.037161,147.412798 252.257202,146.94899 C251.649768,146.586641 251.11422,146.111962 250.53554,145.70613 C247.653561,143.725882 243.941502,143.449499 240.802221,144.981431 C239.335753,145.70613 238.084943,146.833038 236.701144,147.720795 C235.317345,148.608552 233.68554,149.28977 232.064518,149.028878 C231.784164,149.80793 232.470672,150.576112 233.099672,151.11239 C234.296568,152.123346 235.651613,153.130678 237.211532,153.163289 C237.815371,153.163289 238.45156,153.047338 239.008673,153.300982 C239.377801,153.506445 239.691281,153.800078 239.921621,154.156128 C240.672217,155.162397 241.308771,156.250174 241.819403,157.399159 C241.975633,157.893147 242.270212,158.331058 242.667654,158.660136 C243.38651,159.123944 244.31743,158.73623 245.183652,158.703618 C246.506348,158.649266 247.69965,159.489917 248.677295,160.388545 C249.654941,161.287172 250.589454,162.316246 251.825888,162.790924 C252.749618,163.153274 254.59708,163.131533 255.060743,162.019119 C255.236862,161.598793 254.895406,160.700165 254.967291,160.185629 C255.14034,159.363653 255.428366,158.570636 255.822731,157.830355 Z" id="Shape" fill="#000000" fill-rule="nonzero" opacity="0.1"></path>
                <path d="M255.821933,157.832993 C256.540867,156.227477 257.080068,154.487866 256.990201,152.730135 C256.900334,150.972403 256.123885,149.178429 254.671638,148.196274 C253.920352,147.685263 253.036063,147.413449 252.259614,146.949553 C251.652115,146.587134 251.116509,146.115989 250.537767,145.706456 C247.655477,143.72583 243.943017,143.449394 240.803398,144.981618 C239.336772,145.706456 238.085827,146.829955 236.701879,147.717881 C235.31793,148.605807 233.68595,149.290779 232.064753,149.026213 C231.784369,149.809038 232.467356,150.577366 233.100018,151.110122 C234.297044,152.121271 235.652235,153.128795 237.212322,153.165037 C237.816227,153.165037 238.452483,153.045439 239.009657,153.302757 C239.380331,153.506154 239.69431,153.800279 239.922704,154.158065 C240.673367,155.162571 241.308874,156.249495 241.817095,157.39809 C241.974702,157.89243 242.270528,158.330375 242.669032,158.659308 C243.387966,159.123204 244.318986,158.735416 245.185302,158.702799 C246.508141,158.65206 247.701572,159.492872 248.675727,160.391671 C249.649883,161.29047 250.588092,162.316115 251.828254,162.790884 C252.752084,163.153303 254.599745,163.131558 255.063457,162.018932 C255.243191,161.598526 254.901697,160.699727 254.973591,160.185092 C255.14462,159.364555 255.430247,158.572632 255.821933,157.832993 Z" id="Shape" fill="#42383C" fill-rule="nonzero"></path>
                <path d="M198.613246,275.162361 C197.944937,275.710163 197.105447,276.006537 196.240915,275.999891 L36.1372617,275.319845 C35.2687887,274.275704 34.8706819,272.919657 35.0371023,271.572438 L50.8550294,142.302987 L60.7743819,142.195611 C62.480416,142.178489 63.9828021,143.314194 64.4296346,144.958743 L66.2823461,151.787829 C66.7337534,153.450733 68.2631854,154.59123 69.9877689,154.550961 L109.57559,153.602476 C111.610718,153.553881 113.235007,151.891862 113.234426,149.858648 L113.234426,145.334557 C113.234291,143.283556 114.886463,141.614259 116.939849,141.590729 L171.797308,141.000163 C173.608386,140.983371 175.172453,142.262315 175.513482,144.038892 L199.774326,270.742067 L199.932004,271.558121 C200.194092,272.910707 199.686764,274.297263 198.613246,275.162361 Z" id="Shape" fill="#000000" fill-rule="nonzero" opacity="0.1"></path>
                <path d="M169.922896,143.000193 L115.292801,143.590727 C113.247919,143.612294 111.601009,145.279901 111.599167,147.33078 L111.599167,151.858211 C111.597857,153.88857 109.982972,155.547796 107.959064,155.598264 L68.5388897,156.546698 C66.8197231,156.58994 65.2939784,155.448622 64.8452558,153.783712 L62.9930858,146.958564 C62.5488744,145.312054 61.0501153,144.175549 59.349414,144.195578 L6.69282607,144.764638 C5.60096033,144.775363 4.56863219,145.265446 3.86825339,146.105565 C3.16787458,146.945683 2.86981361,148.051428 3.05272307,149.131015 L24.236695,274.166872 C24.5403194,275.961339 26.0868981,277.276769 27.9017791,277.284179 L194.254486,277.999979 C195.36922,278.00375 196.4273,277.507696 197.139308,276.647504 C197.851316,275.787312 198.142732,274.653009 197.933845,273.554864 L173.623667,146.038761 C173.285369,144.261491 171.726976,142.981951 169.922896,143.000193 Z" id="Shape" fill="#E6E8EE" fill-rule="nonzero"></path>
                <path d="M247.63609,56.4767981 L247.350062,59.6979545 L247.557432,65.3946962 L246.953199,75.0038761 C246.953199,75.0038761 246.86739,79.213095 244.518387,81.1856009 L238.52253,90.5052387 L238.486777,90.5233351 L236.230733,91.6380723 L232.787674,92 L231,87.6170558 L232.18344,82.8034176 L232.841304,81.905837 L233.023646,81.7031575 C233.738716,80.9069166 236.498884,78.0151144 238.690572,77.1139145 C238.690572,77.1139145 240.152888,76.0281314 239.895464,74.3270713 C239.638039,72.6260112 241.869055,63.5850578 241.869055,63.5850578 C241.869055,63.5850578 243.299194,57.6060125 242.988139,57.0233089 C242.677084,56.4406053 242.930933,43.20491 247.864912,43.0022305 C252.798891,42.799551 247.63609,56.4767981 247.63609,56.4767981 Z" id="Shape" fill="#F6BAC2" fill-rule="nonzero"></path>
                <ellipse id="Oval" fill="#4285F4" fill-rule="nonzero" opacity="0.1" cx="170" cy="298.5" rx="6" ry="1"></ellipse>
                <ellipse id="Oval" fill="#4285F4" fill-rule="nonzero" opacity="0.1" cx="148" cy="300.5" rx="6" ry="1"></ellipse>
                <ellipse id="Oval" fill="#4285F4" fill-rule="nonzero" opacity="0.1" cx="157" cy="306.5" rx="4" ry="1"></ellipse>
                <ellipse id="Oval" fill="#4285F4" fill-rule="nonzero" opacity="0.1" cx="133" cy="306.5" rx="4" ry="1"></ellipse>
                <path d="M146.847419,300 C146.847419,300 154.700701,273.359294 145.617428,262.687997 C138.821385,254.70508 131.106303,255.659598 127.651273,256.646291 C125.843229,257.146042 124.337894,258.440987 123.532878,260.18909 C122.323617,262.88462 122.541284,267.260388 131.068298,272.369026 C145.341026,280.920364 146.228968,292.649854 146.228968,292.649854 L146.847419,300 Z" id="Shape" fill="#4285F4" fill-rule="nonzero"></path>
                <path d="M129,261 C129,261 152.491813,268.398374 147.232452,300" id="Shape" stroke="#565987"></path>
                <path d="M143,263 C143,263 140.312217,265.396917 141.168347,269" id="Shape" stroke="#565987"></path>
                <path d="M132,266 C132,266 134.254197,264.371486 137,265.270857" id="Shape" stroke="#565987"></path>
                <path d="M141,275.597954 C141,275.597954 144.973536,274.015093 146,276" id="Shape" stroke="#565987"></path>
                <path d="M149,280.011892 C149,280.011892 147.034346,279.817564 147,281" id="Shape" stroke="#565987"></path>
                <path d="M148,300 C148,300 138.719537,280.590879 136.172027,281.006584 C134.962744,281.210852 134.40515,282.440049 134.150747,283.665662 C133.83795,285.255837 134.01457,286.906716 134.656067,288.38893 C135.973384,291.506718 139.510624,297.401844 148,300 Z" id="Shape" fill="#4285F4" fill-rule="nonzero"></path>
                <path d="M136,285 C136,285 146.056389,300.326714 148,301" id="Shape" stroke="#565987"></path>
                <path d="M135,287 L137,287" id="Shape" stroke="#565987"></path>
                <path d="M138,293 L142,293.44" id="Shape" stroke="#565987"></path>
                <path d="M141,289 L140,291" id="Shape" stroke="#565987"></path>
                <path d="M144.2,294 L144,295" id="Shape" stroke="#565987"></path>
                <path d="M148,300 C148,300 157.279288,280.590879 159.827432,281.006584 C161.040502,281.210852 161.598235,282.440049 161.849215,283.665662 C162.16209,285.255837 161.985426,286.906716 161.34377,288.38893 C160.026125,291.506718 156.484518,297.401844 148,300 Z" id="Shape" fill="#4285F4" fill-rule="nonzero"></path>
                <path d="M160,285 C160,285 149.925037,300.326714 148,301" id="Shape" stroke="#565987"></path>
                <path d="M161,287 L159,287" id="Shape" stroke="#565987"></path>
                <path d="M158,293 L154,293.44" id="Shape" stroke="#565987"></path>
                <path d="M156,289 L157,291" id="Shape" stroke="#565987"></path>
                <path d="M152,294 L152.2,295" id="Shape" stroke="#565987"></path>
                <path d="M132.581389,305.994666 C132.315025,305.753709 132.121363,305.428559 132.026241,305.062595 C131.932472,304.68379 132.096397,304.28488 132.415947,304.114244 C132.783595,303.963647 133.151243,304.236349 133.445361,304.521261 C133.739479,304.806174 134.074039,305.107367 134.441687,305.038174 C134.044782,304.640085 133.866069,304.040352 133.971098,303.458945 C133.98617,303.340609 134.030729,303.229264 134.099774,303.137401 C134.298304,302.90133 134.658599,303.003085 134.89757,303.190313 C135.632866,303.776419 135.864484,304.911998 135.86816,305.937683 C135.904977,305.561615 135.904977,305.182243 135.86816,304.806174 C135.848407,304.421216 136.002723,304.050553 136.279926,303.817121 C136.458899,303.708962 136.660679,303.655573 136.864486,303.662454 C137.206137,303.608341 137.552436,303.717878 137.816694,303.963647 C138.07419,304.351818 138.059012,304.884462 137.779929,305.253893 C137.498257,305.603718 137.165116,305.898219 136.794633,306.124912 C136.513428,306.312268 136.273529,306.566732 136.092426,306.869754 C136.070209,306.910497 136.052905,306.954285 136.040955,307 L133.901244,307 C133.422265,306.732483 132.978267,306.39429 132.581389,305.994666 Z" id="Shape" fill="#4285F4" fill-rule="nonzero"></path>
                <path d="M168.585754,296.979414 C168.316966,296.740066 168.121769,296.414991 168.026853,296.048639 C167.931886,295.669729 168.09522,295.269974 168.415493,295.097452 C168.785625,294.946405 169.155758,295.219923 169.451864,295.505687 C169.74797,295.791451 170.08109,296.101709 170.462326,296.040474 C170.062652,295.642883 169.881405,295.043169 169.984855,294.460606 C170.001287,294.341553 170.047422,294.229888 170.118103,294.138101 C170.317975,293.901325 170.680705,294.003384 170.921291,294.187089 C171.680063,294.779029 171.89474,295.918004 171.898441,296.946755 C171.935486,296.568196 171.935486,296.186339 171.898441,295.80778 C171.864898,295.426315 172.003232,295.050983 172.268574,294.803523 C172.449545,294.697727 172.652357,294.645674 172.857085,294.652476 C173.200383,294.599164 173.548203,294.70729 173.815729,294.950488 C174.075866,295.341571 174.059032,295.878351 173.775014,296.248674 C173.49355,296.600341 173.159239,296.895874 172.78676,297.122296 C172.503591,297.308377 172.261981,297.562302 172.079806,297.865283 C172.058122,297.907965 172.040746,297.953141 172.027988,298 L169.921933,298 C169.43613,297.729151 168.986503,297.385722 168.585754,296.979414 Z" id="Shape" fill="#4285F4" fill-rule="nonzero"></path>
                <path d="M156.586933,305.983422 C156.31991,305.740747 156.124654,305.415119 156.026324,305.048498 C155.932257,304.668532 156.096705,304.268401 156.417275,304.097242 C156.786097,303.946184 157.154919,304.219721 157.449976,304.505506 C157.745033,304.791291 158.073285,305.101572 158.456859,305.044415 C158.059239,304.6446 157.87888,304.044113 157.981079,303.46035 C157.997452,303.341288 158.043425,303.229615 158.113855,303.137821 C158.313019,302.901028 158.674464,303.003094 158.914198,303.190896 C159.670283,303.778796 159.880511,304.917853 159.887888,305.946679 C159.924793,305.569457 159.924793,305.188926 159.887888,304.811704 C159.85889,304.426618 160.003883,304.050593 160.27515,303.807375 C160.454499,303.698323 160.657064,303.644734 160.861577,303.652234 C161.204286,303.598483 161.551499,303.708296 161.816825,303.95435 C162.075451,304.344175 162.05867,304.879504 161.776255,305.248547 C161.495035,305.599365 161.162053,305.894791 160.791501,306.122232 C160.509398,306.310162 160.268733,306.565405 160.087051,306.869355 C160.064764,306.910223 160.047405,306.954145 160.035416,307 L157.89625,307 C157.420882,306.727158 156.980553,306.385278 156.586933,305.983422 Z" id="Shape" fill="#4285F4" fill-rule="nonzero"></path>
            </g>
        </g>
    </g>
</svg>