<?xml version="1.0" encoding="UTF-8"?>
<svg width="221px" height="306px" viewBox="0 0 221 306" version="1.1" xmlns="http://www.w3.org/2000/svg" xmlns:xlink="http://www.w3.org/1999/xlink">
    <!-- Generator: Sketch 49.1 (51147) - http://www.bohemiancoding.com/sketch -->
    <title>Checklist</title>
    <desc>Created with Sketch.</desc>
    <defs>
        <linearGradient x1="40046%" y1="39509%" x2="40046%" y2="20989%" id="linearGradient-1">
            <stop stop-color="#808080" stop-opacity="0.25" offset="0%"></stop>
            <stop stop-color="#808080" stop-opacity="0.12" offset="54%"></stop>
            <stop stop-color="#808080" stop-opacity="0.1" offset="100%"></stop>
        </linearGradient>
        <linearGradient x1="50.0010874%" y1="100%" x2="50.0010874%" y2="0%" id="linearGradient-2">
            <stop stop-color="#808080" stop-opacity="0.25" offset="0%"></stop>
            <stop stop-color="#808080" stop-opacity="0.12" offset="54%"></stop>
            <stop stop-color="#808080" stop-opacity="0.1" offset="100%"></stop>
        </linearGradient>
        <linearGradient x1="23262%" y1="57459%" x2="49842%" y2="57459%" id="linearGradient-3">
            <stop stop-color="#FFFFFF" offset="0%"></stop>
            <stop stop-color="#FFFFFF" offset="100%"></stop>
        </linearGradient>
        <linearGradient x1="39792%" y1="85800%" x2="39792%" y2="73295%" id="linearGradient-4">
            <stop stop-color="#808080" stop-opacity="0.25" offset="0%"></stop>
            <stop stop-color="#808080" stop-opacity="0.12" offset="54%"></stop>
            <stop stop-color="#808080" stop-opacity="0.1" offset="100%"></stop>
        </linearGradient>
        <linearGradient x1="40135%" y1="22224%" x2="40135%" y2="0%" id="linearGradient-5">
            <stop stop-color="#808080" stop-opacity="0.25" offset="0%"></stop>
            <stop stop-color="#808080" stop-opacity="0.12" offset="54%"></stop>
            <stop stop-color="#808080" stop-opacity="0.1" offset="100%"></stop>
        </linearGradient>
        <linearGradient x1="39258%" y1="86042%" x2="39258%" y2="49806%" id="linearGradient-6">
            <stop stop-color="#808080" stop-opacity="0.25" offset="0%"></stop>
            <stop stop-color="#808080" stop-opacity="0.12" offset="54%"></stop>
            <stop stop-color="#808080" stop-opacity="0.1" offset="100%"></stop>
        </linearGradient>
    </defs>
    <g id="Version-1" stroke="none" stroke-width="1" fill="none" fill-rule="evenodd">
        <g id="Assignments-overview-Copy-3" transform="translate(-693.000000, -353.000000)">
            <g id="Group-13" transform="translate(503.000000, 352.941406)">
                <g id="Checklist" transform="translate(190.565675, 0.575195)">
                    <g id="Group-19" transform="translate(89.627858, 70.421889)">
                        <polygon id="Shape" fill="url(#linearGradient-1)" fill-rule="nonzero" points="124.634808 0.811274937 0.111900506 36.2588039 0.111900506 73.079905 124.634808 46.3771925"></polygon>
                        <polygon id="Shape" fill="#FFFFFF" fill-rule="nonzero" points="121.243802 2.18874937 2.86294717 36.6021969 2.86294717 71.0156445 121.243802 43.4856669"></polygon>
                        <path d="M22.1319804,48.9292273 C22.1319804,54.0450034 19.6540873,58.7978755 16.6259849,59.5392923 C13.5978824,60.2807092 11.2253486,56.8077567 11.2253486,51.7778288 C11.2253486,46.7479009 13.6291,42.0223442 16.6259849,41.1950791 C19.6228697,40.367814 22.1319804,43.8134511 22.1319804,48.9292273 Z" id="Shape" stroke="#DBDBDB" stroke-width="2"></path>
                        <polygon id="Shape" fill="#DBDBDB" fill-rule="nonzero" points="107.480764 25.5902059 32.2854888 45.3704265 32.2854888 41.1482527 107.480764 20.8100184"></polygon>
                        <polygon id="Shape" fill="#DBDBDB" fill-rule="nonzero" points="107.480764 35.2247225 32.2854888 55.0049431 32.2854888 50.7827694 107.480764 30.4484372"></polygon>
                    </g>
                    <g id="Group-21" transform="translate(40.545936, 141.910776)" fill-rule="nonzero">
                        <polygon id="Shape" fill="url(#linearGradient-2)" points="0.462219279 29.960785 0.462219279 92.792872 179.888995 90.8701288 179.888995 0.171437173"></polygon>
                        <polygon id="Shape" fill="#3A7DE3" points="175.971192 1.55671599 175.971192 86.9015976 2.52647982 90.4075932 2.52647982 30.464168"></polygon>
                        <path d="M36.9399274,58.3726584 C36.9399274,48.6757067 32.5811768,41.4098218 27.3054108,42.1317276 C22.1350039,42.8419269 18.0181894,50.9819033 18.0181894,60.3276575 C18.0181894,69.6734118 22.1350039,76.9627099 27.3054108,76.6037081 C32.6006878,76.2369018 36.9399274,68.0735123 36.9399274,58.3726584 Z" id="Shape" fill="#FFFFFF"></path>
                        <polygon id="Shape" fill="#FFFFFF" points="153.94721 41.4761591 50.2268974 52.9759243 50.2268974 46.5334023 153.94721 33.7888372"></polygon>
                        <polygon id="Shape" fill="url(#linearGradient-3)" points="153.94721 57.9941456 50.2268974 69.4939109 50.2268974 63.0513888 153.94721 50.3068237"></polygon>
                    </g>
                    <g id="Group-18" transform="translate(90.560860, 252.945598)">
                        <polygon id="Shape" fill="url(#linearGradient-4)" fill-rule="nonzero" points="1.48821051 0.0557503801 0.488210507 36.3919411 122.402376 49.8526844 123.024902 2.49565991"></polygon>
                        <polygon id="Shape" fill="#FFFFFF" fill-rule="nonzero" points="1.92994548 1.42828424 1.92994548 34.4681595 120.3108 46.1026762 120.3108 4.80575867"></polygon>
                        <path d="M22.5764531,19.6164098 C22.5764531,24.7204793 20.09856,28.6851083 17.0704576,28.4743898 C14.0423552,28.2636713 11.6737235,24.049302 11.6737235,19.0388851 C11.6737235,14.0284682 14.0774749,10.0638392 17.0743598,10.1770028 C20.0712447,10.2901665 22.5764531,14.5123402 22.5764531,19.6164098 Z" id="Shape" stroke="#DBDBDB" stroke-width="2"></path>
                        <polygon id="Shape" fill="#DBDBDB" fill-rule="nonzero" points="106.547763 22.7012197 33.7991626 18.2165605 33.7991626 13.9085385 106.547763 17.8468905 106.547763 21.7012197"></polygon>
                        <polygon id="Shape" fill="#DBDBDB" fill-rule="nonzero" points="106.547763 33.3357363 33.7991626 27.8510772 33.7991626 23.5430551 106.547763 28.4814071 106.547763 31.3357363"></polygon>
                    </g>
                    <g id="Group-17" transform="translate(89.627858, 0.000000)">
                        <polygon id="Shape" fill="url(#linearGradient-5)" fill-rule="nonzero" points="124.634808 0 0.798686623 49.6241992 0.798686623 86.7223561 124.634808 45.4254386"></polygon>
                        <polygon id="Shape" fill="#FFFFFF" fill-rule="nonzero" points="122.621276 2.06426055 2.86294717 51.6182202 2.86294717 83.2806211 122.621276 43.361178"></polygon>
                        <path d="M27.6379759,57.7524689 C27.6379759,62.8253209 25.1600828,67.8435422 22.1319804,68.9634719 C19.103878,70.0834015 16.7313441,66.9343311 16.7313441,61.9668383 C16.7313441,56.9993455 19.1350955,52.0045374 22.1319804,50.7948573 C25.1288653,49.5851772 27.6379759,52.6796169 27.6379759,57.7524689 Z" id="Shape" stroke="#DBDBDB" stroke-width="2"></path>
                        <polygon id="Shape" fill="#DBDBDB" fill-rule="nonzero" points="110.231811 24.0882426 37.4676022 52.4103656 37.4676022 47.4779925 110.231811 18.5354208"></polygon>
                        <polygon id="Shape" fill="#DBDBDB" fill-rule="nonzero" points="110.231811 36.4777081 37.4676022 64.7959288 37.4676022 59.867458 110.231811 30.9248862"></polygon>
                    </g>
                    <g id="Group-22" transform="translate(0.000000, 163.250742)" fill-rule="nonzero">
                        <path d="M47.587254,135.356271 L43.8996808,132.843258 L37.9917593,110.464176 L39.1858306,109.17255 C39.1858306,109.17255 39.1858306,101.953491 37.5039851,97.1889125 C38.5458708,96.5294418 39.1975372,96.0806895 39.1975372,96.0806895 C35.5997145,92.8067488 35.5997145,80.8075028 35.5997145,80.8075028 C35.5997145,80.8075028 34.0739567,71.5671077 31.0263433,63.0095966 L36.797688,64.4417018 L45.1952091,45.8945744 L45.1952091,41.5241173 L48.7930319,39.3427909 C48.7930319,39.3427909 43.9933334,32.7949096 39.193635,39.3427909 C39.193635,39.3427909 40.3916085,43.7054436 39.193635,45.8906722 C37.9956615,48.0759008 34.3939366,55.7085919 34.3939366,55.7085919 L31.3385188,55.7085919 L31.9940874,52.4346513 L25.7232618,52.4346513 C25.4188907,52.0444319 25.1106174,51.6815279 24.7945397,51.342037 L29.5942381,41.5241173 L27.3465745,39.9905551 L35.5958123,30.6252899 L36.7937858,10.9855482 C41.5622667,9.54173651 42.6470766,5.22200792 42.8343819,2.47096126 C42.9202301,1.21445484 41.6168974,0.258417346 40.2745427,0.570592853 C29.9181202,2.98605085 31.9979896,7.71160759 31.9979896,7.71160759 L28.3923624,26.2314196 L23.4326741,33.3373146 C22.8317362,30.0867871 20.4826155,27.386469 17.2867187,26.0519187 L19.9948413,22.9730877 C19.9948413,22.9730877 13.8722991,21.4863519 8.0541281,23.4998839 C-2.69641595,27.2147724 -2.67300279,41.4499756 8.0541281,45.1843751 C9.56824838,45.7412516 11.180828,45.9803491 12.7913914,45.88677 L12.7913914,44.7941557 C12.943577,44.7941557 13.0918604,44.7941557 13.2401437,44.7746448 C13.0567406,45.7892152 12.8850441,46.9364602 12.7952936,48.0680964 C10.3954444,48.0680964 10.3954444,60.0712446 13.9932671,62.252571 L12.7952936,74.2557193 L12.7952936,80.8036006 C15.1951428,86.2666719 19.9948413,86.2666719 19.9948413,86.2666719 L23.5887618,101.543761 C24.7282024,102.062753 26.2110361,102.023731 27.8031312,101.664729 L28.384558,105.906414 C28.384558,105.906414 17.5871877,113.543007 17.5871877,124.453541 L17.1969683,125.167642 L16.3892142,124.453541 L9.18966651,129.916612 L18.7890634,140.842755 L28.3884602,140.842755 C30.7883095,135.379684 21.1889126,134.294874 21.1889126,134.294874 L21.1420863,128.687421 L30.8702555,118.182715 C32.5208835,122.572684 35.4631377,129.869786 37.8942045,133.011052 L36.797688,133.210064 L36.797688,141.939272 L57.1866508,141.939272 C63.1843228,134.263656 47.587254,135.356271 47.587254,135.356271 Z" id="Shape" fill="url(#linearGradient-6)"></path>
                        <path d="M15.7102324,42.3982087 C15.7102324,42.3982087 13.3298942,52.3956293 15.7102324,53.8238323 L22.8512472,49.5314191 L18.0905707,40.4861337 L15.7102324,42.3982087 Z" id="Shape" fill="#F6B9AD"></path>
                        <path d="M42.0422365,130.638518 L35.7362913,104.361145 L29.4420526,112.76647 C29.4420526,112.76647 34.6983077,129.584926 37.8512803,131.684306 L42.0422365,130.638518 Z" id="Shape" fill="#D1AEA7"></path>
                        <path d="M46.2488015,40.2441977 C46.2488015,40.2441977 42.0461387,33.9382524 37.8395737,40.2441977 C37.8395737,40.2441977 38.8892639,44.4468605 37.8395737,46.550143 C36.7898836,48.6534254 33.636911,56.0090608 33.636911,56.0090608 L24.1740909,56.0090608 L24.1740909,61.265316 L35.7362913,64.4182886 L43.099731,46.550143 L43.099731,42.343578 L46.2488015,40.2441977 Z" id="Shape" fill="#F2C7BF"></path>
                        <polygon id="Shape" fill="#5989A1" points="31.5336285 52.8560882 29.430346 64.4182886 21.0211183 62.3150061 21.0211183 52.8560882"></polygon>
                        <circle id="Oval" fill="#F2C7BF" cx="14.715173" cy="36.0376327" r="9.45891789"></circle>
                        <path d="M12.6118905,34.9879426 L21.0211183,24.4754324 C21.0211183,24.4754324 15.6556017,23.0433272 10.5593366,24.9827176 C1.1433428,28.5610293 1.15895157,42.2577297 10.5593366,45.8711612 C11.8732637,46.4068878 13.2912068,46.6389876 14.7073686,46.550143 L14.7073686,40.2441977 L11.554396,40.2441977 L12.6118905,34.9879426 Z" id="Shape" fill="#3D213C"></path>
                        <path d="M35.7362913,12.913232 L34.6866011,31.8310678 L26.2773734,42.343578 L21.0211183,39.1906054 L28.3806559,27.628405 L31.5336285,9.76025936 C31.5336285,9.76025936 29.711304,5.20639914 38.7878068,2.88069161 C39.3415638,2.73513515 39.9315368,2.86309757 40.3752291,3.22499616 C40.8189214,3.58689476 41.062853,4.13910843 41.0315683,4.71082053 C40.863774,7.36041015 39.9155409,11.5201488 35.7362913,12.913232 Z" id="Shape" fill="#F2C7BF"></path>
                        <path d="M27.3270635,95.9519171 L28.3767537,104.361145 C28.3767537,104.361145 18.9061292,111.71678 18.9061292,122.225388 L17.856439,124.328671 L21.0094117,127.481643 L37.8278672,107.510215 C37.8278672,107.510215 37.8278672,95.9480149 34.6748945,92.7950423 L27.3270635,95.9519171 Z" id="Shape" fill="#F2C7BF"></path>
                        <path d="M22.0278843,126.287572 L22.0708084,131.688208 C22.0708084,131.688208 30.4800361,132.737898 28.3767537,137.994154 L19.9714281,137.994154 L11.5622004,127.481643 L17.8681456,122.225388 L22.0278843,126.287572 Z" id="Shape" fill="#3A7DE3"></path>
                        <path d="M40.9925464,129.584926 L45.1952091,132.737898 C45.1952091,132.737898 58.8528876,131.688208 53.6044369,139.043844 L35.7362913,139.043844 L35.7362913,130.638518 L40.9925464,129.584926 Z" id="Shape" fill="#3A7DE3"></path>
                        <path d="M37.8395737,94.9100313 C37.8395737,94.9100313 28.3806559,102.269569 24.1818953,100.166286 L21.0289226,85.4511134 C21.0289226,85.4511134 16.8262599,85.4511134 14.7229774,80.1948583 L14.7229774,73.8772065 L34.6944055,80.1831517 C34.6944055,80.1831517 34.6866011,91.7453521 37.8395737,94.9100313 Z" id="Shape" fill="#3A7DE3"></path>
                        <path d="M29.4420526,42.343578 L21.0328248,36.0376327 C21.0328248,36.0376327 16.8301621,48.6495233 14.7268796,48.6495233 C12.6235971,48.6495233 12.6235971,60.2117236 15.7765697,62.3072017 L14.7268796,73.8694021 L34.6983077,80.1753473 C34.6983077,80.1753473 31.5453351,59.1542291 25.2393898,51.7946915 L29.4420526,42.343578 Z" id="Shape" fill="#76B6D7"></path>
                    </g>
                    <polygon id="Shape" fill="#3C7BE9" fill-rule="nonzero" points="63.9265436 202.209465 65.6641243 204.494345 71.3777907 198.404173 74.2603921 198.404173 65.6641243 207.33285 61.4969318 202.209465"></polygon>
                </g>
            </g>
        </g>
    </g>
</svg>