{
  "users": [
    {
      "id": 3,
      "name": "Helen",
      "surname": "Potapova",
      "nickname": "helen",
      "registered": "08/06/2016"
    },
    {
      "id": 4,
      "name": "Marina",
      "surname": "Petrova",
      "nickname": "petrova",
      "registered": "10/05/2016"
    }
  ]
}