Name,Sex,Division,WeightClassKg,BodyweightKg,Squat1Kg,Squat2Kg,Squat3Kg,Best3SquatKg,Bench1Kg,Bench2Kg,Bench3Kg,Best3BenchKg,Deadlift1Kg,Deadlift2Kg,Deadlift3Kg,Best3DeadliftKg,TotalKg,Place,Event,Equipment
Brendaon Howell,M,Juniors,67.5,66.1,140,150,-160,150,85,92.5,100,100,195,210,220,220,470,1,SBD,Single-ply
Matt Parslow,M,Open,67.5,64.5,100,130,140,140,70,85,95,95,140,180,,180,415,1,SBD,Single-ply
Brent Clapperton,M,Open,75,73,160,,,160,90,100,,100,160,,,160,420,1,SBD,Single-ply
Justin Brown,M,Open,100,92.4,180,245,260,260,100,170,,170,200,240,-255,240,670,1,SBD,Single-ply
Kelvin Hemopo,M,Open,100,91.2,150,170,-180,170,115,125,132.5,132.5,180,200,220,220,522.5,2,SBD,Single-ply
Nathan Wiliams,M,Open,110,102.2,240,248.5,267.5,267.5,160,172.5,-180,172.5,230,245,-252.5,245,685,1,SBD,Single-ply
Glenn Iraia,M,Open,110,100.6,170,,,170,130,,,130,200,,,200,500,2,SBD,Single-ply
Mark Tamanui,M,Open,125+,154.3,160,-180,-180,160,140,160,-180,160,160,220,250,250,570,1,SBD,Single-ply
William Pakoti,M,Masters 2,125,110.4,60,,,60,60,,,60,140,,,140,260,1,SBD,Single-ply
