Name,Event,Equipment,Sex,BirthDate,BodyweightKg,Age,Division,WeightClassKg,State,Squat1Kg,Squat2Kg,Squat3Kg,Best3SquatKg,Bench1Kg,Bench2Kg,Bench3Kg,Best3BenchKg,Deadlift1Kg,Deadlift2Kg,Deadlift3Kg,Best3DeadliftKg,TotalKg,Place
Maria Ramos,SBD,Wraps,F,1990-04-20,47.6,25,Open,48,Jujuy,150,-160,170,170,60,67.5,72.5,72.5,90,,,90,332.5,1
Carolina Ramos,SBD,Wraps,F,1991-11-25,46.9,24,Open,48,Jujuy,115,-125,-125,115,45,47.5,50,50,120,130,140,140,305,2
Estefania Cardozo,SBD,Wraps,F,1994-03-15,62,21,Jun,67.5,Jujuy,160,-172.5,-177.5,160,60,65,-70,65,150,160,165,165,390,5
Julia Teyssier,SBD,Wraps,F,1979-12-07,65.7,36,SubM,67.5,Jujuy,170,180,187.5,187.5,62.5,67.5,70,70,160,-170,170,170,427.5,3
Natalia Alfaro,SBD,Wraps,F,1995-09-09,53.9,20,Jun,56,Jujuy,80,95,105,105,37.5,40,-42.5,40,95,110,115,115,260,6
Raquel Rojas,SBD,Wraps,F,1999-02-01,59.4,16,Tn 16-17,60,Jujuy,95,110,-120,110,37.5,40,-42.5,40,95,110,115,115,265,7
Alicia Hernandez,SBD,Wraps,F,1976-12-02,78,39,SubM,82.5,Jujuy,180,190,-200,190,105,115,120,120,140,-150,160,160,470,4
Martin Mattos,SBD,Wraps,M,1980-09-27,65,35,SubM,67.5,Jujuy,-170,170,-190,170,100,-110,-110,100,170,190,,190,460,5
Matias Flores,SBD,Wraps,M,1985-05-04,81.6,30,Open,82.5,Jujuy,250,-260,,250,130,,,130,230,-250,,230,610,2
Leandro Gomez,SBD,Wraps,M,1990-05-17,90,25,Open,90,Jujuy,210,-230,240,240,120,130,-135,130,200,,,200,570,8
Rafael Gomez,SBD,Wraps,M,1971-09-28,89,44,M 40-44,90,Jujuy,200,215,222.5,222.5,100,110,120,120,200,210,220,220,562.5,9
Puche Eduardo,SBD,Wraps,M,1990-03-04,89.7,25,Open,90,Jujuy,205,215,225,225,120,130,135,135,215,225,-235,225,585,7
Jose Egües,SBD,Wraps,M,1985-07-27,78.7,30,Open,82.5,Jujuy,-250,-250,250,250,130,,,130,220,-240,,220,600,1
Abalos Jairo,SBD,Wraps,M,1995-07-20,64.3,20,Jun,67.5,Jujuy,-160,-160,170,170,75,85,92.5,92.5,170,185,195,195,457.5,4
Llampa Facundo,SBD,Wraps,M,1994-04-23,67,21,Jun,67.5,Jujuy,-160,170,-180,170,75,85,-95,85,160,170,180,180,435,10
Gutierrez Gaston,SBD,Wraps,M,1979-11-22,79,36,SubM,82.5,Jujuy,160,,,160,112.5,120,-127.5,120,170,190,-200,190,470,12
Ramiro Chavez,SBD,Multi-ply,M,1997-12-24,102.1,17,Tn 16-17,110,Salta,260,270,-285,270,110,125,130,130,230,245,250,250,650,6
Gutierrez Sergio,SBD,Wraps,M,1978-09-09,80.6,37,SubM,82.5,Salta,170,-185,-190,170,100,-110,,100,190,-205,,190,460,13
Cesar Cataño,SBD,Wraps,M,1964-12-05,95,51,M 50-54,100,Jujuy,-230,240,-260,240,90,100,,100,200,-210,,200,540,11
Lucas Diosquez,SBD,Wraps,M,1990-02-24,84.5,25,Open,90,Tucuman,200,220,240,240,140,155,-165,155,195,215,-225,215,610,3
Nicolás Figueroa,B,Raw,M,1999-06-18,61,16,Tn 16-17,67.5,Jujuy,,,,,22.5,25,30,30,,,,,30,6
Farfan Pablo,B,Raw,M,1998-10-23,71,17,Tn 16-17,75,Jujuy,,,,,40,45,47.5,47.5,,,,,47.5,5
Gillermo Camacho,B,Raw,M,1988-08-12,51,27,Open,52,Jujuy,,,,,50,52.5,-55,52.5,,,,,52.5,4
Leandro Gomez,B,Raw,M,1990-05-17,90,25,Open,90,Jujuy,,,,,120,130,-135,130,,,,,130,3
Lucas Diozquez,B,Raw,M,1990-02-24,84.5,25,Open,90,Tucuman,,,,,140,155,-165,155,,,,,155,1
Alicia Hernandez,B,Raw,F,1976-12-02,78,39,SubM,82.5,Jujuy,,,,,105,115,120,120,,,,,120,1
Gutierrez Gaston,B,Raw,M,1979-11-22,79,36,SubM,82.5,Jujuy,,,,,112.5,120,-127.5,120,,,,,120,2
