Division,Equipment,Sex,BirthYear,Name,BodyweightKg,WeightClassKg,Squat1Kg,Squat2Kg,Squat3Kg,Best3SquatKg,Bench1Kg,Bench2Kg,Bench3Kg,Best3BenchKg,Deadlift1Kg,Deadlift2Kg,Deadlift3Kg,Best3DeadliftKg,TotalKg,Place,Event
Open,Raw,F,1990,Noémie Allabert,46.66,47,107.5,112.5,-115,112.5,57.5,-62.5,-62.5,57.5,132.5,137.5,150,150,320,1,SBD
Open,Raw,F,1981,Stéphanie Legard,46.59,47,112.5,117.5,-120.5,117.5,62.5,67.5,-70,67.5,122.5,127.5,132.5,132.5,317.5,2,SBD
Open,Raw,F,1994,Andréa Durand,46.83,47,-115,115,-120.5,115,70,73,-75,73,120,125,-127.5,125,313,3,SBD
Open,Raw,F,1993,Audrey Mingot,51.48,52,97.5,102.5,105,105,75,80,82.5,82.5,122.5,130,135.5,135.5,323,1,SBD
Open,Raw,F,1976,Marianne Bouvard,51.14,52,100,105,-107.5,105,67.5,70,-72.5,70,107.5,-117.5,,107.5,282.5,2,SBD
Open,Raw,F,1988,Mélodie Anthouard,56.73,57,127.5,132.5,-137.5,132.5,95,-100,-100,95,-140,140,150,150,377.5,1,SBD
Open,Raw,F,1996,Agnès Alves,55.69,57,115,-120,122.5,122.5,70,-75,-75,70,130,140,142.5,142.5,335,2,SBD
Open,Raw,F,1967,Marie France Cabos,56.02,57,97.5,102.5,105,105,60,65,67.5,67.5,137.5,142.5,145,145,317.5,3,SBD
Open,Raw,F,1993,Julia Magnier,54.62,57,102.5,-107.5,107.5,107.5,52.5,-57.5,-57.5,52.5,137.5,147.5,-157.5,147.5,307.5,4,SBD
Open,Raw,F,1992,Margot Auray,54.8,57,90,100,-105,100,55,-60,60,60,120,130,135,135,295,5,SBD
Open,Raw,F,1983,Cécile Courqueux,54.69,57,100,107.5,-112.5,107.5,55,57.5,-60,57.5,115,122.5,127.5,127.5,292.5,6,SBD
Open,Raw,F,1998,Saymie Daria,56.16,57,100,-105,-105,100,-57.5,57.5,62.5,62.5,110,117.5,-120,117.5,280,7,SBD
Open,Raw,F,1993,Prescillia Bavoil,60.97,63,-152.5,-152.5,152.5,152.5,80,85,87.5,87.5,170,177.5,-182.5,177.5,417.5,1,SBD
Open,Raw,F,1989,Kelly Paszkowski,59.95,63,140,-145,-145,140,70,75,-77.5,75,165,172.5,-178,172.5,387.5,2,SBD
Open,Raw,F,1989,Yveline Gironcel,62.45,63,-95,95,-110,95,65,72.5,-75,72.5,130,145,150,150,317.5,3,SBD
Open,Raw,F,1982,Marie-Odile Cavin,61.19,63,95,100,-105,100,70,72.5,-75,72.5,135,140,142.5,142.5,315,4,SBD
Open,Raw,F,1993,Virginie Clisson,66.72,72,125,132.5,137.5,137.5,75,78,-80,78,155,-160,-160,155,370.5,1,SBD
Open,Raw,F,1990,Anne-Olympe Moulet,66.46,72,127.5,-132.5,-132.5,127.5,72.5,77.5,78.5,78.5,140,150,152.5,152.5,358.5,2,SBD
Open,Raw,F,1971,France Juilien,67.88,72,-120,125,130,130,65,67.5,-70,67.5,145,152.5,-160,152.5,350,3,SBD
Open,Raw,F,1999,Camille Pailha,66.36,72,95,105,115,115,67.5,75,-80.5,75,130,142.5,-152.5,142.5,332.5,4,SBD
Open,Raw,F,1992,Camille Fabre,68.31,72,-125,125,-130,125,-77.5,77.5,-80,77.5,-130,130,-140,130,332.5,5,SBD
Open,Raw,F,1981,Stéphanie Ciuti,68.5,72,100,105,110,110,57.5,60,-62.5,60,150,155,160.5,160.5,330.5,6,SBD
Open,Raw,F,1988,Cindy Hebe,83.3,84,-125,125,-132.5,125,75,80,-85,80,170,180,-185,180,385,1,SBD
Open,Raw,F,1994,Appoline Rouyer,76.57,84,-130,130,-135,130,60,65,-67.5,65,130,135,140,140,335,2,SBD
Open,Raw,M,1984,Vincent Todaro,57.59,59,160,165,167.5,167.5,87.5,92.5,97.5,97.5,200,205,-210,205,470,1,SBD
Open,Raw,M,1991,Stéphane Tran,57.16,59,140,-147.5,147.5,147.5,100,107.5,-115,107.5,190,-200,-200,190,445,2,SBD
Open,Raw,M,1988,Nicolas Martin,58,59,125,-130,-130,125,90,-95,95,95,185,190,200,200,420,3,SBD
Open,Raw,M,1990,Paul Valeyre,57.3,59,140,147.5,-152.5,147.5,100,-105,-105,100,-190,-190,,,,DQ,SBD
Open,Raw,M,1971,Franck Jouveaux,65.45,66,180,190,200,200,115,120,-122.5,120,210,225,240,240,560,1,SBD
Open,Raw,M,1990,David Pascau,65.53,66,190,200,207.5,207.5,120,125,127.5,127.5,205,217.5,222.5,222.5,557.5,2,SBD
Open,Raw,M,1980,Cédric Jeannin,64.9,66,170,177.5,182.5,182.5,130,137.5,-140,137.5,195,205,210,210,530,3,SBD
Open,Raw,M,1992,Lucas Chelles,65.95,66,170,180,185,185,115,120,-122.5,120,190,200,205,205,510,4,SBD
Open,Raw,M,1988,Sébastien Jugant,64.61,66,175,-180,-180,175,102.5,-105,-105,102.5,-230,230,-235,230,507.5,5,SBD
Open,Raw,M,1970,Michael Bernard,64.78,66,155,160,-162.5,160,145,-147.5,147.5,147.5,190,197.5,-202.5,197.5,505,6,SBD
Open,Raw,M,1993,Quentin Descolat,65.68,66,172.5,180,185,185,100,-105,-105,100,195,205,-210,205,490,7,SBD
Open,Raw,M,1971,Maxence Durand,65.99,66,-165,172.5,185,185,105,110,-112.5,110,165,185,-195,185,480,8,SBD
Open,Raw,M,1984,François Merland,64.68,66,165,170,172.5,172.5,95,100,-102.5,100,190,197.5,205,205,477.5,9,SBD
Open,Raw,M,1976,Arnaud Fruit,65.55,66,155,165,-170,165,110,115,-117.5,115,185,195,-197.5,195,475,10,SBD
Open,Raw,M,1990,Loic Mancini,62.81,66,150,160,-167.5,160,120,-125,-125,120,-190,-190,190,190,470,11,SBD
Open,Raw,M,1986,Richard Combes,62.99,66,160,165,-170,165,-122.5,122.5,-125,122.5,182.5,-187.5,-187.5,182.5,470,12,SBD
Open,Raw,M,1991,Franck Pailhas,65.7,66,-147.5,150,-155,150,100,105,-110,105,190,-200,-205,190,445,13,SBD
Open,Raw,M,1989,Álvaro Fernández Ramos #1,64.45,66,175,190,195,195,115,120,125,125,185,200,-202.5,200,520,G,SBD
Open,Raw,M,1975,Hassan El Belghiti,69.45,74,225,232.5,-237.5,232.5,132.5,137.5,140,140,272.5,295,-310,295,667.5,1,SBD
Open,Raw,M,1995,Cédric Letellier,72.98,74,212.5,220,,220,137.5,142.5,145,145,220,-225,-225,220,585,2,SBD
Open,Raw,M,1986,Jérémy Begue,73.42,74,200,-207.5,210,210,145,150,152.5,152.5,-212.5,212.5,220,220,582.5,3,SBD
Open,Raw,M,1991,Kévin Bressano,73.6,74,185,190,-192.5,190,130,-135,-135,130,245,255,-265,255,575,4,SBD
Open,Raw,M,1992,Cyril Diago,72.85,74,220,-230,-230,220,125,130,132.5,132.5,210,217.5,-222.5,217.5,570,5,SBD
Open,Raw,M,1983,Guillaume Faucher,73.77,74,192.5,200,,200,130,135,137.5,137.5,220,230,,230,567.5,6,SBD
Open,Raw,M,1978,Sébastien Pasquier,72.91,74,200,-205,205,205,135,137.5,-140,137.5,220,-225,,220,562.5,7,SBD
Open,Raw,M,1993,Hoang Thuan N Guyen,73.14,74,195,210,-215,210,110,117.5,-125,117.5,215,230,-247.5,230,557.5,8,SBD
Open,Raw,M,1972,Vincent Casenove,73.44,74,180,190,200,200,130,135,-140,135,210,220,-227.5,220,555,9,SBD
Open,Raw,M,1991,Dimitri Didon,73.58,74,230,-242.5,-242.5,230,-130,-130,-130,,-270,,,,,DQ,SBD
Open,Raw,M,1987,Romain Picot-Guéraud,82.51,83,240,252.5,260,260,155,162.5,-165,162.5,270,280,282.5,282.5,705,1,SBD
Open,Raw,M,1992,Joris Quai,82.45,83,-250,250,260,260,150,-155,-155,150,280,-292.5,-295,280,690,2,SBD
Open,Raw,M,1993,Vichet Duong,78.45,83,250,265.5,270,270,145,152.5,155,155,245,260,-267.5,260,685,3,SBD
Open,Raw,M,1990,Etienne Garcia,81.29,83,215,225,230,230,162.5,171,,171,252.5,-270,-270,252.5,653.5,4,SBD
Open,Raw,M,1992,Mathieu Bui,82.7,83,215,-225,225,225,147.5,152.5,157.5,157.5,250,260,270,270,652.5,5,SBD
Open,Raw,M,1968,Abdelkader Baali,79.81,83,220,230,-237.5,230,145,150,152.5,152.5,250,260,-272.5,260,642.5,6,SBD
Open,Raw,M,1991,Jonathan Darras,80.89,83,210,220,-230,220,135,142.5,145,145,-247.5,260,270,270,635,7,SBD
Open,Raw,M,1980,Maël Le Paven,82.08,83,-232.5,-232.5,232.5,232.5,137.5,-140,-140,137.5,255,-260,-260,255,625,8,SBD
Open,Raw,M,1994,Pierre Renaud,81.85,83,165,172.5,-180,172.5,-150,150,,150,265,280,295.5,295.5,618,9,SBD
Open,Raw,M,1985,Cyril Papandreou,81.32,83,205,210,212.5,212.5,145,-150,-150,145,-230,230,245,245,602.5,10,SBD
Open,Raw,M,1982,Julien Idier,81.6,83,200,207.5,-210,207.5,145,-150,,145,220,232.5,240,240,592.5,11,SBD
Open,Raw,M,1987,Alexandre Eydieux,82.37,83,187.5,200,-205,200,145,-152.5,152.5,152.5,225,240,-252.5,240,592.5,12,SBD
Open,Raw,M,1993,Hedi Djouder,80.33,83,210,-220,222.5,222.5,110,115,-120,115,230,240,245,245,582.5,13,SBD
Open,Raw,M,1992,Maxime Jouanny,81.77,83,195,210,-212.5,210,127.5,-132.5,-132.5,127.5,235,-245,245,245,582.5,14,SBD
Open,Raw,M,1979,Nicolas Zerbib,82.66,83,210,-212.5,220,220,135,-140,140,140,210,220,-230,220,580,15,SBD
Open,Raw,M,1990,Vladimir Verdier,79.86,83,200,-210,215,215,125,132.5,-140,132.5,215,230,-240,230,577.5,16,SBD
Open,Raw,M,1988,Jérémmy Bequet,82.37,83,200,205,-210,205,147.5,152.5,,152.5,220,-230,-232.5,220,577.5,17,SBD
Open,Raw,M,1987,Samuel Tran-Han,82.5,83,-180,180,190,190,130,140,,140,220,-240,,220,550,18,SBD
Open,Raw,M,1990,Julien El Khatib,82.73,83,205,222.5,230,230,105,115,-122.5,115,205,-232.5,-232.5,205,550,19,SBD
Open,Raw,M,1987,Gilles Pinheiro,92.07,93,245,255,262.5,262.5,167.5,172.5,-177.5,172.5,287.5,300,307.5,307.5,742.5,1,SBD
Open,Raw,M,1984,Benjamin Hennequin,92.56,93,270,288,295,295,160,-167.5,-167.5,160,267.5,-280,287.5,287.5,742.5,2,SBD
Open,Raw,M,1990,Mike Vilet,92.27,93,240,-255,255,255,155,165,-170,165,270,282.5,-302.5,282.5,702.5,3,SBD
Open,Raw,M,1991,Pierre Payet,92.8,93,255,262.5,267.5,267.5,165,170,-172.5,170,255,265,-270,265,702.5,4,SBD
Open,Raw,M,1989,Gianni Pani,92.1,93,205,215,220,220,170,180,185,185,255,275,-287.5,275,680,5,SBD
Open,Raw,M,1989,Clément Goudin,92.71,93,220,230,-235,230,165,170,175,175,255,265,-270,265,670,6,SBD
Open,Raw,M,1985,Mathieu Noirbent,92.48,93,-215,225,230,230,172.5,180,185,185,230,242.5,247.5,247.5,662.5,7,SBD
Open,Raw,M,1981,Sylvain Varvat,90.37,93,150,,,150,145,150,,150,150,,,150,450,8,SBD
Open,Raw,M,1992,Guillaume Seveno,92.2,93,207.5,215,-220,215,-147.5,147.5,,147.5,-235,-235,,,,DQ,SBD
Open,Raw,M,1975,Philippe Neto,92.4,93,260,270,-277.5,270,170,175,-177.5,175,-255,-255,-260,,,DQ,SBD
Open,Raw,M,1989,Ali Ben Hadj Ali,103.84,105,295,307.5,,307.5,185,192.5,195,195,340,355,-370,355,857.5,1,SBD
Open,Raw,M,1987,Benoit Carole,101.54,105,250,-270,,250,190,-202.5,-202.5,190,280,,,280,720,2,SBD
Open,Raw,M,1971,Philippe Metayer,103.93,105,235,250,255,255,140,150,155,155,245,255,270,270,680,3,SBD
Open,Raw,M,1971,Marc Bouteiller,99.96,105,210,220,-225,220,190,197.5,200,200,220,235,250,250,670,4,SBD
Open,Raw,M,1989,Julien Vilin,103.6,105,210,220,-225,220,150,155,157.5,157.5,270,285,292.5,292.5,670,5,SBD
Open,Raw,M,1978,Nicolas Boyer,103.96,105,245,-255,-255,245,140,145,147.5,147.5,260,275,-290,275,667.5,6,SBD
Open,Raw,M,1995,Alexandre Herreros,101.69,105,-215,215,-230,215,155,165,175,175,255,265,275,275,665,7,SBD
Open,Raw,M,1990,Sylvain Vallee,103.08,105,200,210,220,220,145,150,-152.5,150,250,275,,275,645,8,SBD
Open,Raw,M,1986,Nicholas Walklet,102.12,105,235,247.5,-260,247.5,180,185,-187.5,185,220,235,242.5,242.5,675,G,SBD
Open,Raw,M,1980,Zaour Abdoulmejidov,99.02,105,225,-230,-230,225,140,145,-150,145,220,-230,,220,590,G,SBD
Open,Raw,M,1980,Nour-Eddine Ghaoui,117.61,120,285,-295,-295,285,165,172.5,175,175,270,290,302.5,302.5,762.5,1,SBD
Open,Raw,M,1982,Frédéric Lecellier,110.97,120,210,220,230,230,200,-210.5,-210.5,200,280,300.5,310,310,740,2,SBD
Open,Raw,M,1987,Ugo Masarotti,119.06,120,270,-285.5,-285.5,270,152.5,160,165,165,250,267.5,275,275,710,3,SBD
Open,Raw,M,1992,Joël Fabreguettes,118.27,120,220,-230,-230,220,177.5,-182.5,182.5,182.5,275,285,-307.5,285,687.5,4,SBD
