Name,WeightClassKg,Division,AgeClass,Sex,Age,Best3SquatKg,Best3BenchKg,Best3DeadliftKg,TotalKg,Event,Equipment,Place
J. Fertado,52,Novice,,M,,92.5,70,137.5,300,SBD,Single-ply,1
P. Gee,52,Novice,,F,,97.5,55,117.5,270,SBD,Single-ply,2
L. Lindner,52,Novice,,F,,75,40,112.5,227.5,SBD,Single-ply,3
T. Parisi,56,Novice,,M,,105,62.5,142.5,310,SBD,Single-ply,1
T. Clauell,56,Novice,,M,,85,70,127.5,282.5,SBD,Single-ply,2
D. Adams,56,Novice,,F,,95,45,95,235,SBD,Single-ply,3
T. DeSomma,60,Novice,,M,,165,105,185,455,SBD,Single-ply,1
David Goldstein,60,Novice,,M,,135,85,190,410,SBD,Single-ply,2
J. Schwartz,60,Novice,,M,,130,97.5,155,382.5,SBD,Single-ply,3
J. Moore,60,Novice,,M,,117.5,90,160,367.5,SBD,Single-ply,4
Jack Hughes #1,60,Masters,40-999,M,60,112.5,80,170,362.5,SBD,Single-ply,1
R. Zahmiser,67.5,Novice,,M,,215,115,227.5,557.5,SBD,Single-ply,1
Dan Henry,67.5,Novice,,M,,172.5,132.5,210,515,SBD,Single-ply,2
B. Jörgensen,67.5,Novice,,M,,155,112.5,187.5,455,SBD,Single-ply,3
S. Lui,67.5,Novice,,M,,140,125,170,435,SBD,Single-ply,4
N. Green,67.5,Novice,,M,,145,90,192.5,427.5,SBD,Single-ply,5
E. Ibarra,67.5,Novice,,M,,150,92.5,182.5,425,SBD,Single-ply,6
R. Grim,67.5,Novice,,M,,147.5,87.5,187.5,422.5,SBD,Single-ply,7
T. Powell,67.5,Novice,,M,,125,120,165,410,SBD,Single-ply,8
R. Hodge,67.5,Novice,,M,,125,137.5,142.5,405,SBD,Single-ply,9
M. Wisneske,67.5,Novice,,M,,130,100,172.5,402.5,SBD,Single-ply,10
R. Parra,67.5,Novice,,M,,117.5,87.5,147.5,352.5,SBD,Single-ply,11
B. Mack,67.5,Masters,40-999,M,40,152.5,102.5,200,455,SBD,Single-ply,3
Larry Tanager,67.5,Masters,40-999,M,45,175,117.5,215,507.5,SBD,Single-ply,1
Phil Neyer,67.5,Masters,40-999,M,50,175,82.5,205,462.5,SBD,Single-ply,2
M. Quinney,67.5,Masters,40-999,M,,140,,,,SBD,Single-ply,DQ
Sal Pinedo,75,Novice,,M,,172.5,105,252.5,530,SBD,Single-ply,1
T. Allen,75,Novice,,M,,210,112.5,205,527.5,SBD,Single-ply,2
R. Heely,75,Novice,,M,,190,110,222.5,522.5,SBD,Single-ply,3
L. Brown,75,Novice,,M,,160,130,220,510,SBD,Single-ply,4
P. Adams,75,Novice,,M,,200,122.5,185,507.5,SBD,Single-ply,5
B. Yamada,75,Novice,,M,,170,117.5,185,472.5,SBD,Single-ply,6
P. Germany,75,Novice,,M,,160,112.5,200,472.5,SBD,Single-ply,7
D. Lopez,75,Novice,,M,,172.5,105,192.5,470,SBD,Single-ply,8
S. Lechein,75,Novice,,M,,137.5,137.5,182.5,457.5,SBD,Single-ply,9
T. Singletary,75,Novice,,M,,127.5,115,187.5,430,SBD,Single-ply,10
S. Lantsberger,75,Novice,,M,,162.5,85,182.5,430,SBD,Single-ply,11
I. Temple,75,Novice,,M,,130,92.5,180,402.5,SBD,Single-ply,12
Dave Meeker,75,Novice,,M,,165,,,,SBD,Single-ply,DQ
J. Mathews,75,Masters,40-999,M,44,190,132.5,205,527.5,SBD,Single-ply,1
D. Douglas,75,Masters,40-999,M,49,130,95,170,395,SBD,Single-ply,3
Martin Garry,75,Masters,40-999,M,52,167.5,105,205,477.5,SBD,Single-ply,2
M. Danis,82.5,Novice,,M,,212.5,137.5,227.5,577.5,SBD,Single-ply,1
M. Briggs,82.5,Novice,,M,,217.5,137.5,205,560,SBD,Single-ply,2
F. Arena,82.5,Novice,,M,,172.5,140,232.5,545,SBD,Single-ply,3
J. Milton,82.5,Novice,,M,,192.5,127.5,225,545,SBD,Single-ply,4
A. Caldrone,82.5,Novice,,M,,195,135,210,540,SBD,Single-ply,5
F. Restrepo,82.5,Novice,,M,,222.5,107.5,205,535,SBD,Single-ply,6
J. Kilin,82.5,Novice,,M,,190,112.5,222.5,525,SBD,Single-ply,7
V. Berguina,82.5,Novice,,M,,160,125,230,515,SBD,Single-ply,8
J. Royak,82.5,Novice,,M,,177.5,120,210,507.5,SBD,Single-ply,9
P. Harrell,82.5,Novice,,M,,137.5,137.5,200,475,SBD,Single-ply,10
R. Westley,82.5,Novice,,M,,137.5,92.5,165,395,SBD,Single-ply,11
D. Huntsinger,82.5,Novice,,M,,107.5,92.5,165,365,SBD,Single-ply,12
T. Burroughs,82.5,Novice,,M,,100,105,155,360,SBD,Single-ply,13
Bob Seymour #1,82.5,Masters,40-999,M,42,177.5,130,187.5,495,SBD,Single-ply,2
J. Mascott,82.5,Masters,40-999,M,43,160,97.5,177.5,435,SBD,Single-ply,3
Jim Lem,82.5,Masters,40-999,M,,277.5,165,282.5,725,SBD,Single-ply,1
T. Estebo,90,Novice,,M,,240,155,272.5,667.5,SBD,Single-ply,1
T. Aguon,90,Novice,,M,,237.5,147.5,227.5,612.5,SBD,Single-ply,2
B. Lynn,90,Novice,,M,,212.5,125,245,582.5,SBD,Single-ply,3
K. Carter,90,Novice,,M,,165,142.5,207.5,515,SBD,Single-ply,4
P. Danial,90,Novice,,M,,185,117.5,200,502.5,SBD,Single-ply,5
Mark Crozier,90,Novice,,M,,165,110,227.5,502.5,SBD,Single-ply,6
W. Bostard,90,Novice,,M,,167.5,107.5,212.5,487.5,SBD,Single-ply,7
D. Morse,90,Novice,,M,,200,140,,,SBD,Single-ply,DQ
D. Minini,90,Novice,,M,,210,140,,,SBD,Single-ply,DQ
R. Crosbie,90,Novice,,M,,192.5,130,,,SBD,Single-ply,DQ
Richard Blair,90,Masters,40-999,M,42,222.5,192.5,232.5,647.5,SBD,Single-ply,1
J. Waters,90,Masters,40-999,M,49,190,132.5,245,567.5,SBD,Single-ply,2
C. Williams,90,Masters,40-999,M,43,205,127.5,230,562.5,SBD,Single-ply,3
Stanley Miyahira,90,Masters,40-999,M,42,200,135,190,525,SBD,Single-ply,4
Gordon Tornberg,90,Masters,40-999,M,51,177.5,130,200,507.5,SBD,Single-ply,5
J. Mills,100,Novice,,M,17,237.5,175,250,662.5,SBD,Single-ply,1
B. Provencher,100,Novice,,M,,232.5,147.5,260,640,SBD,Single-ply,2
D. Johnson,100,Novice,,M,,232.5,145,242.5,620,SBD,Single-ply,3
B. Heitkemper,100,Novice,,M,,182.5,132.5,227.5,542.5,SBD,Single-ply,4
G. Hite,100,Novice,,M,,185,125,195,505,SBD,Single-ply,5
D. Kavarian,100,Novice,,M,,150,80,187.5,417.5,SBD,Single-ply,6
J. Graves,100,Novice,,M,,127.5,100,157.5,385,SBD,Single-ply,7
Tom Eldridge,100,Masters,40-999,M,46,260,127.5,260,647.5,SBD,Single-ply,1
Henri Soudieres,100,Masters,40-999,M,74,137.5,137.5,172.5,447.5,SBD,Single-ply,2
B. Foutts,110,Novice,,M,,255,162.5,255,672.5,SBD,Single-ply,1
S. Belanger,110,Novice,,M,,245,155,265,665,SBD,Single-ply,2
Dave Dallmeyer,110,Novice,,M,,232.5,150,245,627.5,SBD,Single-ply,3
J. DeShon,110,Novice,,M,,155,137.5,217.5,510,SBD,Single-ply,4
D. Walsh,125,Novice,,M,,250,137.5,245,632.5,SBD,Single-ply,1
Ken Sommer,125,Masters,40-999,M,50,170,137.5,282.5,590,SBD,Single-ply,1
B. Mart,125+,Novice,,M,,250,137.5,245,632.5,SBD,Single-ply,1
B. McGuire,125+,Novice,,M,,240,147.5,237.5,625,SBD,Single-ply,2
M. Kavarian,125+,Novice,,M,,240,125,227.5,592.5,SBD,Single-ply,3
D. Peters,125+,Masters,40-999,M,41,220,140,185,545,SBD,Single-ply,1
