Name,Sex,Age,BodyweightKg,WeightClassKg,Division,Equipment,Event,Deadlift1Kg,Deadlift2Kg,Deadlift3Kg,Best3DeadliftKg,TotalKg,Place
Katie McKnight,F,18,67.75,,F-BW,Raw,D,82.5,95,102.5,102.5,102.5,7
Gillian McLuckie,F,32,63,,F-BW,Raw,D,85,100,105,105,105,6
Lesley Donnan,F,34,122.1,,F-BW,Raw,D,95,107.5,-115,107.5,107.5,9
Lesley Foulger,F,36,62.2,,F-BW,Raw,D,95,102.5,107.5,107.5,107.5,5
Milly Irvine,F,27,104.55,,F-BW,Raw,D,95,105,112.5,112.5,112.5,8
Aimee Brown,F,24,68.3,,F-BW,Raw,D,110,117.5,130,130,130,3
Carolyn Robertson,F,28,105,,F-BW,Raw,D,135,145,150,150,150,4
Chanel Voong Hamilton,F,26,65.85,,F-BW,Raw,D,135,140,145,145,145,1
Caitlin Riley,F,28,101.15,,F-BW,Raw,D,150,160,-165,160,160,2
Graeme Lamont,M,28,109.2,,M-BM,Raw,D,290,310,-317.5,310,310,1
Kierran Leith,M,24,138.3,,M-BM,Raw,D,260,280,300,300,300,2
Alex Findley,M,32,126.35,,M-BM,Raw,D,190,210,220,220,220,3
Logan Kennedy,M,28,78.5,,M-BM,Raw,D,220,230,235,235,235,4
Kyle Hamilton,M,28,88.05,,M-BM,Raw,D,220,230,235,235,235,5
Fraser Stewart,M,28,107.1,,M-BM,Raw,D,110,130,150,150,150,6
Tyler Smith,M,17,62.35,,M-BM,Raw,D,172.5,190,200,200,200,7
Stuart Donaghy,M,37,86.25,,M-BM,Raw,D,185,200,-210,200,200,8
Jack May,M,24,88.5,,M-BM,Raw,D,172.5,180,187.5,187.5,187.5,9
Rory May,M,52,84.05,,M-BM,Raw,D,190,202.5,-207.5,202.5,202.5,10
Colin Thomson,M,28,95.65,,M-BM,Raw,D,160,170,182.5,182.5,182.5,11
Gordon McGuiness,M,28,82.2,,M-BM,Raw,D,190,200,-210,200,200,12
William Kelly,M,37,100.85,,M-BM,Raw,D,170,180,190,190,190,13
Jason Eaddie,M,47,104.35,,M-BM,Raw,D,290,305,-317.5,305,305,14
Eben Van Wyk,M,38,109.6,,M-EqM,Multi-ply,D,280,300,325,325,325,1
John Pollock #1,M,43,124.3,,M-EqM,Multi-ply,D,-320,-320,320,320,320,2
Chris Beetham,M,31,131.9,,M-EqM,Multi-ply,D,300,320,-340,320,320,3
Neil Elliot,M,48,127,,M-EqM,Multi-ply,D,280,290,-300,290,290,5
Jim Gerrard,M,33,98.3,,M-EqM,Multi-ply,D,250,262.5,-272.5,262.5,262.5,6
James Ingram,M,46,85.8,,M-AM,Raw,D,225,-235,-240,225,225,7
Al Reid,M,50,126.75,,M-AM,Raw,D,240,250,260,260,260,8
Darren Rob,M,31,108.1,,M-EqM,Multi-ply,D,250,-270,-270,250,250,9
Bobby Caldwell,M,53,109.85,,M-AM,Raw,D,235,245,-252.5,245,245,10
Andy Black,M,30,191,,M-EqM,Multi-ply,D,-280,300,320,320,320,4
Andrew McGuinness,M,30,99.9,,M-AM,Raw,D,210,225,235,235,235,13
Jack Haxton,M,20,87.65,,M-AM,Raw,D,227.5,245,262.5,262.5,262.5,4
Andrew Smith #2,M,29,88.65,,M-AM,Raw,D,240,260,-272.5,260,260,8
Tim Meadows,M,39,113.1,,M-AM,Raw,D,240,260,-280,260,260,12
William Barnetson,M,41,120.9,,M-AM,Raw,D,250,262.5,272.5,272.5,272.5,11
John Sutherland,M,32,119.5,,M-AM,Raw,D,250,262.5,272.5,272.5,272.5,10
Chris Watson,M,34,99.75,,M-AM,Raw,D,252.5,272.5,280,280,280,5
Michael Dickson,M,29,106.8,,M-AM,Raw,D,265,280,290,290,290,3
Josh Crawley,M,28,129.9,,M-AM,Raw,D,270,300,-322.5,300,300,6
Neil Greene,M,38,105.65,,M-AM,Raw,D,270,282.5,285,285,285,7
Andrew McWilliams,M,25,146.65,,M-AM,Raw,D,275,295,317.5,317.5,317.5,2
David Clark,M,31,147.75,,M-AM,Raw,D,285,-292.5,-292.5,285,285,9
Delroy McQueen,M,44,117.2,,M-AM,Raw,D,310,330,350,350,350,1
Gaby Coia,F,53,72.45,,F-AW,Raw,D,122.5,130,-135,130,130,9
Sylvia Stepien,F,31,64.95,,F-AW,Raw,D,127.5,135,140,140,140,8
Becca McIntyre,F,27,57.1,,F-AW,Raw,D,130,137.5,145,145,145,2
Gemma Young,F,30,86.7,,F-AW,Raw,D,125,140,-147.5,140,140,10
Diane Day,F,29,69.2,,F-AW,Raw,D,140,147.5,-150,147.5,147.5,7
Elizabeth Elliot,F,40,79.55,,F-AW,Raw,D,150,160,-167.5,160,160,6
Gillian Maitland,F,37,75.45,,F-AW,Raw,D,160,170,-175,170,170,4
Dionne McIntyre Wilson,F,29,64.95,,F-AW,Raw,D,170,177.5,-182.5,177.5,177.5,1
Rhian Arnott,F,31,94.55,,F-AW,Raw,D,165,180,-190,180,180,5
Nicola Ann Bennett,F,29,88.5,,F-AW,Raw,D,185,-195,-200,185,185,3
