Абдул Рашид Метришев,Абдул-Рашид Метришев
Артем Медведєв,Артем Мєдведєв
Дмитро Григорьєв,Дмитро Григор'Єв
Сергій Мірошніченко,Сергей Мирошниченко
Артур Ламєкін,Артур Ламекін
Віталій Рейда,Виталий Рейда
Карина Утенкова,Каріна Утенкова
Олег Жулинский,Олег Жулінський
Віталій Решетняк,Виталий Решетняк
Єфим Степацький,Ефим Степацький
Анатолий Печерский,Анатолій Печерский
Олександр Дживиряга,Олександр Дживіряга
Денис Дубровський,Денис Дубровский
Віктор Галабір,Виктор Галабір
Василь Пашкевич,Васил Пашкевич
Ірина Тіхонова,Ірина Тихонова
Констянтин Янішевський,Костянтин Янішевський,Костянтин Янишевський,Константин Янишевский
Віталій Федорченко,Виталий Федорченко
Анатолій Мальнєв,Анатолій Мальнев
Юрий Саликов,Юрій Саліков
Юрий Жевак,Юрій Жевак
Андрій Ніколаенко,Андрій Николаєнко
Руслан Билан,Руслан Білан
Геннадій Попов,Генадій Попов,Геннадий Попов
Дмитро Сінчук,Дмитро Синчук
Ярослав Пушкарь,Ярослав Пушкар
Віталій Тімшин,Віталій Тимшин
Олександр Артем'Єв,Олександр Артєм'Єв
Вячеслав Глушенко,В'Ячеслав Глушенко
Станіслав Афанасьєв,Станіслав Афанас'Єв
Андрій Несевря,Андрій Нєсєвря
Наталія Пенькова,Наталія Пєнькова
Андрій Звезділін,Андрій Звєзділін
Євген Зуй,Евген Зуй
Володимир Бриженюк,Володимир Бріженюк
Павло Гарькавий,Павло Гаркавий
Віктор Галабір,Виктор Галабир
Олександр Оніщенко,Олександр Онищенко
Станіслав Юрченко,Станислав Юрченко
Назарій Перхулін,Назарій Перхулин
Олександр Кліменко,Олександр Клименко
Євгеній Павлов,Евгений Павлов,Євген Павлов
Станіслав Базіль,Станіслав Базиль
Мирослав Решетніков,Мирослав Решетников
Андрій Вінник,Андрій Винник
Денис Онуфрієнко,Денис Онуфриенко
Дмитро Григорьєв,Дмитро Григор'єв
Валерия Позднякова,Валерія Позднякова
Виталий Белобородов,Віталій Белобородов
Володимир Козін,Володимир Козин
Олександр Вітвіцький,Олександр Витвицький
Віталій Чуніховський,Виталий Чуниховский
Олег Герасімов,Олег Герасимов
Дмитро Кальнин,Дмитро Кальнін
Виталий Столпак,Віталій Столпак
Анатолій Лопаткін,Анатолий Лопаткин
Микола Семікін,Микола Семикін
Руслан Лебединский,Руслан Лебединський
Віталій Торкай,Виталий Торкай
Ашот Єганян,Ашот Еганян
Юрій Уманець,Юрий Уманец
Іван Луценко,Иван Луценко
Артур Созінов,Артур Созинов
Руслан Вінник,Руслан Винник
Юрій Романов,Юрий Романов
Віктор Межевікін,Віктор Межевикін
Євгенія Лі,Євгенія Ли,Евгения Ли
Максим Портянік,Максим Портяник
Павло Підтоптаний,Павел Пидтоптаный
Вячеслав Мінтюк,В'Ячеслав Мінтюк
Олександр Калініченко,Олександр Калиниченко
Ігор Старченко,Игорь Старченко
Віталій Середенко,Виталий Середенко
Вадим Алієв,Вадим Алиев
Олег Вагін,Олег Вагин
Андрій Ніколаєнко,Андрій Ніколаенко
Константин Якименко,Констянтин Якименко
Антон Гайдаєнко,Антон Гайдаенко
Олексій Вознік,Олексій Возник
Наріна Кочарян,Нарина Кочарян
Ігор Андрусик,Игорь Андрусик
Марина Железнова,Марина Желєзнова
Станислав Смирнов,Станіслав Смірнов
Денис Васильев,Денис Васильєв
Віктор Петренко,Виктор Петренко
Анатолій Суровцев,Анатолий Суровцев
Юрій Ширинський,Юрий Ширинский
Геннадій Язев,Геннадий Язев
Єфим Степацький,Ефим Степацкий
Ирина Кабакова,Ірина Кабакова
Роман Орєхов,Роман Орехов
Сергій Черешнєв,Сергій Черешнев
Валентин Літвеченко,Валентин Литвеченко
Володимир Лебєдєв,Володимир Лебедєв
Віталій Алєксєєв,Виталий Алексеев
Віктор Денісенко,Віктор Денисенко
Віталій Середенко,виталий Середенко
Станіслав Базіль,Станислав Базиль
Ігор Марунич,Игорь Марунич
Ігор Бондарєв,Игорь Бондарев
Ігор Тарасов,Игорь Тарасов
Вячеслав Якубчак,В'Ячеслав Якубчак
Валерій Шевченко,Валерий Шевченко
Ігор Савін,Игорь Савин
Ірина Галабір,Ирина Галабир
Ігор Маркін,Игорь Маркин
Ольга Фетісова,Ольга Фетисова
Каріна Киріяк,Карина Киріяк
Вячеслав Мінтюк,Вячеслав Минтюк
Марія Маркович,Мария Маркович
Ростислав Лісняк,Ростислав Лисняк
Роман Красицький,Роман Краситський
Ігор Мельник,Игорь Мельник
Микита Мітрюхін,Микита Митрюхін
Євгеній Тимохін,Евгений Тимохин
Ігор Клім,Ігор Клим
Ігор Долженко,Игорь Долженко
Денис Архіпов,Денис Архипов
Віталій Місютинський,Виталий Мисютинский
Анна Іванова,Анна Иванова
Віталій Хаустов,Виталий Хаустов
Юлія Шенкаренко,Юлия Шенкаренко
Дмитро Григорьєв,Дмитрий Григорьев
Наталья Токарева,Натальья Токарева
Артём Литвиненко,Артем Литвиненко
Инна Филимонова,Анна Филимонова
Владислав Кузьміщев,Владислав Кузьмищев
Евгений Коваленко,Євгеній Коваленко
Юрій Спінов,Юрій Спинов
Наталия Колесникова,Наталья Колесникова
Фемистоклис Ламбрионидис,Фемистоклис Ламбрианидис,Фемис Ламбрионидис
Анастасия Павлова,Анна Павлова,Анастасія Павлова
Дмитрий Дудник,Дмітрій Дуднік
Алексей Москвичёв,Алексей Москвичев
Віталій Алексеєв,Віталій Алєксєєв
Олег Базилевич,Олег Базілевич
Сергей Колесник,Сергій Колесник
Юрий Тарасов,Юрій Тарасов
Едуард Долгов,Эдуард Долгов
Арсен Касєєв,Арсен Касеев
Владислав Савицкий,Владислав Савицький
Станислав Кумсков,Стас Кумсков
Станислав Марочко,Станіслав Марочко
Игорь Поважнюк,Ігор Поважнюк
Игорь Ястребцов,Игорь Ястребцев
Артём Ковальчук,Артем Ковальчук
Тимур-Булат Магомадов,Тимурбулат Магомадов
Нина Кондрашёва,Нина Кондрашева
Стэлла Вавилова,Стелла Вавилова
Игорь Щурилов,Игор Щурилов
Карен Данилян,Карен Данильян
Андрей Паньков,Андрей Панков
Виктор Кузнецов,Віктор Кузнецов
Иван Шевченко,Іван Шевченко
Станислав Шейко,Станіслав Шейко
Сергей Мальков,Сергей Малков
Александр Сабельфельд,Александр Сабелфельд
Галсут Саарян,Галуст Саарян
Максим Гібець,Максим Гибець
Ігор Іванов,Игорь Иванов
Вячеслав Перехрест,В'ячеслав Перехрест
Ірина Мазур,Ирина Мазур
Станіслав Афанасьєв,Станіслав Афанась'єв
Олег Ильин,Олег Ільїн
Сергій Лук'Янов,Сергій Лук'янов
Дмитро Ломейко,Дмитрий Ломейко
Олександр Яковлєв,Олександр Яковлев
Віталій Омельченко,Виталий Омельченко
Тетяна Хомяк,Тетяна Хом'як
Вячеслав Здоровенко,В'ячеслав Здоровенко
Віктор Міма,Виктор Мима
Дар'я Косенко,Дар'Я Косенко
Юрій Мар'яновський,Юрій Мар'Яновський
Геннадій Зотов,Геннадий Зотов
Станіслав Хаїтов,Станислав Хаитов
Олександр Лісовський,Олександр Лисовський
Вадим Зарудницький,Вадим Зарудницкий
Олександр Мірошниченко,Олександр Мірошніченко
Владимир Шевченко,Володимир Шевченко
Юрій Малигін,Юрий Малыгин
Наталья Кравченко,Наталя Кравченко
Дмитро Стрельніков,Дмитро Стрельников
В'ячеслав Телюра,В'Ячеслав Телюра
Наталья Чубанова,Наталя Чубанова
Іван Баранов,Иван Баранов
Эдуард Марченко,Едуард Марченко
Вячеслав Мироненко,В'ячеслав Мироненко
Станіслав Смажко,Станислав Смажко
Петро Водоп'ян,Петро Водоп'Ян
Олег Віксіч,Олег Виксич
Станіслав Афанасьєв,Станіслав Афанас'єв
Иван Наумов,Іван Наумов
Вячеслав Цыганок,В'ячеслав Циганок,Вечеслав Цыганок
Євген Яримбаш,Евгений Ярымбаш
Юрий Рубанов,Юрий рубанов
Аркадий Шалоха,Аркадій Шалоха
Светлана Дергапутская,Світлана Дергапутська
Игорь Лебедев,Ігор Лєбєдєв
Наталья Осипова,Наталя Осіпова
Ибрагим Ильхасан,Ібрагім Ільхасан
Яна Хомич,Яна Хоміч
Дмитро Григорьєв,Дмитро Григорь'єв
Наталя Мілеєва,Наталія Мілєєва
Станислав Максимов,Станіслав Максимов
Сергей Журавлёв,Сергей Журавлев
Ярослав Бурыкин,Ярослав Бурикін
Юрий Куликов,Юрій Куліков
Александр Чекачков,Олександр Чекачков
Иван Козырь,Іван Козир
Вячеслав Бордіяну,В'ячеслав Бордіяну
Анатолий Горячок,Анатолій Горячок
Анастасия Деревянко,Анастасія Дерев'янко
Жанна Иванова,Жанна Іванова
Виктор Пискунов,Віктор Піскунов
Вячеслав Кравченко,В'ячеслав Кравченко
Олег Базилевич,Олег Базiлевич
Игорь Ким,Ігор Кім
Рафаэль Буклов,Рафаель Буклов
Камиль Гафаров,Камил Гафаров
Александр Мирошниченко,Олександр Мірошниченко
Ігор Топілін,Ігор Топилін
Александр Асмолов,Олександр Асмолов
Сергій Моїсеєв,Сергій Моісєєв
Сергій Ласіцин,Сергей Ласицин
Володимир Чигиринський,Владимир Чигиринский
Анастасия Тищенко,Анастасія Тіщенко
Антон Васильєв,Антон Васильев
Ильхом Эргашев,Илхом Эргашев
Алексей Лисогор,Олексій Лісогор
Дмитро Головинський,Дмитрий Головинский,Дмитро Головинський
Эрин Шель-Фетенгоф,Эрин шель Фетенгоф
Антон Пєтухов,Антон Петухов
Рінат Заріпов,Ринат Зарипов
Альбіна Черняк,Альбина Черняк
Ольга Писарева,Ольга Пісарєва
В'ячеслав Корсун,Вячеслав Корсун
В'ячеслав Якубчак,Вячеслав Якубчак
Андрій Гринішин,Андрій Гринишин
Игорь Гасюк,Ігор Гасюк
Геннадій Язєв,Геннадій Язев
Сергій Борюк,Сергей Борюк
Вячеслав Горбунов,В'ячеслав Горбунов
Евгений Яковлев,Євгеній Яковлєв
Светлана Дедюля,ДедюляСветлана
Иван Моргун,Іван Моргун
Виталий Деркач,Віталій Деркач
Игорь Жук,Ігор Жук
Абдул Рашид Метришев,Абдул Метришев,Абдул- Метришев
Валерий Бегинин,Валерій Бегінін
Сергей Харченко,Сергій Харченко
Дарья Кузьмина,Дар'я Кузьміна
Даніїл Фомін,Даниил Фомин
Семён Филякин,Семен Филякин
Сергій Карась,Сергей Карась
Степан Сагіров,Степан Сагиров
Вячеслав Панчук,Вячеслав Панчукm,В'ячеслав Панчук
Вячеслав Яковлев,В'ячеслав Яковлєв
Павел Исаков,Павло Ісаков
Михайло Шадрін,Михаил Шадрин
Олег Фітінгоф,Олег Фітінгов
Тімур Діденко,Тимур Діденко
Володимир Рудніченко,Владимир Рудниченко
Віталій Буряк,Виталій Буряк
Ігор Коновалов,Игорь Коновалов
Юрій Соболєв,Юрий Соболев
Євгеній Кандауров,Евгений Кандауров
Ігор Єпішев,Игорь Епишев
Павло Семкович,Павел Семкович
Мікаель Оганесян,Микаел Оганесян
Богдан Храпаль,Богдан Хропаль
Руслан Рыжих,Руслан Рижих
Олексій Богатирьов,Алексей Богатырев
Вячеслав Овчарук,В'ячеслав Овчарук
Олександр Мітягін,Олександр Мітягин
Андрій Павлов,Андрей Павлов
Юрій Коваленко,Юрий Коваленко
Роман Шишкін,Роман Шишкин
Сергій Данілов,Сергій Данилов
Володимир Василенко,Владимир Василенко
Наталія Цуканова,Наталя Цуканова
Віталій Титаренко,Виталий Титаренко
Антон Ободовський,Антон Ободовский
Станіслав Кузнецов,Станислав Кузнецов
Вячеслав Шадорин,В'ячеслав Шадорін
Юлія Остапенко,Юлия Остапенко
Володимир Коршунов,Владимир Коршунов
Наталья Орехова,Наталя Орехова
Ігор Пак,Игорь Пак
Олексій Ситніков,Алексей Ситников
Олександр Плотнік,Олександр Плотник
Михайло Желязков,Михаил Желязков
Татьяна Королёва,Татьяна Королева
Валерия Щеглова,Валерия Холодова
Айрат Зийннатуллин,Айрат Зиннатуллин
Юлія Муха,Юлия Муха
Віталій Горбунов,Виталий Горбунов
Анатолій Панченко,Анатолий Панченко
Сергій Піскун,Сергій Пискун
Вячеслав Шутенко,В'ячеслав Шутенко
Роман Дубіна,Роман Дубина
Юрій Васильєв,Юрий Васильев
Ігор Лотнік,Ігор Лотник
Анастасія Пасічник,Анастасия Пасичник
Крістіна Наришкіна,КрістІна Наришкіна
Дарія Іськів,Дарія іськів
Андрій Манастирський,Андрій Монастирський
Вікторія Гурак,вікторія Гурак
Ігор Богомолов,Игорь Богомолов
Маряна Фісуненко,Мар'яна Фісуненко
Софія Рудь,София Рудь
Єлізавета Солопан,Єлизавета Солопан
Давід Пкін,Давид Пкін
Максим Варченко,Максим Верченко
Ярослав Ховалкін,Ярослав Ховалкин
Гія Троянов,Гия Троянов
Вікторія Зрайченко,Виктория Зрайченко
Євген Герасімов,Євген Герасимов
Дмитро Лавренко,Дмитрий Лавренко
Марія Діденко,Мария Диденко
Станіслав Петрук,Станислав Петрук
Вероніка Венедіктова,Вероніка Венедиктова
Полина Главатских,Полина Главацких
Дмитро Мірошніченко,Дмитро Мірошниченко
Юрий Михненко,Юрій Міхненко
Євгеній Омельяновський,Евгеній Омельяновський
Георгий Каплун,Георгій Каплун
Євген Ситніков,Євген Ситников
Денис Тарівердієв,Денис Тарівердіев
Сергей Захаров,Сергій Захаров
Виктор Ватагин,Віктор Ватагін
Єфим Степацький,Єфім Степацький
Володимир Коломієц,Володимир Коломієць
Віктор Боринец,Віктор Боринець
Александр Мальков,Александр Малков
Игорь Стасюк,Ігор Стасюк
Павел Ульрих,Павел Улрих
Юрий Драчёв,Юрий Драчев
Вікторія Федорова,Виктория Федорова
Емин Галиб Оглы Мамедов,Оглы Мамедов Эмин Галиб,Емин Мамедов,Эмин Мамедов
Роман Аниськин,Роман Анискин
Радій Спицин,Радий Спицин
Николай Аксёнов,Николай Аксенов
Роман Закіров,Роман Закиров
Валерій Чернов,Валерий Чернов
Олексій Бондарь,Олексій Бондар
Станіслав Михайлов,Станислав Михайлов
В'ячеслав Бєлоусов,Вячеслав Белоусов
Ігор Шаповал,Игорь Шаповал
Віталій Черних,Виталий Черных
Наталья Гончарова,Наталя Гончарова
Артем Горбачев,Артем Горбачов
Денис Феклістов,Денис Феклистов
Виталий Крыжановський,Виталий Крыжановский
Володимир Андреєв,Володимир Андрєєв
Юрій Хоменко,Юрий Хоменко
Олександр Генсіцький,Олександр Генсицький
Роман Чеботарёв,Роман Чеботарев
Эдуард Исаков,Едуард Исаков
Лариса Ряднова,Лариса РЯДНОВА
Олег Ковальов,Олег Ковалев
Виталий Жуков,Віталій Жуков
Алёна Поделко,Алена Поделко
Таїсія Кузнецова,Таисия Кузнецова
Сурадж Чеботарь,Сурадж Чеботар
Аркадій Бухтійчук,Аркадий Бухтийчук
Едуард Казарян,Эдуард Казарян
Віктор Пастухов,Виктор Пастухов
Світлана Смірнова,Світлана Смірноваm,Светлана Смирнова
Юлія Калінченко,Юлия Калинченко
Андрій Алексєєв,Андрій Алєксєєв
Наталя Старікова,Наталья Старикова
Ніяс Ізмайлов,Нияс Измайлов
Юлія Антонова,Юлия Антонова
Тімур Ереджепов,Тимур Эреджепов
Руслан Андреєв,Руслан Андреев
Віктор Кочмар,Виктор Кочмар
Ельмир Тарвердиев,Эльмир Тарвердиев
Олег Афанасьев,Олег Афанасьєв,Олег Афанась'єв
Сабрі Ібраїмов,Сабри Ибраимов
Віталій Пулін,Виталий Пулин
Інна Пояркова,Инна Пояркова
Владислав Лісовський,Владислав Лисовский
Іван Калмиков,Иван Калмыков
Вероніка Бондарєва,Вероника Бондарева
Віктор Лобко,Виктор Лобко
Віталій Кіяненко,Виталий Кияненко
Ігор Кулик,Игорь Кулик
Станіслав Ніколаєнко,Станислав Николаенко
Антон Жукоцький,Антон Жукоцкий 
Анатолій Болюх,Анатолий Болюх
Юрій Ярославський,Юрий Ярославский
Григорій Аветісян,Григорий Аветисян
Юлія Маліновська,Юлія Малиновська
Денис Охріменко,Денис Охрименко
Віталій Романько,Виталий Романко
Євген Нікітенко,Євген Никитенко
Владислав Вершинін,Владислав Вершинин
Андрій Ситніков,Андрій Ситников
Владислав Кузнецов,Владислав Кузнєцов
Іван Іванов,Иван Иванов
Дар'я Михайлова,Дар'Я Михайлова
Іван Ковальський,Иван Ковальский
Григорій Бараннік,Григорій Баранник
Максим Князев,Максим Князєв
Іван Фещенко,Иван Фещенко
Іван Демченко,Иван Демченко
Олексій Орлов,Алексій Орлов
Юрій Богданов,Юрий Богданов
Микола Санін,Николай Санин
Наталья Трухина,Наталия Трухина
Віктор Акулов,Виктор Акулов
Юлія Вовк,Юлия Вовк
Едуард Шушаков,Эдуард Шушаков
Валерій Бенц,Валерий Бенц 
Геннадій Семенюк,Геннадий Семенюк
Станіслав Морозов,Станислав Морозов
Станіслав Бороздін,Станислав Бороздин
Іван Пупченко,Иван Пупченко
Ігор Парфінюк,Игорь Парфинюк
Юрій Головань,Юрий Головань
Ігор Козлов,Игорь Козлов
Сергій Прокофьєв,Сергій Прокоф'єв
Ігор Томаш,Игорь Томаш
Андрій Сидельніков,Андрій Сідельников
Илья Фёдоров,Илья Федоров
Максим Новыченко,Максим Новиченко
Юрий Байков,Юрий Бойков
Виталий Головин,Віталій Головін
Вадим Швець,Вадим Швец
Роман Еремашвили,Роман Еремошвили
Виктор Филоненко,Віктор Філоненко
Виталий Терещенко,Віталій Терещенко
Алексей Забабуркин,Олексій Забабуркін
Заур Гусейнов,Заур Гусенов
Антон Пронин,Антон Пронін
Оксана Починкина-Соковнина,Оксана Починкина
Юрий Иванов,Юрій Іванов
Виктор Черныш,Віктор Черниш
Анатолий Лебедев,Анатолій Лебедєв
Виталий Бойко,Віталій Бойко
Валерия Лёвочкина,Валерия Левочкина
Анатолий Шаповалов,Анатолій Шаповалов
Геннадий Семенов,Геннадій Семенов
Вениамин Никитин,Веніамін Нікітін
Юрий Терещенко,Юрій Терещенко
Юрий Савенко,Юрій Савенко
Артем Иванов,Артем Іванов
Наиль Мухаев,Наил Мухаев
Игорь Данилов,Ігор Данилов
Виктор Попов,Віктор Попов
Денис Чебурашкин,Денис. Чебурашкин
Владимир Чернышов,Владимир Чернышев
Марина Джавихишвили,Марина Джавахиашвили,Марина Джавахишвили
Гульфия Хисаметдинова,Гульфия Хисамутдинова
Надія Тищенко,Наталія Тищенко
Тетяна Степацька,Татьяна Степацька
Александр Токарь,Александр токарь
Тимур-Булат Магомадов,Тимир-Булат Магомадов
Александр Леднёв,Александр Леднев
Виктор Беляев,Віктор Беляєв
Игорь Клубов,Ігор Клубов
Сергій Налейкін,Сергей Налейкин
Наталья Пермякова,Наталя Пермякова
Александр Бойков,Алексанндр Бойков
Валерій Кузнєцов,Валерий Кузнецов
Катерина Мойсік,Катерина Мойсик
Микола Крішун,Микола Кришун
Ярослав Гав'Яда,Ярослав Гав'яда
В'ячеслав Архіпов,Вячеслав Архипов
Иван Лебедев,Іван Лебедєв
Роман Чеботарёв,Роман Чеботарьов
Ирина Шелинговская,Ирина Шепинговская
Кямран Лумедзе,Кямран Лумедзэ
Юрій Олейник,Юрий Олейник
Руслан Ревуцкий,Руслан Ревуцький
Максим Скобелєв,Максим Скобєлєв
Аделаїда Поддуєва,Аделаіда Поддуэва
Самвел Габриэлян,Самвел Габриелян
Игорь Калыта,Игорь Калита
Игорь Кузьменко,Ігор Кузьменко
Игорь Пронин,Ігор Пронін
Эльдар Хайтбаев,Элдар Хайтбаев
Сергей Меньщиков,Сергей Менщиков
Артём Петров,Артем Петров
Игорь Казаков,Ігор Казаков
Любовь Борец,Любов Борець
Артём Воронцов,Артем Воронцов
Віталій Ковальчук,Виталий Ковальчук
Геннадий Чульденко,Геннадий Чулденко
Игорь Лысенко,Ігор Лисенко
Игорь Пономаренко,Ігор Пономаренко
Даниил Рудь,Данил Рудь
Елена Николенко,елена Николенко
Данила Омельченко,Данила омельченко
Артём Дъяков,Артём Дьяков
Юрий Фурман,Юрій Фурман
Ярослав Трубичкин,Ярослав Трубічкін
Карен Чарчян,Карен Харчян
Дарья Степанова,Дар'я Степанова
Роман Пичугин,Роман Пічугін
Артем Медведєв,Артем Медведев
Александр Шевченко,Олександр Шевченко
Олег Васильєв,Олег Васильев
Алексей Тотьмянин,Алексей Тотмянин
Дарья Степаненко,Дар'я Степаненко
Виктор Андрианов,Віктор Андріанов
Олег Лебедєв,Олег Лебедев
Юлия Кукина,Юлія Кукіна
Дмитрий Немченко,Дмитро Немченко
Ильдар Шафиев,Илдар Шафиев
Денис Брагин,Денис Брагін
Анна Неумержицкая,Неумержицкая Анна
Михаил Лукьянов,Михаил Лукъянов
Юрий Старков,Юрій Старков
Володимир Івасютин,Володимир Івасютін
Євгеній Левковский,Евгений Левковский
Олександр Пашковець,Олександр Пашковец
Едуард Гусєв,Эдуард Гусев
Дмитро Ніколаєв,Дмитро Ніколаев
Микола Белозьоров,Микола Бєлозьоров
Євгеній Руднік,Евгеній Руднік
Игорь Данилов,Ігор Данілов
Мария Брайко,Марія Брайко
Виталий Павлушко,Віталій Павлушко
Віталій Сербин,Віталій Сербін
Ярослав Гав'Яда,Ярослав Гавяда
Володимир Коломіець,Володимир Коломієц
Наталья Кирушева,Наталья КИрушева
Руслан Суботин,Руслан Суботін
Анатолий Павлов,Анатолій Павлов
Марьям Газиева,Марям Газиева
Никита Саутский,Никита Сауцкий
Наталя Глєбова,Наталья Глебова
Иван Моисеев,Іван Моїсеєв
Артём Данельянц,Артем Данельянц
Дмитрий Мальков,Дмитрий Малков
Леонтий Мирошник,Леонтій Мірошник
Юлия Малиновская,Юлія Маліновська
Игорь Курлов,Ігор Курлов
Александр Сыкменёв,Александр Сыкменев
Искандэр Галимов,Искандер Галимов
Флюр Гульмурзаев,Флюр Гулмурзаев
Виталий Бондарев,Віталій Бондарєв
Максим Якимов,Максим Якімов
Виталий Бабенко,Віталій Бабенко
Георгий Сасаниа,Георгій Сасаніа
Валерий Смольянинов,Валерий Смолянинов
Антон Спиридонов,Антон Спірідонов
Вячеслав Титов,Вячеслав Тітов
Бэлла Степкина,Белла Степкина
Виктор Маслов,Віктор Маслов
Светлана Ильясова,Светлана Илясова
Степан Слобожанин,Степан слобожанин
Андрей Лавреньтьев,Андрей Лаврентьев
Сергей Фарафонтьев,Сергей Фарафоньтев
Антон Алексеев,Антон Алєксєєв
Виктория Нефедова,Вікторія Нефьодова
Юрий Кухтерин,Юрій Кухтерін
Иван Коновалов,Іван Коновалов
Сергей Слободенюк,Сергій Слободенюк
Руслан Фисун,Руслан Фісун
Дарья Родионова,Дарья Родіонова
Анастасия Зорина,Анастасія Зоріна
Юлия Иванова,Юлія Іванова
Марина Горбачёва,Марина Горбачева,М.П. Горбачева
Иван Пономарёв,Иван Пономарев