Division,WeightClassKg,Place,Name,Team,BodyweightKg,Best3SquatKg,Best3BenchKg,Best3DeadliftKg,TotalKg,Equipment,Event,Sex
Boys,51.71,1,Santos Gallegos,Woodville,50.08,113.4,70.31,124.74,308.44,Single-ply,SBD,M
Boys,51.71,2,Jordan Foxworth,Woodville,51.71,104.33,61.23,115.67,281.23,Single-ply,SBD,M
Boys,55.79,3,Dade Cooper,New Caney,51.89,79.38,54.43,102.06,235.87,Single-ply,SBD,M
Boys,55.79,1,AJ Ono,Conroe The Woodlands,55.61,138.35,90.72,149.69,378.75,Single-ply,SBD,M
Boys,55.79,2,Nathan Erickson,Splendora,52.89,122.47,70.31,122.47,315.25,Single-ply,SBD,M
Boys,55.79,3,Jordan White,Willis,55.16,102.06,74.84,124.74,301.64,Single-ply,SBD,M
Boys,55.79,4,Nick Provost,Conroe The Woodlands,52.34,95.25,52.16,108.86,256.28,Single-ply,SBD,M
Boys,59.87,5,Conner Jackson,Willis,55.97,81.65,49.9,102.06,233.6,Single-ply,SBD,M
Boys,59.87,1,Ryan Collette,Huffman Hargrave,59.6,142.88,97.52,158.76,399.16,Single-ply,SBD,M
Boys,59.87,2,Kris Jordan,Trinity,58.33,142.88,81.65,133.81,358.34,Single-ply,SBD,M
Boys,59.87,3,Tyler Bond,New Caney,57.06,83.91,63.5,106.59,254.01,Single-ply,SBD,M
Boys,67.13,1,Brandon Coon,Conroe Caney Creek,64.59,204.12,97.52,201.85,503.49,Single-ply,SBD,M
Boys,67.13,2,Cesar Marroquin,Huffman Hargrave,66.59,195.04,124.74,183.7,503.49,Single-ply,SBD,M
Boys,67.13,3,Tyler Dawson,Livingston,63.41,174.63,113.4,163.29,451.32,Single-ply,SBD,M
Boys,67.13,4,Zach Hawkins,Conroe The Woodlands,66.5,145.15,131.54,172.37,449.06,Single-ply,SBD,M
Boys,67.13,5,Gin Ivey,Conroe Oak Ridge,65.86,154.22,102.06,188.24,444.52,Single-ply,SBD,M
Boys,67.13,6,Nick Werner,Conroe Caney Creek,66.5,142.88,106.59,181.44,430.91,Single-ply,SBD,M
Boys,67.13,7,David Rodas,Crosby,64.05,142.88,97.52,181.44,421.84,Single-ply,SBD,M
Boys,67.13,8,Angel Galvan,Crosby,66.13,142.88,106.59,154.22,403.7,Single-ply,SBD,M
Boys,67.13,9,Riley Shaw,Woodville,64.32,142.88,90.72,167.83,401.43,Single-ply,SBD,M
Boys,67.13,10,Jaylon Williams,Corrigan-Camden,64.95,149.69,68.04,172.37,390.09,Single-ply,SBD,M
Boys,67.13,11,Emanual Walker,Corrigan-Camden,60.33,138.35,74.84,154.22,367.41,Single-ply,SBD,M
Boys,67.13,12,Devin Kelly,Huffman Hargrave,66.13,140.61,81.65,133.81,356.07,Single-ply,SBD,M
Boys,67.13,13,Trevon West,Beaumont Ozen,66.59,129.27,81.65,140.61,351.53,Single-ply,SBD,M
Boys,67.13,14,Kaylen Manzi,Huffman Hargrave,66.59,122.47,86.18,142.88,351.53,Single-ply,SBD,M
Boys,67.13,15,Cayden Whigham,Huffman Hargrave,66.5,117.93,81.65,140.61,340.19,Single-ply,SBD,M
Boys,67.13,16,Josh Cota,Trinity,62.05,113.4,74.84,142.88,331.12,Single-ply,SBD,M
Boys,74.84,17,Danny Garcia,New Caney,67.31,117.93,72.57,140.61,331.12,Single-ply,SBD,M
Boys,67.13,18,Mattison William,Conroe Caney Creek,64.86,111.13,68.04,136.08,315.25,Single-ply,SBD,M
Boys,67.13,19,Jose Baca,New Caney,62.05,102.06,65.77,127.01,294.84,Single-ply,SBD,M
Boys,67.13,DQ,Kalen Redmon,Beaumont Ozen,66.41,111.13,,,,Single-ply,SBD,M
Boys,67.13,DQ,Herron Gonzalez,Crockett,64.86,,,,,Single-ply,SBD,M
Boys,74.84,1,Grant Fults,Livingston,70.62,204.12,136.08,204.12,544.31,Single-ply,SBD,M
Boys,74.84,2,Eric Pereuss,Montgomery,69.94,181.44,106.59,201.85,489.88,Single-ply,SBD,M
Boys,74.84,3,LaKendrick Moore,Corrigan-Camden,74.66,199.58,106.59,181.44,487.61,Single-ply,SBD,M
Boys,74.84,4,Austin Fry,Huffman Hargrave,74.39,172.37,122.47,188.24,483.08,Single-ply,SBD,M
Boys,74.84,5,Caleb Hall,Montgomery,67.68,185.97,111.13,181.44,478.54,Single-ply,SBD,M
Boys,74.84,6,Asa Spade,Splendora,70.4,192.78,102.06,170.1,464.93,Single-ply,SBD,M
Boys,74.84,7,Dylan Jenkins,Montgomery,71.21,172.37,95.25,195.04,462.66,Single-ply,SBD,M
Boys,74.84,8,Jared Hope,Livingston,70.31,156.49,88.45,192.78,437.72,Single-ply,SBD,M
Boys,82.1,9,Leo Guerro,Trinity,75.02,142.88,113.4,174.63,430.91,Single-ply,SBD,M
Boys,74.84,10,Thomas Casper,Corrigan-Camden,73.94,165.56,79.38,181.44,426.38,Single-ply,SBD,M
Boys,74.84,11,Alex Palacios,Conroe Caney Creek,68.95,151.95,102.06,163.29,417.3,Single-ply,SBD,M
Boys,74.84,12,Levi Hurley,Corrigan-Camden,71.67,165.56,83.91,165.56,415.04,Single-ply,SBD,M
Boys,74.84,13,Michael Morris #2,Splendora,74.66,140.61,92.99,158.76,392.36,Single-ply,SBD,M
Boys,74.84,14,Curtis Luff,Crosby,71.67,142.88,86.18,158.76,387.82,Single-ply,SBD,M
Boys,74.84,15,Austin Tompkins,Conroe Oak Ridge,69.31,142.88,83.91,158.76,385.55,Single-ply,SBD,M
Boys,74.84,16,Victor Rangel,Crockett,68.13,145.15,86.18,147.42,378.75,Single-ply,SBD,M
Boys,74.84,17,Dalton Neisner,Montgomery,70.76,151.95,86.18,136.08,374.21,Single-ply,SBD,M
Boys,74.84,18,Zach Bass,Willis,69.04,145.15,70.31,142.88,358.34,Single-ply,SBD,M
Boys,74.84,19,Clayton Barrentine,Huffman Hargrave,67.68,120.2,72.57,129.27,322.05,Single-ply,SBD,M
Boys,74.84,20,Jacob Bosquez,Pollok Central,74.75,81.65,63.5,136.08,281.23,Single-ply,SBD,M
Boys,74.84,DQ,Chris Reyes,Corrigan-Camden,72.3,102.06,65.77,156.49,,Single-ply,SBD,M
Boys,74.84,DQ,Hugo Sanchez,Corrigan-Camden,72.57,136.08,79.38,154.22,,Single-ply,SBD,M
Boys,74.84,DQ,Alex Cuevas,Corrigan-Camden,74.66,129.27,70.31,129.27,,Single-ply,SBD,M
Boys,74.84,DQ,Larry Lawson,Corrigan-Camden,68.58,136.08,77.11,156.49,,Single-ply,SBD,M
Boys,74.84,DQ,Jimmie Moore,Conroe Oak Ridge,74.39,165.56,,,,Single-ply,SBD,M
Boys,74.84,DQ,Matthew Wagner,Woodville,69.04,,,,,Single-ply,SBD,M
Boys,74.84,DQ,Tyreke Carrol,Trinity,74.84,,,,,Single-ply,SBD,M
Boys,82.1,1,Lance Cole,Crosby,81.65,210.92,140.61,192.78,544.31,Single-ply,SBD,M
Boys,82.1,2,Chris Narcisse,Beaumont Ozen,79.02,206.38,140.61,188.24,535.24,Single-ply,SBD,M
Boys,82.1,3,Chance Free,Livingston,78.74,217.72,92.99,201.85,512.56,Single-ply,SBD,M
Boys,82.1,4,Zack Rankin,Trinity,81.74,179.17,104.33,213.19,496.68,Single-ply,SBD,M
Boys,82.1,5,Jacob Gallatin,Montgomery,75.84,188.24,113.4,190.51,492.15,Single-ply,SBD,M
Boys,82.1,6,Nick Beazley,Montgomery,80.1,181.44,124.74,179.17,485.34,Single-ply,SBD,M
Boys,89.81,7,Kreg Williams,Willis,82.28,183.7,102.06,183.7,469.47,Single-ply,SBD,M
Boys,82.1,8,Sterling Winzor,Beaumont Ozen,78.56,154.22,108.86,192.78,455.86,Single-ply,SBD,M
Boys,82.1,9,Christian Reza,Beaumont Ozen,81.01,165.56,97.52,172.37,435.45,Single-ply,SBD,M
Boys,82.1,10,Jaxen Halbaedier,Willis,81.92,181.44,79.38,170.1,430.91,Single-ply,SBD,M
Boys,82.1,11,Letreveonce Bell,Crockett,81.65,129.27,90.72,181.44,401.43,Single-ply,SBD,M
Boys,82.1,12,Austin Greer,Huffman Hargrave,77.2,138.35,79.38,151.95,369.68,Single-ply,SBD,M
Boys,82.1,13,Jason Navarro,Huffman Hargrave,80.92,129.27,61.23,142.88,333.39,Single-ply,SBD,M
Boys,82.1,14,Grant Mountain,Conroe The Woodlands,76.75,120.2,61.23,145.15,326.59,Single-ply,SBD,M
Boys,82.1,15,Michael Pershall,Willis,81.74,117.93,72.57,136.08,326.59,Single-ply,SBD,M
Boys,82.1,DQ,Garrett King,Trinity,75.84,,61.23,,,Single-ply,SBD,M
Boys,82.1,DQ,Javonte Oliphant,Trinity,77.2,174.63,,183.7,,Single-ply,SBD,M
Boys,82.1,DQ,James Kinnard,Trinity,82.1,,,,,Single-ply,SBD,M
Boys,89.81,1,Logan Phillips,Conroe Caney Creek,88.54,244.94,181.44,249.48,675.85,Single-ply,SBD,M
Boys,89.81,2,Travis Anderson,Crosby,88.63,238.14,165.56,233.6,637.3,Single-ply,SBD,M
Boys,89.81,3,David Caddie,Livingston,84.82,242.67,129.27,263.08,635.03,Single-ply,SBD,M
Boys,99.79,4,Deveon Jefferson,Livingston,89.95,215.46,156.49,215.46,587.4,Single-ply,SBD,M
Boys,89.81,5,Dustin Baranowski,Conroe The Woodlands,88.18,199.58,122.47,217.72,539.77,Single-ply,SBD,M
Boys,89.81,6,Gavin Franklin,Conroe Oak Ridge,89.18,185.97,131.54,190.51,508.02,Single-ply,SBD,M
Boys,89.81,7,Chandler Button,Woodville,83.01,179.17,113.4,192.78,485.34,Single-ply,SBD,M
Boys,89.81,8,Chris Castle,Woodville,83.46,183.7,92.99,204.12,480.81,Single-ply,SBD,M
Boys,89.81,9,Dylan Hasson,Woodville,88.45,174.63,92.99,204.12,471.74,Single-ply,SBD,M
Boys,89.81,10,Charles McMillen,Trinity,89.54,183.7,102.06,183.7,469.47,Single-ply,SBD,M
Boys,89.81,11,Parker Coleman,Conroe The Woodlands,89.09,165.56,113.4,181.44,460.4,Single-ply,SBD,M
Boys,89.81,12,Vicente Lazcano,Corrigan-Camden,85.82,172.37,86.18,183.7,442.25,Single-ply,SBD,M
Boys,89.81,13,Michael Taylor,Splendora,88.9,142.88,111.13,170.1,424.11,Single-ply,SBD,M
Boys,89.81,14,Noah Young #2,Huffman Hargrave,84.46,138.35,102.06,170.1,410.5,Single-ply,SBD,M
Boys,89.81,15,Jake Jones,Willis,84.46,147.42,79.38,158.76,385.55,Single-ply,SBD,M
Boys,89.81,16,Jack Perry,Huffman Hargrave,85.82,124.74,104.33,127.01,356.07,Single-ply,SBD,M
Boys,89.81,17,Bradley Bryan,Pollok Central,88.72,108.86,83.91,151.95,344.73,Single-ply,SBD,M
Boys,89.81,DQ,Jared Hull,New Caney,82.46,199.58,,,,Single-ply,SBD,M
Boys,89.81,DQ,Dylan Bates,Conroe Oak Ridge,82.64,,,,,Single-ply,SBD,M
Boys,99.79,1,Joe Thomas,Beaumont Ozen,95.25,244.94,124.74,249.48,619.15,Single-ply,SBD,M
Boys,99.79,2,Jose Rangel,New Caney,92.62,256.28,140.61,215.46,612.35,Single-ply,SBD,M
Boys,99.79,3,Kyle Haynes,Livingston,97.61,244.94,133.81,226.8,605.55,Single-ply,SBD,M
Boys,99.79,4,Austin McKean,Conroe Caney Creek,92.99,244.94,140.61,215.46,601.01,Single-ply,SBD,M
Boys,99.79,5,Rene Troche-Baez,Conroe The Woodlands,96.71,226.8,120.2,247.21,594.21,Single-ply,SBD,M
Boys,99.79,6,John Carter,Willis,93.44,226.8,138.35,226.8,591.94,Single-ply,SBD,M
Boys,99.79,7,Christopher Hodges,Livingston,92.99,204.12,127.01,215.46,546.58,Single-ply,SBD,M
Boys,99.79,8,Zach Loane,Conroe The Woodlands,96.71,192.78,106.59,240.4,539.77,Single-ply,SBD,M
Boys,99.79,9,Jarvoris Brooks,Corrigan-Camden,94.35,195.04,124.74,213.19,532.97,Single-ply,SBD,M
Boys,99.79,10,Marcus Garza,Conroe Caney Creek,97.79,222.26,106.59,204.12,532.97,Single-ply,SBD,M
Boys,99.79,11,Codell Ferguson,Crockett,90.99,192.78,115.67,181.44,489.88,Single-ply,SBD,M
Boys,99.79,12,Justin Bryan,Huffman Hargrave,97.16,188.24,115.67,183.7,487.61,Single-ply,SBD,M
Boys,99.79,13,Jacob Bryan,Huffman Hargrave,91.63,167.83,111.13,188.24,467.2,Single-ply,SBD,M
Boys,99.79,14,Malcolm Hodges,Montgomery,98.61,197.31,106.59,154.22,458.13,Single-ply,SBD,M
Boys,99.79,15,Clayton Kelleher,Willis,96.16,192.78,95.25,149.69,437.72,Single-ply,SBD,M
Boys,99.79,16,Tyler Whiteside,Woodville,91.72,158.76,86.18,156.49,401.43,Single-ply,SBD,M
Boys,99.79,17,Danny Barboza,Pollok Central,99.7,151.95,77.11,167.83,396.89,Single-ply,SBD,M
Boys,99.79,18,Scott Erkel,Willis,91.35,165.56,70.31,154.22,390.09,Single-ply,SBD,M
Boys,109.77,1,Deandre Washington,Beaumont Ozen,102.69,240.4,158.76,204.12,603.28,Single-ply,SBD,M
Boys,124.74,2,Keyshawn Pettieway,Crosby,109.95,213.19,154.22,213.19,580.6,Single-ply,SBD,M
Boys,109.77,3,Kolin Seward,Livingston,109.32,204.12,120.2,188.24,512.56,Single-ply,SBD,M
Boys,109.77,4,Noah Ramirez,Splendora,106.32,136.08,136.08,185.97,458.13,Single-ply,SBD,M
Boys,109.77,5,Chris Orr,Montgomery,105.23,176.9,97.52,170.1,444.52,Single-ply,SBD,M
Boys,109.77,6,Arthur Harmon,Beaumont Ozen,107.14,170.1,95.25,158.76,424.11,Single-ply,SBD,M
Boys,109.77,7,Cruz Barcenas,Huffman Hargrave,105.41,131.54,88.45,167.83,387.82,Single-ply,SBD,M
Boys,109.77,DQ,Brandon West,Splendora,108.14,151.95,,,,Single-ply,SBD,M
Boys,109.77,DQ,Glen Bonner,Trinity,102.78,170.1,,,,Single-ply,SBD,M
Boys,124.74+,1,Josh Opiela,Crosby,124.92,340.19,188.24,242.67,771.11,Single-ply,SBD,M
Boys,124.74,2,Chase Kellar,Conroe Caney Creek,122.11,254.01,151.95,226.8,632.76,Single-ply,SBD,M
Boys,124.74,3,Dustin Willis,Splendora,118.21,244.94,117.93,208.65,571.53,Single-ply,SBD,M
Boys,124.74,4,Dylan Poindexter,New Caney,116.75,199.58,149.69,192.78,542.04,Single-ply,SBD,M
Boys,124.74,5,Aaron Hopper,Conroe The Woodlands,115.39,192.78,136.08,195.04,523.9,Single-ply,SBD,M
Boys,124.74,6,Cody Potter,Trinity,114.94,181.44,90.72,170.1,442.25,Single-ply,SBD,M
Boys,124.74,7,Deshondric Selman,Beaumont Ozen,114.58,142.88,77.11,136.08,356.07,Single-ply,SBD,M
Boys,124.74,8,Tredell McWhirter,Crockett,114.4,215.46,,,215.46,Single-ply,S,M
Boys,124.74,DQ,Tristan Garza,New Caney,123.01,208.65,102.06,,,Single-ply,SB,M
Boys,124.74+,DQ,Jordan Johnson,Livingston,124.87,204.12,,,,Single-ply,S,M
Boys,124.74+,1,Keenan Murphy,Crosby,133.81,240.4,147.42,249.48,637.3,Single-ply,SBD,M
Boys,124.74+,2,Matthew Gregory,Crosby,134.9,249.48,145.15,229.06,623.69,Single-ply,SBD,M
Boys,124.74+,3,Jimmy White,Willis,134.35,249.48,151.95,215.46,616.89,Single-ply,SBD,M
Boys,124.74+,4,Onterial Carter,Livingston,154.67,229.06,122.47,258.55,610.08,Single-ply,SBD,M
Boys,124.74+,5,Weston Meyer,Willis,126.28,226.8,92.99,188.24,508.02,Single-ply,SBD,M
Boys,124.74+,6,Abrow Moreland,Beaumont Ozen,147.24,195.04,108.86,199.58,503.49,Single-ply,SBD,M
Boys,124.74+,7,Dennis Bardwell,Huffman Hargrave,125.46,174.63,111.13,215.46,501.22,Single-ply,SBD,M
Boys,124.74+,8,Danny Guajardo,Crosby,134.9,181.44,90.72,183.7,455.86,Single-ply,SBD,M
Boys,124.74+,9,Jake Cox,Pollok Central,127.37,154.22,92.99,174.63,421.84,Single-ply,SBD,M
Boys,124.74+,DQ,Trey Dear,Woodville,149.05,,,,,Single-ply,SBD,M
Boys,,NS,Obie Barclay,Woodville,,,,,,Single-ply,SBD,M
Boys,,NS,Allen Williams,Woodville,,,,,,Single-ply,SBD,M
Boys,,NS,Lucas Erickson,Splendora,,,,,,Single-ply,SBD,M
Boys,,NS,Angel Huerta,New Caney,,,,,,Single-ply,SBD,M
Boys,,NS,Josh Saltsman,New Caney,,,,,,Single-ply,SBD,M
Boys,,NS,Dillon Amigliore,New Caney,,,,,,Single-ply,SBD,M
Boys,,NS,Gavin Stowe,Splendora,,,,,,Single-ply,SBD,M
Boys,,NS,Francisco Vargas,Splendora,,,,,,Single-ply,SBD,M
Boys,,NS,Drew White,Montgomery,,,,,,Single-ply,SBD,M
Boys,,NS,Brant Jensen,Montgomery,,,,,,Single-ply,SBD,M
Boys,,NS,Ty Evans #2,Montgomery,,,,,,Single-ply,SBD,M
Boys,,NS,Aaron Cunningham,Huffman Hargrave,,,,,,Single-ply,SBD,M
Boys,,NS,David Holley,Huffman Hargrave,,,,,,Single-ply,SBD,M
Boys,,NS,Brennan McDonald,Huffman Hargrave,,,,,,Single-ply,SBD,M
Boys,,NS,Chase Bridgeman,Crosby,,,,,,Single-ply,SBD,M
Boys,,NS,Connor Orozco,Huffman Hargrave,,,,,,Single-ply,SBD,M
Boys,,NS,Donavin Orozco,Huffman Hargrave,,,,,,Single-ply,SBD,M
Boys,,NS,Andrew Smith #13,Conroe The Woodlands,,,,,,Single-ply,SBD,M
Boys,,NS,Trevion Smith,Beaumont Ozen,,,,,,Single-ply,SBD,M
Boys,,NS,Nathan Withers,Beaumont Ozen,,,,,,Single-ply,SBD,M
Boys,,NS,Tyree Henderson,Beaumont Ozen,,,,,,Single-ply,SBD,M
Boys,,NS,Diante Granger,Beaumont Ozen,,,,,,Single-ply,SBD,M
Boys,,NS,Rodney Winford,Beaumont Ozen,,,,,,Single-ply,SBD,M
Boys,,NS,Grant Stuard,Conroe Oak Ridge,,,,,,Single-ply,SBD,M
Boys,,NS,Miguel Castellanos,Conroe Oak Ridge,,,,,,Single-ply,SBD,M
Boys,,NS,Gavin Webster,Conroe The Woodlands,,,,,,Single-ply,SBD,M
