FULL POWER FEMALE,,,,,,Acutal B/W,Squat LBS,Bench LBS,Deadlift LBS,Total
F,AM,Raw Modern,Junior,114,Skylar Grubb,112.9,181.88,104.72,203.92,490.52
F,Pro,Raw Modern,Open,123,Aleigha Baxter,121.6,198.41,104.72,264.55,567.68
F,Elite,Raw Modern,Open,148,Maria Fautali,140.5,286.6,143.3,374.78,804.68
F,AM,Raw Classic,Open,148,Madie Dagg,143.7,275.57,159.83,330.69,766.09
F,Pro,Raw Modern,Open,148,Sierra Snodgrass,143.4,330.69,176.37,363.76,870.82
F,Pro,Raw Modern,Open,148,Chelsey Ferris,144.3,319.67,159.83,341.71,821.21
F,Pro,Raw Modern,Open,148,Melissa Schroeder,146.4,424.39,220.46,413.36,1058.21
F,Pro,Raw Modern,Open,148,Sam Gimbnez,146.8,314.15,154.32,341.71,810.18
F,Police/Fire AM,Raw Modern,Open,165,Kelsey Garrabant,152.8,214.95,143.3,259.04,617.29
F,Pro,Raw Modern,Junior,165,Mary Fleckenstein,165.3,407.85,225.97,440.92,1074.74
F,Pro,Raw Modern,Open,165,Mary Fleckenstein,165.3,407.85,225.97,440.92,1074.74
F,AM,Raw Modern,Open,198,Gabriella Huthder,192.4,225.97,115.74,314.15,655.86
F,AM,Raw Modern,Open,220,Rachel Benda,209.8,270.06,154.32,374.78,799.16
F,AM,Raw Modern,Submaster,220,Alleigh Daniels,214.5,369.27,192.9,363.76,925.93
F,AM,Raw Modern,Master 50-54,SHW,Rhonda Boer,312.5,253.53,121.25,347.22,722
FULL POWER MALE ,,,,,,Acutal B/W,Squat LBS,Bench LBS,Deadlift LBS,Total
M,AM,Raw Modern,Open,165,Phil Townsend,157.8,424.39,214.95,523.59,1162.93
M,AM,Raw Modern,Open,165,Taran Rodriguez,161.9,418.87,286.6,540.13,1245.6
M,AM,Raw Classic,Submaster,165,Ryan Irwin,159,303.13,248.02,369.27,920.42
M,Pro,Raw Modern,Open,165,Dustin Craigo,161.9,551.15,253.53,578.71,1383.39
M,AM,Raw Classic,Open,181,Brock Bernholtz,178.5,424.39,275.57,485.01,1184.97
M,AM,Raw Modern,Open,181,Kyle Wooden,176.9,451.94,303.13,407.85,1162.92
M,AM,Raw Modern,Open,181,Samuel Dagg,181.8,424.39,292.11,551.15,1267.65
M,AM,Raw Modern,Open,181,John Marron ,177.6,396.83,220.46,435.41,1052.7
M,Pro,Raw Modern,Open,181,Spencer Key,180.1,523.59,336.2,562.17,1421.96
M,Pro,Raw Modern,Open,181,Truman Niles,177.3,374.78,303.13,501.55,1179.46
M,AM,Raw Modern,Junior,198,Elijah Lowden,187.6,358.25,253.53,485.01,1096.79
M,AM,Raw Modern,Open,198,Mitchell Shopinsky,189,429.9,303.13,529.1,1262.13
M,AM,Raw Modern,Open,198,Jeremy Viruet,196.2,451.94,286.6,501.55,1240.09
M,Pro,Raw Modern,Open,198,Chris Soullas,198,545.64,418.87,622.8,1587.31
M,Pro,Raw Modern,Open,198,Jaden Lacaria,198,727.52,402.34,677.92,1807.78
M,Pro,Raw Modern,Open,198,Jamie Lopez,197.1,529.1,358.25,551.15,1438.5
M,AM,Raw Modern,Junior,220,Dakota Stearns,209.3,440.92,275.57,512.57,1229.06
M,AM,Raw Classic,Open,220,John Duarte,218.2,253.53,203.92,369.27,826.72
M,AM,Raw Modern,Open,220,Shane Stephens,214.1,562.17,363.76,501.55,1427.48
M,AM,Raw Modern,Open,220,CJ Jasper,211.9,446.43,253.53,473.99,1173.95
M,AM,Raw Modern,Open,220,Caleb Bauder,209,501.55,319.67,523.59,1344.81
M,AM,Raw Modern,Open,220,Nick Samgregory ,217,429.9,275.57,501.55,1207.02
M,Pro,Raw Modern,Open,220,Aaron Palko,218.9,755.08,496.04,777.12,2028.24
M,Pro,Raw Modern,Open,220,Harrison Stickelman,219,782.64,402.34,760.59,1945.57
M,AM,Raw Modern,Submaster,220,Joseph Walton,214.8,435.41,314.15,507.06,1256.62
M,AM,Raw Modern,Master 40-44,220,Fred Cook,204.6,479.5,270.06,501.55,1251.11
M,Military AM,Raw Modern,Open,220,Derek Zgraggen,217,479.5,347.22,501.55,1328.27
M,AAI,Raw Modern,Junior,242,John Milton,231.1,473.99,347.22,490.52,1311.73
M,AM,Raw Modern,Youth,242,Gaven Frey,235.9,374.78,209.43,418.87,1003.08
M,AM,Raw Modern,Open,242,Derrick Jenkins,233.4,529.1,308.64,501.55,1339.29
M,AM,Raw Modern,Open,242,Bryan Small,229.7,462.97,330.69,562.17,1355.83
M,Pro,Raw Modern,Open,242,Ted Damiano,239.4,545.64,424.39,606.27,1576.3
M,Pro ,Raw Modern,Open,242,Curtis Miller,241.2,727.52,440.92,777.12,1945.56
M,Pro,Raw Modern,Open,242,John Wisniokswi,229.9,705.47,363.76,677.92,1747.15
M,Pro ,Raw Modern,Open,242,Cody Nyegaard,236.1,677.92,391.32,639.34,1708.58
M,Pro,Raw Modern,Open,242,Jake Zainea,241.6,749.57,468.48,672.41,1890.46
M,Pro,Raw Modern,Submaster,242,Eric Hayes,237.2,507.06,385.8,562.17,1455.03
M,AM,Raw Modern,Open,275,Joey Siefert,262.2,573.2,369.27,573.2,1515.67
M,Pro,Raw Modern,Open,275,TJ Bryant,263.6,710.99,319.67,661.38,1692.04
M,Pro,Raw Modern,Open,275,Tyler Parden,271.8,523.59,407.85,523.59,1455.03
M,Pro,Raw Modern,Open,275,John Santoro,271.5,578.71,363.76,606.27,1548.74
M,Pro,Raw Modern,Submaster,275,Matt Trammel,254.2,738.54,429.9,694.45,1862.89
M,Military AM,Raw Modern,Open,275,Terry Wagner,246.8,440.92,264.55,402.34,1107.81
M,Am,Raw Modern,Master 45-49,275,Terry Wagner,246.8,440.92,264.55,402.34,1107.81
M,Pro,Raw Modern,Masters 40-44,275,Mario Jellencich,271.7,534.62,347.22,473.99,1355.83
M,Pro,Raw Modern,Open,308,Tom Davis,279.8,688.94,540.13,804.68,2033.75
M,Pro,Raw Modern,Open,308,Jabez Burford,287,881.84,424.39,744.06,2050.29
M,Pro,Raw Modern,Junior,SHW,Grant Spring,349.4,639.34,330.69,529.1,1499.13
M,Pro,Raw Modern,Open,SHW,Ryan Belcher,341.2,909.4,507.06,832.24,2248.7
M,Elite,Raw Modern,Open,SHW,Kevin Mchugh,382.1,909.4,462.97,733.03,2105.4
M,Elite,Raw Modern,Open,SHW,Patrick Hall,379.9,914.91,479.5,705.47,2099.88
BENCH ONLY,,,,,,Acutal B/W,Squat LBS,Bench LBS,Deadlift LBS,Total
F,AM,Raw Classic,Open,165,Mandi Curry,163.2, ,181.88, ,181.88
M,Pro,Raw Classic,Open,275,Mark Chieco,264.8, ,523.59, ,523.59
PUSH/PULL,,,,,,Acutal B/W,Squat LBS,Bench LBS,Deadlift LBS,Total
F,AM,Raw Classic,Open,148,Ashley Smith,146.4, ,143.3,347.22,490.52
M,AM,Raw Classic,Submaster,220,Aaron Rios ,215.8, ,308.64,314.15,622.79
