Place,Name,State,WeightClassKg,BodyweightKg,Age,Best3SquatKg,Best3BenchKg,Best3DeadliftKg,TotalKg,Sex,Division,Equipment,Deadlift4Kg,Bench4Kg,Event
1,Tiffani Tom,CA,52,51.65,23,127.50,47.50,135.00,310.00,F,Juniors 20-23,Raw,,,SBD
2,Carolyn Chen,CA,52,50.75,22,85.00,52.50,107.50,245.00,F,Juniors 20-23,Raw,,,SBD
1,Kara Morison,CA,56,55.20,23,75.00,45.00,92.50,212.50,F,Juniors 20-23,Raw,,,SBD
1,Sharon Luan,CA,60,59.25,19,107.50,50.00,162.50,320.00,F,Juniors 18-19,Raw,,,SBD
1,Aubrey Yip,CA,60,60.00,22,115.00,62.50,120.00,297.50,F,Juniors 20-23,Raw,,,SBD
1,Irina Vitman,CA,75,73.05,22,112.50,77.50,157.50,347.50,F,Juniors 20-23,Raw,,,SBD
2,Danielle Ramos,CA,75,73.75,22,107.50,62.50,155.00,325.00,F,Juniors 20-23,Raw,,,SBD
1,Meghan Barry,CA,82.5,82.20,21,140.00,80.50,167.50,388.00,F,Juniors 20-23,Raw,,,SBD
1,Sabrina Cuevas,CA,52,51.35,37,100.00,60.00,120.00,280.00,F,Open,Raw,,,SBD
2,Marissa Mossberg,CA,52,50.95,32,75.00,45.00,125.00,245.00,F,Open,Raw,,,SBD
3,Kaylin Stall,CA,52,49.25,28,75.00,37.50,110.00,222.50,F,Open,Raw,,,SBD
1,Rachel Bitz,CA,56,54.95,24,90.00,60.00,97.50,247.50,F,Open,Raw,,,SBD
2,Linda Calderon,CA,56,55.10,24,87.50,40.00,102.50,230.00,F,Open,Raw,,,SBD
3,Minh Nguyen #2,CA,56,55.00,33,72.50,37.50,102.50,212.50,F,Open,Raw,,,SBD
4,Megan Klabunde,CA,56,55.05,34,25.00,40.00,117.50,182.50,F,Open,Raw,,,SBD
1,Ashley Beal,CA,60,60.00,26,102.50,62.50,142.50,307.50,F,Open,Raw,,,SBD
2,Winnie Banh,CA,60,58.65,24,92.50,52.50,97.50,242.50,F,Open,Raw,,,SBD
1,Nita Horton,CA,67.5,67.15,31,92.50,62.50,132.50,287.50,F,Open,Raw,,,SBD
1,Terrian Ashley,CA,75,73.65,33,160.00,75.00,182.50,417.50,F,Open,Raw,,,SBD
2,Brittainy Chown,CA,75,75.00,25,142.50,67.50,167.50,377.50,F,Open,Raw,,,SBD
3,Irina Vitman,CA,75,73.05,22,112.50,77.50,157.50,347.50,F,Open,Raw,,,SBD
4,Shannon Siddiqi,CA,75,72.10,27,117.50,60.00,152.50,330.00,F,Open,Raw,,,SBD
5,Michelle Dubose,CA,75,73.70,24,112.50,62.50,150.00,325.00,F,Open,Raw,,,SBD
6,Danielle Ramos,CA,75,73.75,22,107.50,62.50,155.00,325.00,F,Open,Raw,,,SBD
7,Dunia Monroy,CA,75,74.90,24,107.50,45.00,127.50,280.00,F,Open,Raw,,,SBD
1,Tenaya Tuteur,CA,82.5,82.50,26,150.00,75.00,167.50,392.50,F,Open,Raw,,,SBD
2,Kira Clark,CA,82.5,80.00,30,110.00,70.00,147.50,327.50,F,Open,Raw,,,SBD
3,Alexandra Edlin,CA,82.5,79.10,28,90.00,60.00,140.00,290.00,F,Open,Raw,,,SBD
1,Helen Dahlberg,CA,90+,94.90,32,102.50,57.50,115.00,275.00,F,Open,Raw,,,SBD
1,Sabrina Cuevas,CA,52,51.35,37,100.00,60.00,120.00,280.00,F,Submasters 35-39,Raw,,,SBD
1,Yvonne Piper,CA,75,73.15,37,100.00,50.00,125.00,275.00,F,Submasters 35-39,Raw,,,SBD
1,Aida Escriva,CA,82.5,79.75,37,105.00,60.00,120.00,285.00,F,Submasters 35-39,Raw,,,SBD
1,Caroline Cuevas,CA,90,89.00,38,125.00,65.00,162.50,352.50,F,Submasters 35-39,Raw,,,SBD
1,Kim Roland,CA,67.5,65.75,43,102.50,62.50,142.50,307.50,F,Masters 40-44,Raw,,,SBD
1,Cindi Jack,CA,75,72.80,52,87.50,67.50,120.00,275.00,F,Masters 50-54,Raw,,,SBD
1,Vicki Crowell,CA,82.5,80.70,46,112.50,60.00,120.00,292.50,F,Masters 45-49,Raw,,,SBD
1,Dereck Saephan,CA,67.5,62.95,17,117.50,72.50,160.00,350.00,M,Juniors 16-17,Raw,,,SBD
1,Gregory Wheeler,CA,75,74.55,19,150.00,97.50,167.50,415.00,M,Juniors 18-19,Raw,,,SBD
1,Calvin Saephan,CA,75,71.55,20,185.00,97.50,205.00,487.50,M,Juniors 20-23,Raw,,,SBD
2,Andy Tran #2,CA,75,74.60,20,157.50,95.00,212.50,465.00,M,Juniors 20-23,Raw,,,SBD
1,Chelsen Jackson-Kincade,CA,82.5,80.70,22,197.50,150.00,272.50,620.00,M,Juniors 20-23,Raw,,,SBD
2,Kenny Pham,CA,82.5,80.55,21,162.50,115.00,200.00,477.50,M,Juniors 20-23,Raw,,,SBD
1,Cristian Arana,CA,90,86.00,17,192.50,97.50,200.00,490.00,M,Juniors 16-17,Raw,,,SBD
2,Omar Popal,CA,90,85.90,17,137.50,102.50,155.00,395.00,M,Juniors 16-17,Raw,,,SBD
1,Quinton Beffa,CA,90,89.70,18,210.00,132.50,217.50,560.00,M,Juniors 18-19,Raw,,,SBD
2,Charlie Doria,CA,90,87.10,19,187.50,115.00,205.00,507.50,M,Juniors 18-19,Raw,,,SBD
1,Joshua Turner,CA,100,97.00,17,205.00,147.50,250.00,602.50,M,Juniors 16-17,Raw,257.5,,SBD
2,Albert Miraflores,CA,100,95.80,17,182.50,125.00,230.00,537.50,M,Juniors 16-17,Raw,,,SBD
1,Brandon Jolley,CA,100,93.40,23,180.00,147.50,230.00,557.50,M,Juniors 20-23,Raw,,,SBD
1,Adam Weiss,CA,110,107.95,19,207.50,147.50,250.00,605.00,M,Juniors 18-19,Raw,,,SBD
1,Brian Kemp,CA,110,107.10,22,185.00,117.50,200.00,502.50,M,Juniors 20-23,Raw,,,SBD
1,Pang Xiong,CA,140,134.50,22,212.50,130.00,220.00,562.50,M,Juniors 20-23,Raw,,,SBD
1,Joshua Moore,CA,75,74.50,24,215.00,160.00,247.50,622.50,M,Open,Raw,,,SBD
2,Joe Seiden,CA,75,74.60,24,192.50,165.00,245.00,602.50,M,Open,Raw,,,SBD
3,Shamal Asnani,CA,75,73.10,24,177.50,107.50,242.50,527.50,M,Open,Raw,,,SBD
4,Jaya Peou,CA,75,74.90,30,170.00,117.50,215.00,502.50,M,Open,Raw,,,SBD
5,Calvin Ma,CA,75,74.75,25,160.00,97.50,215.00,472.50,M,Open,Raw,,,SBD
1,Emmanuel Adeagbo,CA,82.5,82.50,29,262.50,157.50,297.50,717.50,M,Open,Raw,,,SBD
2,Chelsen Kincade-Jackson,CA,82.5,80.70,22,197.50,150.00,272.50,620.00,M,Open,Raw,,,SBD
3,Brent Hronik,CA,82.5,81.15,25,182.50,125.00,207.50,515.00,M,Open,Raw,,,SBD
4,Ian Gilbert,CA,82.5,82.20,24,172.50,125.00,192.50,490.00,M,Open,Raw,,,SBD
5,Ryan Crum,CA,82.5,80.60,34,132.50,120.00,185.00,437.50,M,Open,Raw,,,SBD
6,David Prejban,CA,82.5,77.60,26,127.50,75.00,142.50,345.00,M,Open,Raw,,,SBD
DQ,Bryan Wong #2,CA,82.5,79.40,25,180.00,-130.00,237.50,,M,Open,Raw,,,SBD
1,Dylan Eacret,CA,90,85.50,30,195.00,165.00,235.00,595.00,M,Open,Raw,,,SBD
2,Cameron Lew,CA,90,89.90,24,190.00,120.00,205.00,515.00,M,Open,Raw,,,SBD
3,Viengkham Amphonephong,CA,90,87.90,31,140.00,112.50,185.00,437.50,M,Open,Raw,,,SBD
1,Davis Munoz,CA,100,98.60,29,212.50,147.50,260.00,620.00,M,Open,Raw,,,SBD
2,Daniel Faddis,CA,100,97.20,27,175.00,147.50,252.50,575.00,M,Open,Raw,,,SBD
3,Joseph Shepard,CA,100,98.30,21,190.00,157.50,220.00,567.50,M,Open,Raw,,,SBD
4,Timothy Lee,CA,100,98.90,24,212.50,115.00,207.50,535.00,M,Open,Raw,,,SBD
5,Brad Cooper,CA,100,98.25,24,177.50,115.00,227.50,520.00,M,Open,Raw,,,SBD
1,Kevin Pulsipher,CA,110,106.50,24,285.00,215.00,295.00,795.00,M,Open,Raw,,,SBD
2,Christian Lee,NV,110,109.80,33,240.00,177.50,265.00,682.50,M,Open,Raw,,,SBD
3,Martin Olivera,CA,110,108.90,26,205.00,167.50,247.50,620.00,M,Open,Raw,,,SBD
4,Tyler Wright,CA,110,107.90,33,200.00,122.50,275.00,597.50,M,Open,Raw,,,SBD
5,Augustus Nordstrom,CA,110,101.80,27,220.00,142.50,232.50,595.00,M,Open,Raw,,,SBD
6,Robin Dore-Andrews,CA,110,103.00,24,225.00,125.00,237.50,587.50,M,Open,Raw,,,SBD
7,Gabriel Aberon,CA,110,107.20,24,205.00,120.00,260.00,585.00,M,Open,Raw,,,SBD
8,Ryan Siebert,CA,110,104.40,30,175.00,92.50,227.50,495.00,M,Open,Raw,,,SBD
1,Ricardo Cook,CA,125,124.00,28,235.00,175.00,247.50,657.50,M,Open,Raw,,,SBD
1,Joseph Rodrigues,CA,82.5,78.55,36,182.50,147.50,202.50,532.50,M,Submasters 35-39,Raw,,,SBD
2,Shoua Lo,CA,82.5,81.45,35,170.00,120.00,220.00,510.00,M,Submasters 35-39,Raw,,,SBD
1,Antonio Machuca,CA,100,96.80,35,235.00,170.00,310.00,715.00,M,Submasters 35-39,Raw,,,SBD
2,Ed Bauer,CA,100,97.20,36,190.00,140.00,227.50,557.50,M,Submasters 35-39,Raw,,,SBD
1,Jessie Ablang,CA,125,124.70,36,327.50,210.00,327.50,865.00,M,Submasters 35-39,Raw,,,SBD
1,Vijay Ambavanekar,CA,67.5,67.40,44,120.00,87.50,145.00,352.50,M,Masters 40-44,Raw,,,SBD
1,Leo Hoffman,CA,90,86.00,42,152.50,120.00,172.50,445.00,M,Masters 40-44,Raw,,,SBD
DQ,John Roy,CA,100,94.40,51,-130.00,,,,M,Masters 50-54,Raw,,,SBD
1,Doug Loud,CA,125,117.15,41,205.00,132.50,202.50,540.00,M,Masters 40-44,Raw,,,SBD
1,Danielle McGraw,CA,82.5,77.50,31,120.00,60.00,137.50,317.50,F,Open,Wraps,,,SBD
1,Jalen Bourbon,CA,90,83.90,22,162.50,112.50,195.00,470.00,M,Juniors 20-23,Wraps,,,SBD
1,Eddie Sarabia,CA,100,98.20,23,160.00,107.50,262.50,530.00,M,Juniors 20-23,Wraps,,,SBD
1,Anthony Castelli,CA,90,89.50,24,180.00,135.00,227.50,542.50,M,Open,Wraps,,,SBD
2,Ryan Mondragon,CA,90,88.90,33,160.00,115.00,170.00,445.00,M,Open,Wraps,,,SBD
1,Justin McGarvey,CA,100,96.90,26,285.00,165.00,320.00,770.00,M,Open,Wraps,,,SBD
1,Wade Zeno,CA,110,109.10,28,287.50,192.50,307.50,787.50,M,Open,Wraps,,,SBD
1,James Mulhearn,CA,90,85.00,35,170.00,120.00,217.50,507.50,M,Submasters 35-39,Wraps,,,SBD
1,Daniel Kilmer,CA,100,99.60,39,185.00,125.00,200.00,510.00,M,Submasters 35-39,Wraps,,,SBD
1,Kevin Canant,CA,100,96.30,43,217.50,190.00,260.00,667.50,M,Masters 40-44,Wraps,,192.5,SBD
1,Shawn Buckley,CA,100,99.90,33,367.50,237.50,328.00,933.00,M,Open,Single-ply,,,SBD
1,Ryan Reynolds,CA,125,118.80,17,,153.50,,153.50,M,Juniors 16-17,Raw,,,B
1,Dominick Lucia,CA,140,133.70,17,,125.00,,125.00,M,Juniors 16-17,Raw,,,B
1,Brian Oliver,CA,140,132.20,22,,125.00,,125.00,M,Juniors 20-23,Raw,,,B
1,Martin Azzam,CA,110,106.80,26,,197.50,,197.50,M,Open,Raw,,,B
2,Robert Tufuga,CA,110,102.25,33,,142.50,,142.50,M,Open,Raw,,,B
1,Ricardo Cook,CA,125,124.00,28,,175.00,,175.00,M,Open,Raw,,,B
1,Blake Starkweather,CA,140,136.90,39,,192.50,,192.50,M,Submasters 35-39,Raw,,,B
1,Dominique Ocampo,CA,56,55.90,22,,,115.00,115.00,F,Juniors 20-23,Raw,,,D
1,Ethan McNeelan,CA,100,97.30,18,,,195.00,195.00,M,Juniors 18-19,Raw,,,D
1,Dominick Lucia,CA,140,133.70,17,,,230.00,230.00,M,Juniors 16-17,Raw,,,D
1,Brian Oliver,CA,140,132.20,22,,,185.00,185.00,M,Juniors 20-23,Raw,,,D
1,Martin Azzam,CA,110,106.80,26,,,257.50,257.50,M,Open,Raw,,,D
1,Bob Taulbee,CA,100,95.50,62,,,147.50,147.50,M,Masters 60-64,Raw,,,D
