<?xml version="1.0" encoding="iso-8859-1"?>
<!-- Generator: Adobe Illustrator 16.0.0, SVG Export Plug-In . SVG Version: 6.00 Build 0) -->
<!DOCTYPE svg PUBLIC "-//W3C//DTD SVG 1.1//EN" "http://www.w3.org/Graphics/SVG/1.1/DTD/svg11.dtd">
<svg
	version="1.1"
	id="Capa_1"
	xmlns="http://www.w3.org/2000/svg"
	xmlns:xlink="http://www.w3.org/1999/xlink"
	x="0px"
	y="0px"
	width="401.998px"
	height="401.998px"
	viewBox="0 0 401.998 401.998"
	style="enable-background:new 0 0 401.998 401.998;"
	xml:space="preserve">
	<g>
		<g>


<path
	d="M73.092,164.452h255.813c4.949,0,9.233-1.807,12.848-5.424c3.613-3.616,5.427-7.898,5.427-12.847
c0-4.949-1.813-9.229-5.427-12.85L213.846,5.424C210.232,1.812,205.951,0,200.999,0s-9.233,1.812-12.85,5.424L60.242,133.331
c-3.617,3.617-5.424,7.901-5.424,12.85c0,4.948,1.807,9.231,5.424,12.847C63.863,162.645,68.144,164.452,73.092,164.452z"/>
	</g>
</g>
</svg>
