<?xml version="1.0" encoding="utf-8"?>
<!-- Generator: Adobe Illustrator 25.0.1, SVG Export Plug-In . SVG Version: 6.00 Build 0)  -->
<svg version="1.1" id="ëÎÓÈ_1" xmlns="http://www.w3.org/2000/svg" xmlns:xlink="http://www.w3.org/1999/xlink" x="0px" y="0px"
	 viewBox="0 0 1000 1000" style="enable-background:new 0 0 1000 1000;" xml:space="preserve">
<style type="text/css">
	.st0{opacity:0.9;fill:#EC6611;stroke:#231F20;stroke-width:0.25;stroke-miterlimit:10;}
	.st1{fill:#EC6611;stroke:#231F20;stroke-width:0.25;stroke-miterlimit:10;}
	.st2{fill:#DAD9D4;stroke:#231F20;stroke-width:0.25;stroke-miterlimit:10;}
	.st3{opacity:0.9;fill:#F0E1CC;stroke:#231F20;stroke-width:0.25;stroke-miterlimit:10;}
	.st4{fill:#F0E1CC;stroke:#231F20;stroke-width:0.25;stroke-miterlimit:10;}
	.st5{fill:#EEE2D6;stroke:#231F20;stroke-width:0.25;stroke-miterlimit:10;}
	.st6{fill:#DEDCD3;stroke:#231F20;stroke-width:0.25;stroke-miterlimit:10;}
	.st7{fill:#FFF9EC;stroke:#231F20;stroke-width:0.25;stroke-miterlimit:10;}
	.st8{fill:#F0EDDF;stroke:#231F20;stroke-width:0.25;stroke-miterlimit:10;}
	.st9{fill:#EEE2D4;stroke:#231F20;stroke-width:0.25;stroke-miterlimit:10;}
	.st10{fill:#E6DFD5;stroke:#231F20;stroke-width:0.25;stroke-miterlimit:10;}
	.st11{fill:#EEE4DA;stroke:#231F20;stroke-width:0.25;stroke-miterlimit:10;}
	.st12{opacity:0.9;fill:#E0DFDA;stroke:#231F20;stroke-width:0.25;stroke-miterlimit:10;}
	.st13{fill:#E0DFDA;stroke:#231F20;stroke-width:0.25;stroke-miterlimit:10;}
	.st14{opacity:0.82;fill:#3F3631;stroke:#231F20;stroke-miterlimit:10;}
	.st15{fill:#231F20;stroke:#231F20;stroke-miterlimit:10;}
	.st16{fill:#FFFFFF;stroke:#231F20;stroke-width:0.25;stroke-miterlimit:10;}
	.st17{stroke:#231F20;stroke-width:0.25;stroke-miterlimit:10;}
	.st18{opacity:0.82;fill:#3F3631;stroke:#231F20;stroke-width:0.25;stroke-miterlimit:10;}
	.st19{fill:#231F20;stroke:#231F20;stroke-width:0.25;stroke-miterlimit:10;}
	.st20{opacity:0.88;fill:#EC6611;stroke:#070707;stroke-width:0.25;stroke-miterlimit:10;}
	.st21{opacity:0.95;fill:#EC6611;stroke:#070707;stroke-width:0.25;stroke-miterlimit:10;}
	.st22{fill:#EC6611;stroke:#070707;stroke-width:0.25;stroke-miterlimit:10;}
	.st23{fill:#070707;stroke:#070707;stroke-width:0.25;stroke-miterlimit:10;}
</style>
<g>
	<polygon class="st0" points="403.27,387.5 354.41,465.31 299.68,402.03 302.43,357.01 	"/>
	<polygon class="st1" points="403.27,387.5 302.43,357.01 305.77,302.18 399.87,384.52 	"/>
	<polygon class="st1" points="522.34,545 497.03,612.51 476.55,539.77 	"/>
	<polygon class="st1" points="423.19,461.09 383.08,525.78 361.08,511.25 354.41,465.31 403.27,387.5 408.23,405.79 	"/>
	<polygon class="st2" points="354.41,465.31 280.93,489.92 228.19,415.62 299.68,402.03 	"/>
	<polygon class="st3" points="467.26,379.99 467.26,453.12 408.23,405.79 403.27,387.5 	"/>
	<polygon class="st4" points="531.25,387.5 526.32,405.71 467.26,453.12 467.26,379.99 	"/>
	<polygon class="st4" points="526.32,405.71 511.33,461.09 467.26,506.79 467.26,453.12 	"/>
	<polygon class="st5" points="284.93,353.57 228.19,328.9 210.07,218.15 263.58,283.43 	"/>
	<polygon class="st6" points="299.68,402.03 228.19,415.62 228.19,328.9 284.93,353.57 	"/>
	<polygon class="st0" points="263.58,283.43 210.07,218.15 209.21,212.88 209.21,176.55 	"/>
	<polygon class="st1" points="305.77,302.18 302.43,357.01 299.68,402.03 284.93,353.57 263.58,283.43 209.21,176.55 235.46,193.43 
			"/>
	<polygon class="st0" points="551.44,525.78 522.34,545 476.55,539.77 467.26,506.8 467.26,506.79 511.33,461.09 	"/>
	<polygon class="st1" points="580.12,465.31 573.43,511.25 551.44,525.78 511.33,461.09 526.32,405.71 531.25,387.5 	"/>
	<polygon class="st1" points="457.97,539.77 437.49,612.51 412.18,545 	"/>
	<polygon class="st1" points="437.49,612.51 419.14,592.64 397.65,569.38 412.18,545 	"/>
	<polygon class="st3" points="467.26,453.12 467.26,506.79 423.19,461.09 408.23,405.79 	"/>
	<polygon class="st1" points="632.09,357.01 531.25,387.5 534.65,384.52 628.75,302.18 	"/>
	<polygon class="st0" points="634.84,402.03 580.12,465.31 531.25,387.5 632.09,357.01 	"/>
	<polygon class="st1" points="725.31,176.55 670.94,283.43 649.59,353.57 634.84,402.03 632.09,357.01 628.75,302.18 699.06,193.43 
			"/>
	<polygon class="st1" points="536.87,569.38 515.38,592.64 497.03,612.51 522.34,545 	"/>
	<polygon class="st7" points="437.49,612.51 384.7,633.5 374.09,598.91 395.3,610.16 408.28,610.87 	"/>
	<polygon class="st7" points="560.43,598.91 549.82,633.5 497.03,612.51 526.24,610.87 539.22,610.16 	"/>
	<polygon class="st8" points="447.22,695.59 444.06,707.54 429.06,721.25 408.9,678.13 423.44,662.64 	"/>
	<polygon class="st9" points="653.59,489.92 638.13,532.81 573.43,511.25 580.12,465.31 	"/>
	<polygon class="st0" points="638.13,532.81 571.09,569.38 536.87,569.38 522.34,545 551.44,525.78 573.43,511.25 	"/>
	<polygon class="st2" points="706.33,415.62 653.59,489.92 580.12,465.31 634.84,402.03 	"/>
	<polygon class="st10" points="638.13,532.81 638.13,597.5 600.12,581.56 571.09,569.38 	"/>
	<polygon class="st9" points="361.08,511.25 296.4,532.81 280.93,489.92 354.41,465.31 	"/>
	<polygon class="st6" points="706.33,328.9 706.33,415.62 634.84,402.03 649.59,353.57 	"/>
	<polygon class="st0" points="725.31,176.55 725.31,212.88 724.45,218.15 670.94,283.43 	"/>
	<polygon class="st5" points="724.45,218.15 706.33,328.9 649.59,353.57 670.94,283.43 	"/>
	<polygon class="st8" points="638.13,597.5 580.12,653.75 600.12,581.56 	"/>
	<polygon class="st11" points="600.12,581.56 580.12,653.75 549.82,633.5 560.43,598.91 562.55,593.03 571.09,569.38 	"/>
	<polygon class="st12" points="467.26,725.12 467.26,739.07 429.06,721.25 444.06,707.54 455.66,719.85 	"/>
	<polygon class="st13" points="505.46,721.25 467.26,739.07 467.26,725.12 478.86,719.85 490.46,707.54 	"/>
	<polygon class="st10" points="363.43,569.38 334.4,581.56 296.4,597.5 296.4,532.81 	"/>
	<polygon class="st0" points="412.18,545 397.65,569.38 363.43,569.38 296.4,532.81 361.08,511.25 383.08,525.78 	"/>
	<polygon class="st8" points="354.41,653.75 296.4,597.5 334.4,581.56 	"/>
	<polygon class="st11" points="384.7,633.5 354.41,653.75 334.4,581.56 363.43,569.38 371.97,593.03 374.09,598.91 	"/>
	<polygon class="st8" points="525.62,678.13 505.46,721.25 490.46,707.54 487.3,695.59 511.08,662.64 	"/>
	<polygon class="st3" points="467.26,621.41 467.26,688.56 447.22,695.59 423.44,662.64 437.49,647.66 	"/>
	<polygon class="st4" points="511.08,662.64 487.3,695.59 467.26,688.56 467.26,621.41 497.03,647.66 	"/>
	<path class="st14" d="M562.55,593.03c0.07-0.69,0.1-1.39,0.1-2.1c0-9.57-5.7-17.83-13.9-21.55h22.34L562.55,593.03z"/>
	<path class="st14" d="M526.24,610.87l-29.21,1.64l18.35-19.87C515.92,600.31,520.11,606.98,526.24,610.87z"/>
	<path class="st15" d="M548.75,569.38h-11.88l-21.49,23.26c0.54,7.67,4.73,14.34,10.86,18.23l12.98-0.71l21.21-11.25l2.12-5.88
		c0.07-0.69,0.1-1.39,0.1-2.1C562.65,581.36,556.95,573.1,548.75,569.38z M528.96,593.99c-2.13,0-3.87-1.73-3.87-3.86
		c0-2.14,1.74-3.87,3.87-3.87c2.14,0,3.87,1.73,3.87,3.87C532.83,592.26,531.1,593.99,528.96,593.99z"/>
	<path class="st16" d="M532.83,590.13c0,2.13-1.73,3.86-3.87,3.86c-2.13,0-3.87-1.73-3.87-3.86c0-2.14,1.74-3.87,3.87-3.87
		C531.1,586.26,532.83,587.99,532.83,590.13z"/>
	<polygon class="st17" points="478.86,712.95 473.31,716.95 475.53,706.84 	"/>
	<path class="st18" d="M371.87,590.93c0,0.71,0.03,1.41,0.1,2.1l-8.54-23.65h22.34C377.57,573.1,371.87,581.36,371.87,590.93z"/>
	<path class="st18" d="M437.49,612.51l-29.21-1.64c6.13-3.89,10.32-10.56,10.86-18.23L437.49,612.51z"/>
	<path class="st19" d="M397.65,569.38h-11.88c-8.2,3.72-13.9,11.98-13.9,21.55c0,0.71,0.03,1.41,0.1,2.1l2.12,5.88l21.21,11.25
		l12.98,0.71c6.13-3.89,10.32-10.56,10.86-18.23L397.65,569.38z M383.58,587.66c-2.13,0-3.87-1.73-3.87-3.87
		c0-2.14,1.74-3.87,3.87-3.87c2.14,0,3.87,1.73,3.87,3.87C387.45,585.93,385.72,587.66,383.58,587.66z"/>
	<path class="st16" d="M387.45,583.79c0,2.14-1.73,3.87-3.87,3.87c-2.13,0-3.87-1.73-3.87-3.87c0-2.14,1.74-3.87,3.87-3.87
		C385.72,579.92,387.45,581.65,387.45,583.79z"/>
	<polygon class="st17" points="461.21,716.95 455.66,712.95 458.99,706.84 	"/>
	<polygon class="st0" points="467.26,506.79 467.26,506.8 457.97,539.77 412.18,545 383.08,525.78 423.19,461.09 	"/>
	<polygon class="st20" points="497.03,612.51 497.03,647.66 467.26,621.41 467.26,506.8 476.55,539.77 	"/>
	<polygon class="st21" points="549.82,633.5 497.03,647.66 497.03,612.51 	"/>
	<polygon class="st22" points="580.12,653.75 525.62,678.13 511.08,662.64 497.03,647.66 549.82,633.5 	"/>
	<polygon class="st20" points="467.26,506.8 467.26,621.41 437.49,647.66 437.49,612.51 457.97,539.77 	"/>
	<polygon class="st21" points="437.49,612.51 437.49,647.66 384.7,633.5 	"/>
	<polygon class="st22" points="437.49,647.66 423.44,662.64 408.9,678.13 354.41,653.75 384.7,633.5 	"/>
	<path class="st23" d="M487.3,695.59l-20.04-7.03l-20.04,7.03l-3.16,11.95l11.6,12.31l11.6,5.27l11.6-5.27l11.6-12.31L487.3,695.59z
		 M455.66,712.95l3.33-6.11l2.22,10.11L455.66,712.95z M473.31,716.95l2.22-10.11l3.33,6.11L473.31,716.95z"/>
</g>
</svg>
