%YAML 1.1
%TAG !u! tag:unity3d.com,2011:
--- !u!1001 &1678407452750589496
PrefabInstance:
  m_ObjectHideFlags: 0
  serializedVersion: 2
  m_Modification:
    m_TransformParent: {fileID: 0}
    m_Modifications:
    - target: {fileID: -3312356534842186942, guid: 11d4e2c16bbf5bb4ba758189ecb7ef50, type: 3}
      propertyPath: m_SpriteTilingProperty.oldSize.x
      value: 1.72
      objectReference: {fileID: 0}
    - target: {fileID: -3312356534842186942, guid: 11d4e2c16bbf5bb4ba758189ecb7ef50, type: 3}
      propertyPath: m_SpriteTilingProperty.oldSize.y
      value: 1.39
      objectReference: {fileID: 0}
    - target: {fileID: 2172940060945303686, guid: 11d4e2c16bbf5bb4ba758189ecb7ef50, type: 3}
      propertyPath: m_Name
      value: Pelota_Derecha
      objectReference: {fileID: 0}
    - target: {fileID: 2172940060945303690, guid: 11d4e2c16bbf5bb4ba758189ecb7ef50, type: 3}
      propertyPath: m_RootOrder
      value: 0
      objectReference: {fileID: 0}
    - target: {fileID: 2172940060945303690, guid: 11d4e2c16bbf5bb4ba758189ecb7ef50, type: 3}
      propertyPath: m_LocalPosition.x
      value: -89.4908
      objectReference: {fileID: 0}
    - target: {fileID: 2172940060945303690, guid: 11d4e2c16bbf5bb4ba758189ecb7ef50, type: 3}
      propertyPath: m_LocalPosition.y
      value: -13.2213
      objectReference: {fileID: 0}
    - target: {fileID: 2172940060945303690, guid: 11d4e2c16bbf5bb4ba758189ecb7ef50, type: 3}
      propertyPath: m_LocalPosition.z
      value: 0
      objectReference: {fileID: 0}
    - target: {fileID: 2172940060945303690, guid: 11d4e2c16bbf5bb4ba758189ecb7ef50, type: 3}
      propertyPath: m_LocalRotation.w
      value: 1
      objectReference: {fileID: 0}
    - target: {fileID: 2172940060945303690, guid: 11d4e2c16bbf5bb4ba758189ecb7ef50, type: 3}
      propertyPath: m_LocalRotation.x
      value: 0
      objectReference: {fileID: 0}
    - target: {fileID: 2172940060945303690, guid: 11d4e2c16bbf5bb4ba758189ecb7ef50, type: 3}
      propertyPath: m_LocalRotation.y
      value: 0
      objectReference: {fileID: 0}
    - target: {fileID: 2172940060945303690, guid: 11d4e2c16bbf5bb4ba758189ecb7ef50, type: 3}
      propertyPath: m_LocalRotation.z
      value: 0
      objectReference: {fileID: 0}
    - target: {fileID: 2172940060945303690, guid: 11d4e2c16bbf5bb4ba758189ecb7ef50, type: 3}
      propertyPath: m_LocalEulerAnglesHint.x
      value: 0
      objectReference: {fileID: 0}
    - target: {fileID: 2172940060945303690, guid: 11d4e2c16bbf5bb4ba758189ecb7ef50, type: 3}
      propertyPath: m_LocalEulerAnglesHint.y
      value: 0
      objectReference: {fileID: 0}
    - target: {fileID: 2172940060945303690, guid: 11d4e2c16bbf5bb4ba758189ecb7ef50, type: 3}
      propertyPath: m_LocalEulerAnglesHint.z
      value: 0
      objectReference: {fileID: 0}
    - target: {fileID: 2172940060945303691, guid: 11d4e2c16bbf5bb4ba758189ecb7ef50, type: 3}
      propertyPath: m_Sprite
      value: 
      objectReference: {fileID: 21300000, guid: c82f1c05b4cf28446b0d695afb69ea7d, type: 3}
    m_RemovedComponents: []
  m_SourcePrefab: {fileID: 100100000, guid: 11d4e2c16bbf5bb4ba758189ecb7ef50, type: 3}
