%YAML 1.1
%TAG !u! tag:unity3d.com,2011:
--- !u!74 &7400000
AnimationClip:
  m_ObjectHideFlags: 0
  m_CorrespondingSourceObject: {fileID: 0}
  m_PrefabInstance: {fileID: 0}
  m_PrefabAsset: {fileID: 0}
  m_Name: JumpAnimation
  serializedVersion: 6
  m_Legacy: 0
  m_Compressed: 0
  m_UseHighQualityCurve: 1
  m_RotationCurves: []
  m_CompressedRotationCurves: []
  m_EulerCurves: []
  m_PositionCurves: []
  m_ScaleCurves: []
  m_FloatCurves: []
  m_PPtrCurves:
  - curve:
    - time: 0
      value: {fileID: 21300000, guid: a5fdef6849a495b408e06db03251a9cb, type: 3}
    - time: 0.083333336
      value: {fileID: 21300000, guid: a5fdef6849a495b408e06db03251a9cb, type: 3}
    - time: 0.16666667
      value: {fileID: 21300000, guid: 8f0f6ce525b318f4684358d75016ffa4, type: 3}
    - time: 0.25
      value: {fileID: 21300000, guid: 8f0f6ce525b318f4684358d75016ffa4, type: 3}
    - time: 0.33333334
      value: {fileID: 21300000, guid: 04b40277ea091e642845522d09df2467, type: 3}
    - time: 0.41666666
      value: {fileID: 21300000, guid: 04b40277ea091e642845522d09df2467, type: 3}
    - time: 0.5
      value: {fileID: 21300000, guid: df4e9e6c974824248a6aa0224813f267, type: 3}
    - time: 0.5833333
      value: {fileID: 21300000, guid: df4e9e6c974824248a6aa0224813f267, type: 3}
    - time: 0.6666667
      value: {fileID: 21300000, guid: efbf8fd7fc4c7ef4e9bfd70cfbac8bed, type: 3}
    - time: 0.75
      value: {fileID: 21300000, guid: efbf8fd7fc4c7ef4e9bfd70cfbac8bed, type: 3}
    - time: 0.8333333
      value: {fileID: 21300000, guid: 3870022cd6aef4b46ba8b74069f5632f, type: 3}
    - time: 0.9166667
      value: {fileID: 21300000, guid: 3870022cd6aef4b46ba8b74069f5632f, type: 3}
    - time: 1
      value: {fileID: 21300000, guid: 1d17868e476130944b82711d22a73f1c, type: 3}
    - time: 1.0833334
      value: {fileID: 21300000, guid: 1d17868e476130944b82711d22a73f1c, type: 3}
    - time: 1.1666666
      value: {fileID: 21300000, guid: cc9aa0fe13c6d0a44bebb28bdb54af73, type: 3}
    - time: 1.25
      value: {fileID: 21300000, guid: cc9aa0fe13c6d0a44bebb28bdb54af73, type: 3}
    attribute: m_Sprite
    path: 
    classID: 212
    script: {fileID: 0}
  m_SampleRate: 12
  m_WrapMode: 0
  m_Bounds:
    m_Center: {x: 0, y: 0, z: 0}
    m_Extent: {x: 0, y: 0, z: 0}
  m_ClipBindingConstant:
    genericBindings:
    - serializedVersion: 2
      path: 0
      attribute: 0
      script: {fileID: 0}
      typeID: 212
      customType: 23
      isPPtrCurve: 1
    pptrCurveMapping:
    - {fileID: 21300000, guid: a5fdef6849a495b408e06db03251a9cb, type: 3}
    - {fileID: 21300000, guid: a5fdef6849a495b408e06db03251a9cb, type: 3}
    - {fileID: 21300000, guid: 8f0f6ce525b318f4684358d75016ffa4, type: 3}
    - {fileID: 21300000, guid: 8f0f6ce525b318f4684358d75016ffa4, type: 3}
    - {fileID: 21300000, guid: 04b40277ea091e642845522d09df2467, type: 3}
    - {fileID: 21300000, guid: 04b40277ea091e642845522d09df2467, type: 3}
    - {fileID: 21300000, guid: df4e9e6c974824248a6aa0224813f267, type: 3}
    - {fileID: 21300000, guid: df4e9e6c974824248a6aa0224813f267, type: 3}
    - {fileID: 21300000, guid: efbf8fd7fc4c7ef4e9bfd70cfbac8bed, type: 3}
    - {fileID: 21300000, guid: efbf8fd7fc4c7ef4e9bfd70cfbac8bed, type: 3}
    - {fileID: 21300000, guid: 3870022cd6aef4b46ba8b74069f5632f, type: 3}
    - {fileID: 21300000, guid: 3870022cd6aef4b46ba8b74069f5632f, type: 3}
    - {fileID: 21300000, guid: 1d17868e476130944b82711d22a73f1c, type: 3}
    - {fileID: 21300000, guid: 1d17868e476130944b82711d22a73f1c, type: 3}
    - {fileID: 21300000, guid: cc9aa0fe13c6d0a44bebb28bdb54af73, type: 3}
    - {fileID: 21300000, guid: cc9aa0fe13c6d0a44bebb28bdb54af73, type: 3}
  m_AnimationClipSettings:
    serializedVersion: 2
    m_AdditiveReferencePoseClip: {fileID: 0}
    m_AdditiveReferencePoseTime: 0
    m_StartTime: 0
    m_StopTime: 1.3333334
    m_OrientationOffsetY: 0
    m_Level: 0
    m_CycleOffset: 0
    m_HasAdditiveReferencePose: 0
    m_LoopTime: 1
    m_LoopBlend: 0
    m_LoopBlendOrientation: 0
    m_LoopBlendPositionY: 0
    m_LoopBlendPositionXZ: 0
    m_KeepOriginalOrientation: 0
    m_KeepOriginalPositionY: 1
    m_KeepOriginalPositionXZ: 0
    m_HeightFromFeet: 0
    m_Mirror: 0
  m_EditorCurves: []
  m_EulerEditorCurves: []
  m_HasGenericRootTransform: 0
  m_HasMotionFloatCurves: 0
  m_Events: []
