{
    "clientes" : 
    [{"Cédula": "1315991313",
        "Apellidos": "Zambrano Vasquez",
        "Nombres": "Yandri Joel",
        "Direccion": "La pradera",
        "Telefono": "0984707209"
},
    {
        "Cédula": "1315986335",
        "Apellidos": "Zambrano Franco",
        "Nombres": "Luiggi jose",
        "Direccion": "Los esteros",
        "Telefono": "0987566698"
    },
    {
        "Cédula": "1357998569",
        "Apellidos": "Ortega Vera",
        "Nombres": "Jean Carlos",
        "Direccion": "6no nivel",
        "Telefono": "0987536999"
    },
    {
        "Cédula": "1314569856",
        "Apellidos": "Zambrano Vasquez",
        "Nombres": "Robinson Andres",
        "Direccion": "Monterrey",
        "Telefono": "0984704589"
    },
    {
        "Cédula": "1315998632",
        "Apellidos": "Sabando Ordoñes",
        "Nombres": "Aime Mayerly",
        "Direccion": "Ciudadela Universitaria",
        "Telefono": "0987532111"
    },
    {
        "Cédula": "1315678999",
        "Apellidos": "Zambrano Cedeño",
        "Nombres": "Kelly Nicole",
        "Direccion": "La pradera",
        "Telefono": "0987444788"
    },
    {
        "Cédula": "1315987889",
        "Apellidos": "Holguin Mendoza",
        "Nombres": "Jose Franco",
        "Direccion": "Monterrey",
        "Telefono": "0987654321"
    },
    {
        "Cédula": "1316985555",
        "Apellidos": "Vera Vera",
        "Nombres": "Angie Nicole",
        "Direccion": "La epoca",
        "Telefono": "0987555555"
    },
    {
        "Cédula": "1315615444",
        "Apellidos": "Zambrano Alava",
        "Nombres": "Fausto Joel",
        "Direccion": "La pradera",
        "Telefono": "0994376969"
    },
    {
        "Cédula": "1315889969",
        "Apellidos": "Macias Vera",
        "Nombres": "Juan Jose",
        "Direccion": "La aurora",
        "Telefono": "0983214569"
    }]
}
