<?xml version="1.0" encoding="UTF-8"?>
<!DOCTYPE svg PUBLIC "-//W3C//DTD SVG 1.1//EN" "http://www.w3.org/Graphics/SVG/1.1/DTD/svg11.dtd">
<!-- Creator: CorelDRAW X8 -->
<svg xmlns="http://www.w3.org/2000/svg" xml:space="preserve" width="81px" height="110px" version="1.1" style="shape-rendering:geometricPrecision; text-rendering:geometricPrecision; image-rendering:optimizeQuality; fill-rule:evenodd; clip-rule:evenodd"
viewBox="0 0 970126 1313266"
 xmlns:xlink="http://www.w3.org/1999/xlink">
 <defs>
  <style type="text/css">
   <![CDATA[
    .fil0 {fill:#4D4D4D}
   ]]>
  </style>
 </defs>
 <g id="Layer_x0020_1">
  <metadata id="CorelCorpID_0Corel-Layer"/>
  <path class="fil0" d="M807832 0l-645537 0c-89265,0 -162295,73044 -162295,162295l0 382923 0 430372 0 325888c8880,20795 31764,8612 50922,4362l756910 -167955c87119,-19327 162294,-73030 162294,-162295l0 -813295c0,-89251 -73029,-162295 -162294,-162295zm-80428 242736l0 664370 -484682 107547 0 -771917 484682 0z"/>
 </g>
</svg>
