<?xml version="1.0" encoding="UTF-8"?>
<!DOCTYPE svg PUBLIC "-//W3C//DTD SVG 1.1//EN" "http://www.w3.org/Graphics/SVG/1.1/DTD/svg11.dtd">
<!-- Creator: CorelDRAW X8 -->
<svg xmlns="http://www.w3.org/2000/svg" xml:space="preserve" width="24px" height="24px" version="1.1" style="shape-rendering:geometricPrecision; text-rendering:geometricPrecision; image-rendering:optimizeQuality; fill-rule:evenodd; clip-rule:evenodd"
viewBox="0 0 369 369"
 xmlns:xlink="http://www.w3.org/1999/xlink">
 <defs>
  <style type="text/css">
   <![CDATA[
    .fil0 {fill:#4D4D4D}
    .fil1 {fill:white}
   ]]>
  </style>
 </defs>
 <g id="Layer_x0020_1">
  <metadata id="CorelCorpID_0Corel-Layer"/>
  <circle class="fil0" cx="185" cy="185" r="185"/>
  <path class="fil1" d="M124 109l3 0 4 1c3,1 4,2 6,4l48 47 47 -47c3,-3 4,-3 6,-4l4 -1 4 0 2 1c1,0 5,2 8,4 3,3 4,7 4,10 1,4 0,8 -3,11 -1,2 -3,4 -4,5 -15,14 -30,30 -45,45l45 44c4,4 8,8 7,16 0,3 -1,5 -2,8 -2,2 -4,4 -6,5l-3 1 -3 1 -4 0 -3 -1 0 0 0 0 -1 0 1 0 0 0 0 0 -1 0c-1,0 -3,-1 -4,-2 -16,-14 -34,-33 -49,-49 -16,15 -34,36 -50,49 -1,1 -2,2 -4,2l-1 1 1 -1 -1 0 0 1 0 -1 -3 1 -3 0 -3 -1c0,1 -1,0 -1,0l1 0c0,1 -3,-1 -4,-1 -2,-1 -4,-3 -5,-5 -2,-3 -3,-5 -3,-8 0,-8 3,-12 8,-16 15,-14 29,-29 44,-44 -14,-15 -29,-31 -44,-45 -2,-1 -4,-3 -5,-5 -2,-3 -3,-7 -3,-10 0,-4 2,-8 4,-10 3,-3 6,-5 8,-5l3 -1zm125 150l1 0 -1 0zm-118 0l-1 0 1 0zm0 0l0 0 0 0z"/>
 </g>
</svg>
