{
  "$schema": "http://json.schemastore.org/template",
  "author": "HardCode",
  "classifications": [ "Web" ],
  "identity": "HardCode.Procedure.Grpc.Template",
  "name": "Clean Architecture Procedure Template With Grpc Api",
  "shortName": "hardcode-procedure-grpc",
  "tags": {
    "language": "C#",
    "type": "project"
  },
  "sourceName": "ProcGrpc",
  "preferNameDirectory": true,
  "sources": [
    {
      "exclude": ["*.nuspec", "*.nupkg", ".template.config/*", "package/*", "[Content_Types].xml", ".signature.p7s", "_rels"]
    }
  ]
}