RowKey,Year,Country,HappinessScore,Economy,SocialSupport,Health,Freedom,Trust,Generosity
1,2015,Switzerland,7.587,1.39651,1.34951,0.94143,0.66557,0.41978,0.29678
2,2015,Iceland,7.561,1.30232,1.40223,0.94784,0.62877,0.14145,0.4363
3,2015,Denmark,7.527,1.32548,1.36058,0.87464,0.64938,0.48357,0.34139
4,2015,Norway,7.522,1.459,1.33095,0.88521,0.66973,0.36503,0.34699
5,2015,Canada,7.427,1.32629,1.32261,0.90563,0.63297,0.32957,0.45811
6,2015,Finland,7.406,1.29025,1.31826,0.88911,0.64169,0.41372,0.23351
7,2015,Netherlands,7.378,1.32944,1.28017,0.89284,0.61576,0.31814,0.4761
8,2015,Sweden,7.364,1.33171,1.28907,0.91087,0.6598,0.43844,0.36262
9,2015,New Zealand,7.286,1.25018,1.31967,0.90837,0.63938,0.42922,0.47501
10,2015,Australia,7.284,1.33358,1.30923,0.93156,0.65124,0.35637,0.43562
11,2015,Israel,7.278,1.22857,1.22393,0.91387,0.41319,0.07785,0.33172
12,2015,Costa Rica,7.226,0.95578,1.23788,0.86027,0.63376,0.10583,0.25497
13,2015,Austria,7.2,1.33723,1.29704,0.89042,0.62433,0.18676,0.33088
14,2015,Mexico,7.187,1.02054,0.91451,0.81444,0.48181,0.21312,0.14074
15,2015,United States,7.119,1.39451,1.24711,0.86179,0.54604,0.1589,0.40105
16,2015,Brazil,6.983,0.98124,1.23287,0.69702,0.49049,0.17521,0.14574
17,2015,Luxembourg,6.946,1.56391,1.21963,0.91894,0.61583,0.37798,0.28034
18,2015,Ireland,6.94,1.33596,1.36948,0.89533,0.61777,0.28703,0.45901
19,2015,Belgium,6.937,1.30782,1.28566,0.89667,0.5845,0.2254,0.2225
20,2015,United Arab Emirates,6.901,1.42727,1.12575,0.80925,0.64157,0.38583,0.26428
21,2015,United Kingdom,6.867,1.26637,1.28548,0.90943,0.59625,0.32067,0.51912
22,2015,Oman,6.853,1.36011,1.08182,0.76276,0.63274,0.32524,0.21542
23,2015,Venezuela,6.81,1.04424,1.25596,0.72052,0.42908,0.11069,0.05841
24,2015,Singapore,6.798,1.52186,1.02,1.02525,0.54252,0.4921,0.31105
25,2015,Panama,6.786,1.06353,1.1985,0.79661,0.5421,0.0927,0.2443
26,2015,Germany,6.75,1.32792,1.29937,0.89186,0.61477,0.21843,0.28214
27,2015,Chile,6.67,1.10715,1.12447,0.85857,0.44132,0.12869,0.33363
28,2015,Qatar,6.611,1.69042,1.0786,0.79733,0.6404,0.52208,0.32573
29,2015,France,6.575,1.27778,1.26038,0.94579,0.55011,0.20646,0.12332
30,2015,Argentina,6.574,1.05351,1.24823,0.78723,0.44974,0.08484,0.11451
31,2015,Czech Republic,6.505,1.17898,1.20643,0.84483,0.46364,0.02652,0.10686
32,2015,Uruguay,6.485,1.06166,1.2089,0.8116,0.60362,0.24558,0.2324
33,2015,Colombia,6.477,0.91861,1.24018,0.69077,0.53466,0.0512,0.18401
34,2015,Thailand,6.455,0.9669,1.26504,0.7385,0.55664,0.03187,0.5763
35,2015,Saudi Arabia,6.411,1.39541,1.08393,0.72025,0.31048,0.32524,0.13706
36,2015,Spain,6.329,1.23011,1.31379,0.95562,0.45951,0.06398,0.18227
37,2015,Malta,6.302,1.2074,1.30203,0.88721,0.60365,0.13586,0.51752
38,2015,Taiwan,6.298,1.29098,1.07617,0.8753,0.3974,0.08129,0.25376
39,2015,Kuwait,6.295,1.55422,1.16594,0.72492,0.55499,0.25609,0.16228
40,2015,Suriname,6.269,0.99534,0.972,0.6082,0.59657,0.13633,0.16991
41,2015,Trinidad and Tobago,6.168,1.21183,1.18354,0.61483,0.55884,0.0114,0.31844
42,2015,El Salvador,6.13,0.76454,1.02507,0.67737,0.4035,0.11776,0.10692
43,2015,Guatemala,6.123,0.74553,1.04356,0.64425,0.57733,0.09472,0.27489
44,2015,Uzbekistan,6.003,0.63244,1.34043,0.59772,0.65821,0.30826,0.22837
45,2015,Slovakia,5.995,1.16891,1.26999,0.78902,0.31751,0.03431,0.16893
46,2015,Japan,5.987,1.27074,1.25712,0.99111,0.49615,0.1806,0.10705
47,2015,South Korea,5.984,1.24461,0.95774,0.96538,0.33208,0.07857,0.18557
48,2015,Ecuador,5.975,0.86402,0.99903,0.79075,0.48574,0.1809,0.11541
49,2015,Bahrain,5.96,1.32376,1.21624,0.74716,0.45492,0.306,0.17362
50,2015,Italy,5.948,1.25114,1.19777,0.95446,0.26236,0.02901,0.22823
51,2015,Bolivia,5.89,0.68133,0.97841,0.5392,0.57414,0.088,0.20536
52,2015,Moldova,5.889,0.59448,1.01528,0.61826,0.32818,0.01615,0.20951
53,2015,Paraguay,5.878,0.75985,1.30477,0.66098,0.53899,0.08242,0.3424
54,2015,Kazakhstan,5.855,1.12254,1.12241,0.64368,0.51649,0.08454,0.11827
55,2015,Slovenia,5.848,1.18498,1.27385,0.87337,0.60855,0.03787,0.25328
56,2015,Lithuania,5.833,1.14723,1.25745,0.73128,0.21342,0.01031,0.02641
57,2015,Nicaragua,5.828,0.59325,1.14184,0.74314,0.55475,0.19317,0.27815
58,2015,Peru,5.824,0.90019,0.97459,0.73017,0.41496,0.05989,0.14982
59,2015,Belarus,5.813,1.03192,1.23289,0.73608,0.37938,0.1909,0.11046
60,2015,Poland,5.791,1.12555,1.27948,0.77903,0.53122,0.04212,0.16759
61,2015,Malaysia,5.77,1.12486,1.07023,0.72394,0.53024,0.10501,0.33075
62,2015,Croatia,5.759,1.08254,0.79624,0.78805,0.25883,0.0243,0.05444
63,2015,Libya,5.754,1.13145,1.11862,0.7038,0.41668,0.11023,0.18295
64,2015,Russia,5.716,1.13764,1.23617,0.66926,0.36679,0.03005,0.00199
65,2015,Jamaica,5.709,0.81038,1.15102,0.68741,0.50442,0.02299,0.2123
66,2015,North Cyprus,5.695,1.20806,1.07008,0.92356,0.49027,0.1428,0.26169
67,2015,Cyprus,5.689,1.20813,0.89318,0.92356,0.40672,0.06146,0.30638
68,2015,Algeria,5.605,0.93929,1.07772,0.61766,0.28579,0.17383,0.07822
69,2015,Kosovo,5.589,0.80148,0.81198,0.63132,0.24749,0.04741,0.2831
70,2015,Turkmenistan,5.548,0.95847,1.22668,0.53886,0.4761,0.30844,0.16979
71,2015,Mauritius,5.477,1.00761,0.98521,0.7095,0.56066,0.07521,0.37744
72,2015,Hong Kong,5.474,1.38604,1.05818,1.01328,0.59608,0.37124,0.39478
73,2015,Estonia,5.429,1.15174,1.22791,0.77361,0.44888,0.15184,0.0868
74,2015,Indonesia,5.399,0.82827,1.08708,0.63793,0.46611,0,0.51535
75,2015,Vietnam,5.36,0.63216,0.91226,0.74676,0.59444,0.10441,0.1686
76,2015,Turkey,5.332,1.06098,0.94632,0.73172,0.22815,0.15746,0.12253
77,2015,Kyrgyzstan,5.286,0.47428,1.15115,0.65088,0.43477,0.04232,0.3003
78,2015,Nigeria,5.268,0.65435,0.90432,0.16007,0.34334,0.0403,0.27233
79,2015,Bhutan,5.253,0.77042,1.10395,0.57407,0.53206,0.15445,0.47998
80,2015,Azerbaijan,5.212,1.02389,0.93793,0.64045,0.3703,0.16065,0.07799
81,2015,Pakistan,5.194,0.59543,0.41411,0.51466,0.12102,0.10464,0.33671
82,2015,Jordan,5.192,0.90198,1.05392,0.69639,0.40661,0.14293,0.11053
83,2015,Montenegro,5.192,0.97438,0.90557,0.72521,0.1826,0.14296,0.1614
84,2015,China,5.14,0.89012,0.94675,0.81658,0.51697,0.02781,0.08185
85,2015,Zambia,5.129,0.47038,0.91612,0.29924,0.48827,0.12468,0.19591
86,2015,Romania,5.124,1.04345,0.88588,0.7689,0.35068,0.00649,0.13748
87,2015,Serbia,5.123,0.92053,1.00964,0.74836,0.20107,0.02617,0.19231
88,2015,Portugal,5.102,1.15991,1.13935,0.87519,0.51469,0.01078,0.13719
89,2015,Latvia,5.098,1.11312,1.09562,0.72437,0.29671,0.06332,0.18226
90,2015,Philippines,5.073,0.70532,1.03516,0.58114,0.62545,0.12279,0.24991
91,2015,Somaliland region,5.057,0.18847,0.95152,0.43873,0.46582,0.39928,0.50318
92,2015,Morocco,5.013,0.73479,0.64095,0.60954,0.41691,0.08546,0.07172
93,2015,Macedonia,5.007,0.91851,1.00232,0.73545,0.33457,0.05327,0.22359
94,2015,Mozambique,4.971,0.08308,1.02626,0.09131,0.34037,0.15603,0.22269
95,2015,Albania,4.959,0.87867,0.80434,0.81325,0.35733,0.06413,0.14272
96,2015,Bosnia and Herzegovina,4.949,0.83223,0.91916,0.79081,0.09245,0.00227,0.24808
97,2015,Lesotho,4.898,0.37545,1.04103,0.07612,0.31767,0.12504,0.16388
98,2015,Dominican Republic,4.885,0.89537,1.17202,0.66825,0.57672,0.14234,0.21684
99,2015,Laos,4.876,0.59066,0.73803,0.54909,0.59591,0.24249,0.42192
100,2015,Mongolia,4.874,0.82819,1.3006,0.60268,0.43626,0.02666,0.3323
101,2015,Swaziland,4.867,0.71206,1.07284,0.07566,0.30658,0.0306,0.18259
102,2015,Greece,4.857,1.15406,0.92933,0.88213,0.07699,0.01397,0
103,2015,Lebanon,4.839,1.02564,0.80001,0.83947,0.33916,0.04582,0.21854
104,2015,Hungary,4.8,1.12094,1.20215,0.75905,0.32112,0.02758,0.128
105,2015,Honduras,4.788,0.59532,0.95348,0.6951,0.40148,0.06825,0.23027
106,2015,Tajikistan,4.786,0.39047,0.85563,0.57379,0.47216,0.15072,0.22974
107,2015,Tunisia,4.739,0.88113,0.60429,0.73793,0.26268,0.06358,0.06431
108,2015,Palestinian Territories,4.715,0.59867,0.92558,0.66015,0.24499,0.12905,0.11251
109,2015,Bangladesh,4.694,0.39753,0.43106,0.60164,0.4082,0.12569,0.21222
110,2015,Iran,4.686,1.0088,0.54447,0.69805,0.30033,0.05863,0.38086
111,2015,Ukraine,4.681,0.79907,1.20278,0.6739,0.25123,0.02961,0.15275
112,2015,Iraq,4.677,0.98549,0.81889,0.60237,0,0.13788,0.17922
113,2015,South Africa,4.642,0.92049,1.18468,0.27688,0.33207,0.08884,0.11973
114,2015,Ghana,4.633,0.54558,0.67954,0.40132,0.42342,0.04355,0.23087
115,2015,Zimbabwe,4.61,0.271,1.03276,0.33475,0.25861,0.08079,0.18987
116,2015,Liberia,4.571,0.0712,0.78968,0.34201,0.28531,0.06232,0.24362
117,2015,India,4.565,0.64499,0.38174,0.51529,0.39786,0.08492,0.26475
118,2015,Sudan,4.55,0.52107,1.01404,0.36878,0.10081,0.1466,0.19062
119,2015,Haiti,4.518,0.26673,0.74302,0.38847,0.24425,0.17175,0.46187
120,2015,Congo (Kinshasa),4.517,0,1.0012,0.09806,0.22605,0.07625,0.24834
121,2015,Nepal,4.514,0.35997,0.86449,0.56874,0.38282,0.05907,0.32296
122,2015,Ethiopia,4.512,0.19073,0.60406,0.44055,0.4345,0.15048,0.24325
123,2015,Sierra Leone,4.507,0.33024,0.95571,0,0.4084,0.08786,0.21488
124,2015,Mauritania,4.436,0.45407,0.86908,0.35874,0.24232,0.17461,0.219
125,2015,Kenya,4.419,0.36471,0.99876,0.41435,0.42215,0.05839,0.37542
126,2015,Djibouti,4.369,0.44025,0.59207,0.36291,0.46074,0.28105,0.18093
127,2015,Armenia,4.35,0.76821,0.77711,0.7299,0.19847,0.039,0.07855
128,2015,Botswana,4.332,0.99355,1.10464,0.04776,0.49495,0.12474,0.10461
129,2015,Myanmar,4.307,0.27108,0.70905,0.48246,0.44017,0.19034,0.79588
130,2015,Georgia,4.297,0.7419,0.38562,0.72926,0.40577,0.38331,0.05547
131,2015,Malawi,4.292,0.01604,0.41134,0.22562,0.43054,0.06977,0.33128
132,2015,Sri Lanka,4.271,0.83524,1.01905,0.70806,0.53726,0.09179,0.40828
133,2015,Cameroon,4.252,0.4225,0.88767,0.23402,0.49309,0.05786,0.20618
134,2015,Bulgaria,4.218,1.01216,1.10614,0.76649,0.30587,0.00872,0.11921
135,2015,Egypt,4.194,0.8818,0.747,0.61712,0.17288,0.06324,0.11291
136,2015,Yemen,4.077,0.54649,0.68093,0.40064,0.35571,0.07854,0.09131
137,2015,Angola,4.033,0.75778,0.8604,0.16683,0.10384,0.07122,0.12344
138,2015,Mali,3.995,0.26074,1.03526,0.20583,0.38857,0.12352,0.18798
139,2015,Congo (Brazzaville),3.989,0.67866,0.6629,0.31051,0.41466,0.11686,0.12388
140,2015,Comoros,3.956,0.23906,0.79273,0.36315,0.22917,0.199,0.17441
141,2015,Uganda,3.931,0.21102,1.13299,0.33861,0.45727,0.07267,0.29066
142,2015,Senegal,3.904,0.36498,0.97619,0.4354,0.36772,0.10713,0.20843
143,2015,Gabon,3.896,1.06024,0.90528,0.43372,0.31914,0.11091,0.06822
144,2015,Niger,3.845,0.0694,0.77265,0.29707,0.47692,0.15639,0.19387
145,2015,Cambodia,3.819,0.46038,0.62736,0.61114,0.66246,0.07247,0.40359
146,2015,Tanzania,3.781,0.2852,1.00268,0.38215,0.32878,0.05747,0.34377
147,2015,Madagascar,3.681,0.20824,0.66801,0.46721,0.19184,0.08124,0.21333
148,2015,Central African Republic,3.678,0.0785,0,0.06699,0.48879,0.08289,0.23835
149,2015,Chad,3.667,0.34193,0.76062,0.1501,0.23501,0.05269,0.18386
150,2015,Guinea,3.656,0.17417,0.46475,0.24009,0.37725,0.12139,0.28657
151,2015,Ivory Coast,3.655,0.46534,0.77115,0.15185,0.46866,0.17922,0.20165
152,2015,Burkina Faso,3.587,0.25812,0.85188,0.27125,0.39493,0.12832,0.21747
153,2015,Afghanistan,3.575,0.31982,0.30285,0.30335,0.23414,0.09719,0.3651
154,2015,Rwanda,3.465,0.22208,0.7737,0.42864,0.59201,0.55191,0.22628
155,2015,Benin,3.34,0.28665,0.35386,0.3191,0.4845,0.0801,0.1826
156,2015,Syria,3.006,0.6632,0.47489,0.72193,0.15684,0.18906,0.47179
157,2015,Burundi,2.905,0.0153,0.41587,0.22396,0.1185,0.10062,0.19727
158,2015,Togo,2.839,0.20868,0.13995,0.28443,0.36453,0.10731,0.16681
159,2016,Denmark,7.526,1.44178,1.16374,0.79504,0.57941,0.44453,0.36171
160,2016,Switzerland,7.509,1.52733,1.14524,0.86303,0.58557,0.41203,0.28083
161,2016,Iceland,7.501,1.42666,1.18326,0.86733,0.56624,0.14975,0.47678
162,2016,Norway,7.498,1.57744,1.1269,0.79579,0.59609,0.35776,0.37895
163,2016,Finland,7.413,1.40598,1.13464,0.81091,0.57104,0.41004,0.25492
164,2016,Canada,7.404,1.44015,1.0961,0.8276,0.5737,0.31329,0.44834
165,2016,Netherlands,7.339,1.46468,1.02912,0.81231,0.55211,0.29927,0.47416
166,2016,New Zealand,7.334,1.36066,1.17278,0.83096,0.58147,0.41904,0.49401
167,2016,Australia,7.313,1.44443,1.10476,0.8512,0.56837,0.32331,0.47407
168,2016,Sweden,7.291,1.45181,1.08764,0.83121,0.58218,0.40867,0.38254
169,2016,Israel,7.267,1.33766,0.99537,0.84917,0.36432,0.08728,0.32288
170,2016,Austria,7.119,1.45038,1.08383,0.80565,0.54355,0.21348,0.32865
171,2016,United States,7.104,1.50796,1.04782,0.779,0.48163,0.14868,0.41077
172,2016,Costa Rica,7.087,1.06879,1.02152,0.76146,0.55225,0.10547,0.22553
173,2016,Puerto Rico,7.039,1.35943,1.08113,0.77758,0.46823,0.12275,0.22202
174,2016,Germany,6.994,1.44787,1.09774,0.81487,0.53466,0.28551,0.30452
175,2016,Brazil,6.952,1.08754,1.03938,0.61415,0.40425,0.14166,0.15776
176,2016,Belgium,6.929,1.42539,1.05249,0.81959,0.51354,0.26248,0.2424
177,2016,Ireland,6.907,1.48341,1.16157,0.81455,0.54008,0.29754,0.44963
178,2016,Luxembourg,6.871,1.69752,1.03999,0.84542,0.5487,0.35329,0.27571
179,2016,Mexico,6.778,1.11508,0.7146,0.71143,0.37709,0.18355,0.11735
180,2016,Singapore,6.739,1.64555,0.86758,0.94719,0.4877,0.46987,0.32706
181,2016,United Kingdom,6.725,1.40283,1.08672,0.80991,0.50036,0.27399,0.50156
182,2016,Chile,6.705,1.2167,0.90587,0.81883,0.37789,0.11451,0.31595
183,2016,Panama,6.701,1.18306,0.98912,0.70835,0.48927,0.08423,0.2418
184,2016,Argentina,6.65,1.15137,1.06612,0.69711,0.42284,0.07296,0.10989
185,2016,Czech Republic,6.596,1.30915,1.00793,0.76376,0.41418,0.03986,0.09929
186,2016,United Arab Emirates,6.573,1.57352,0.87114,0.72993,0.56215,0.35561,0.26591
187,2016,Uruguay,6.545,1.18157,1.03143,0.72183,0.54388,0.21394,0.18056
188,2016,Malta,6.488,1.30782,1.09879,0.80315,0.54994,0.17554,0.56237
189,2016,Colombia,6.481,1.03032,1.02169,0.59659,0.44735,0.05399,0.15626
190,2016,France,6.478,1.39488,1.00508,0.83795,0.46562,0.17808,0.1216
191,2016,Thailand,6.474,1.0893,1.04477,0.64915,0.49553,0.02833,0.58696
192,2016,Saudi Arabia,6.379,1.48953,0.84829,0.59267,0.37904,0.30008,0.15457
193,2016,Taiwan,6.379,1.39729,0.92624,0.79565,0.32377,0.0663,0.25495
194,2016,Qatar,6.375,1.82427,0.87964,0.71723,0.56679,0.48049,0.32388
195,2016,Spain,6.361,1.34253,1.12945,0.87896,0.37545,0.06137,0.17665
196,2016,Algeria,6.355,1.05266,0.83309,0.61804,0.21006,0.16157,0.07044
197,2016,Guatemala,6.324,0.83454,0.87119,0.54039,0.50379,0.08701,0.28808
198,2016,Suriname,6.269,1.09686,0.77866,0.50933,0.52234,0.12692,0.16665
199,2016,Kuwait,6.239,1.61714,0.87758,0.63569,0.43166,0.23669,0.15965
200,2016,Bahrain,6.218,1.44024,0.94397,0.65696,0.47375,0.25772,0.17147
201,2016,Trinidad and Tobago,6.168,1.32572,0.98569,0.52608,0.48453,0.01241,0.31935
202,2016,Venezuela,6.084,1.13367,1.03302,0.61904,0.19847,0.08304,0.0425
203,2016,Slovakia,6.078,1.27973,1.08268,0.70367,0.23391,0.02947,0.13837
204,2016,El Salvador,6.068,0.8737,0.80975,0.596,0.37269,0.10613,0.08877
205,2016,Malaysia,6.005,1.25142,0.88025,0.62366,0.39031,0.09081,0.41474
206,2016,Nicaragua,5.992,0.69384,0.89521,0.65213,0.46582,0.16292,0.29773
207,2016,Uzbekistan,5.987,0.73591,1.1681,0.50163,0.60848,0.28333,0.34326
208,2016,Italy,5.977,1.35495,1.04167,0.85102,0.18827,0.02556,0.16684
209,2016,Ecuador,5.976,0.97306,0.85974,0.68613,0.4027,0.18037,0.10074
210,2016,Belize,5.956,0.87616,0.68655,0.45569,0.51231,0.10771,0.23684
211,2016,Japan,5.921,1.38007,1.06054,0.91491,0.46761,0.18985,0.10224
212,2016,Kazakhstan,5.919,1.22943,0.95544,0.57386,0.4052,0.11132,0.15011
213,2016,Moldova,5.897,0.69177,0.83132,0.52309,0.25202,0.01903,0.19997
214,2016,Russia,5.856,1.23228,1.05261,0.58991,0.32682,0.03586,0.02736
215,2016,Poland,5.835,1.24585,1.04685,0.69058,0.4519,0.055,0.14443
216,2016,South Korea,5.835,1.35948,0.72194,0.88645,0.25168,0.07716,0.18824
217,2016,Bolivia,5.822,0.79422,0.83779,0.4697,0.50961,0.07746,0.21698
218,2016,Lithuania,5.813,1.2692,1.06411,0.64674,0.18929,0.0182,0.02025
219,2016,Belarus,5.802,1.13062,1.04993,0.63104,0.29091,0.17457,0.13942
220,2016,North Cyprus,5.771,1.31141,0.81826,0.84142,0.43596,0.16578,0.26322
221,2016,Slovenia,5.768,1.29947,1.05613,0.79151,0.53164,0.03635,0.25738
222,2016,Peru,5.743,0.99602,0.81255,0.62994,0.37502,0.05292,0.14527
223,2016,Turkmenistan,5.658,1.08017,1.03817,0.44006,0.37408,0.28467,0.22567
224,2016,Mauritius,5.648,1.14372,0.75695,0.66189,0.46145,0.05203,0.36951
225,2016,Libya,5.615,1.06688,0.95076,0.52304,0.40672,0.10339,0.17087
226,2016,Latvia,5.56,1.21788,0.95025,0.63952,0.27996,0.0889,0.17445
227,2016,Cyprus,5.546,1.31857,0.70697,0.8488,0.29507,0.05228,0.27906
228,2016,Paraguay,5.538,0.89373,1.11111,0.58295,0.46235,0.07396,0.25296
229,2016,Romania,5.528,1.1697,0.72803,0.67602,0.36712,0.00679,0.12889
230,2016,Estonia,5.517,1.27964,1.05163,0.68098,0.41511,0.18519,0.08423
231,2016,Jamaica,5.51,0.89333,0.96372,0.59469,0.43597,0.04294,0.22245
232,2016,Croatia,5.488,1.18649,0.60809,0.70524,0.23907,0.04002,0.18434
233,2016,Hong Kong,5.458,1.5107,0.87021,0.95277,0.48079,0.31647,0.40097
234,2016,Somalia,5.44,0,0.33613,0.11466,0.56778,0.3118,0.27225
235,2016,Kosovo,5.401,0.90145,0.66062,0.54,0.14396,0.06547,0.27992
236,2016,Turkey,5.389,1.16492,0.87717,0.64718,0.23889,0.12348,0.04707
237,2016,Indonesia,5.314,0.95104,0.87625,0.49374,0.39237,0.00322,0.56521
238,2016,Jordan,5.303,0.99673,0.86216,0.60712,0.36023,0.13297,0.14262
239,2016,Azerbaijan,5.291,1.12373,0.76042,0.54504,0.35327,0.17914,0.0564
240,2016,Philippines,5.279,0.81217,0.87877,0.47036,0.54854,0.11757,0.21674
241,2016,China,5.245,1.0278,0.79381,0.73561,0.44012,0.02745,0.04959
242,2016,Bhutan,5.196,0.8527,0.90836,0.49759,0.46074,0.1616,0.48546
243,2016,Kyrgyzstan,5.185,0.56044,0.95434,0.55449,0.40212,0.04762,0.38432
244,2016,Serbia,5.177,1.03437,0.81329,0.6458,0.15718,0.04339,0.20737
245,2016,Bosnia and Herzegovina,5.163,0.93383,0.64367,0.70766,0.09511,0,0.29889
246,2016,Montenegro,5.161,1.07838,0.74173,0.63533,0.15111,0.12721,0.17191
247,2016,Dominican Republic,5.155,1.02787,0.99496,0.57669,0.52259,0.12372,0.21286
248,2016,Morocco,5.151,0.84058,0.38595,0.59471,0.25646,0.08404,0.04053
249,2016,Hungary,5.145,1.24142,0.93164,0.67608,0.1977,0.04472,0.099
250,2016,Pakistan,5.132,0.68816,0.26135,0.40306,0.14622,0.1388,0.31185
251,2016,Lebanon,5.129,1.12268,0.64184,0.76171,0.26228,0.03061,0.23693
252,2016,Portugal,5.123,1.27607,0.94367,0.79363,0.44727,0.01521,0.11691
253,2016,Macedonia,5.121,1.0193,0.78236,0.64738,0.27668,0.07047,0.23507
254,2016,Vietnam,5.061,0.74037,0.79117,0.66157,0.55954,0.11556,0.25075
255,2016,Somaliland Region,5.057,0.25558,0.75862,0.33108,0.3913,0.36794,0.51479
256,2016,Tunisia,5.045,0.97724,0.43165,0.59577,0.23553,0.0817,0.03936
257,2016,Greece,5.033,1.24886,0.75473,0.80029,0.05822,0.04127,0
258,2016,Tajikistan,4.996,0.48835,0.75602,0.53119,0.43408,0.13509,0.25998
259,2016,Mongolia,4.907,0.98853,1.08983,0.55469,0.35972,0.03285,0.34539
260,2016,Laos,4.876,0.68042,0.5497,0.38291,0.52168,0.22423,0.43079
261,2016,Nigeria,4.875,0.75216,0.64498,0.05108,0.27854,0.0305,0.23219
262,2016,Honduras,4.871,0.69429,0.75596,0.58383,0.26755,0.06906,0.2044
263,2016,Iran,4.813,1.11758,0.38857,0.64232,0.22544,0.0557,0.38538
264,2016,Zambia,4.795,0.61202,0.6376,0.23573,0.42662,0.11479,0.17866
265,2016,Nepal,4.793,0.44626,0.69699,0.50073,0.37012,0.07008,0.3816
266,2016,Palestinian Territories,4.754,0.67024,0.71629,0.56844,0.17744,0.10613,0.11154
267,2016,Albania,4.655,0.9553,0.50163,0.73007,0.31866,0.05301,0.1684
268,2016,Bangladesh,4.643,0.54177,0.24749,0.52989,0.39778,0.12583,0.19132
269,2016,Sierra Leone,4.635,0.36485,0.628,0,0.30685,0.08196,0.23897
270,2016,Iraq,4.575,1.07474,0.59205,0.51076,0.24856,0.13636,0.19589
271,2016,Namibia,4.574,0.93287,0.70362,0.34745,0.48614,0.10398,0.07795
272,2016,Cameroon,4.513,0.52497,0.62542,0.12698,0.42736,0.06126,0.2268
273,2016,Ethiopia,4.508,0.29283,0.37932,0.34578,0.36703,0.1717,0.29522
274,2016,South Africa,4.459,1.02416,0.96053,0.18611,0.42483,0.08415,0.13656
275,2016,Sri Lanka,4.415,0.97318,0.84783,0.62007,0.50817,0.07964,0.46978
276,2016,India,4.404,0.74036,0.29247,0.45091,0.40285,0.08722,0.25028
277,2016,Myanmar,4.395,0.34112,0.69981,0.3988,0.42692,0.20243,0.81971
278,2016,Egypt,4.362,0.95395,0.49813,0.52116,0.18847,0.10393,0.12706
279,2016,Armenia,4.36,0.86086,0.62477,0.64083,0.14037,0.03616,0.07793
280,2016,Kenya,4.356,0.52267,0.7624,0.30147,0.40576,0.06686,0.41328
281,2016,Ukraine,4.324,0.87287,1.01413,0.58628,0.12859,0.01829,0.20363
282,2016,Ghana,4.276,0.63107,0.49353,0.29681,0.40973,0.0326,0.21203
283,2016,Congo (Kinshasa),4.272,0.05661,0.80676,0.188,0.15602,0.06075,0.25458
284,2016,Georgia,4.252,0.83792,0.19249,0.64035,0.32461,0.3188,0.06786
285,2016,Congo (Brazzaville),4.236,0.77109,0.47799,0.28212,0.37938,0.09753,0.12077
286,2016,Senegal,4.219,0.44314,0.77416,0.40457,0.31056,0.11681,0.19103
287,2016,Bulgaria,4.217,1.11306,0.92542,0.67806,0.21219,0.00615,0.12793
288,2016,Mauritania,4.201,0.61391,0.84142,0.28639,0.1268,0.17955,0.22686
289,2016,Zimbabwe,4.193,0.35041,0.71478,0.1595,0.25429,0.08582,0.18503
290,2016,Malawi,4.156,0.08709,0.147,0.29364,0.4143,0.07564,0.30968
291,2016,Sudan,4.139,0.63069,0.81928,0.29759,0,0.10039,0.18077
292,2016,Gabon,4.121,1.15851,0.72368,0.3494,0.28098,0.09314,0.06244
293,2016,Mali,4.073,0.31292,0.86333,0.16347,0.27544,0.13647,0.21064
294,2016,Haiti,4.028,0.34097,0.29561,0.27494,0.12072,0.14476,0.47958
295,2016,Botswana,3.974,1.09426,0.89186,0.34752,0.44089,0.10769,0.12425
296,2016,Comoros,3.956,0.27509,0.60323,0.29981,0.15412,0.18437,0.1827
297,2016,Ivory Coast,3.916,0.55507,0.57576,0.04476,0.40663,0.1553,0.20338
298,2016,Cambodia,3.907,0.55604,0.5375,0.42494,0.58852,0.08092,0.40339
299,2016,Angola,3.866,0.84731,0.66366,0.04991,0.00589,0.08434,0.12071
300,2016,Niger,3.856,0.1327,0.6053,0.26162,0.38041,0.17176,0.2097
301,2016,South Sudan,3.832,0.39394,0.18519,0.15781,0.19662,0.13015,0.25899
302,2016,Chad,3.763,0.42214,0.63178,0.03824,0.12807,0.04952,0.18667
303,2016,Burkina Faso,3.739,0.31995,0.63054,0.21297,0.3337,0.12533,0.24353
304,2016,Uganda,3.739,0.34719,0.90981,0.19625,0.43653,0.06442,0.27102
305,2016,Yemen,3.724,0.57939,0.47493,0.31048,0.2287,0.05892,0.09821
306,2016,Madagascar,3.695,0.27954,0.46115,0.37109,0.13684,0.07506,0.2204
307,2016,Tanzania,3.666,0.47155,0.77623,0.357,0.3176,0.05099,0.31472
308,2016,Liberia,3.622,0.10706,0.50353,0.23165,0.25748,0.04852,0.24063
309,2016,Guinea,3.607,0.22415,0.3109,0.18829,0.30953,0.1192,0.29914
310,2016,Rwanda,3.515,0.32846,0.61586,0.31865,0.5432,0.50521,0.23552
311,2016,Benin,3.484,0.39499,0.10419,0.21028,0.39747,0.06681,0.2018
312,2016,Afghanistan,3.36,0.38227,0.11037,0.17344,0.1643,0.07112,0.31268
313,2016,Togo,3.303,0.28123,0,0.24811,0.34678,0.11587,0.17517
314,2016,Syria,3.069,0.74719,0.14866,0.62994,0.06912,0.17233,0.48397
315,2016,Burundi,2.905,0.06831,0.23442,0.15747,0.0432,0.09419,0.2029
316,2017,Norway,7.537,1.616463,1.533524,0.796667,0.635423,0.315964,0.362012
317,2017,Denmark,7.522,1.482383,1.551122,0.792566,0.626007,0.40077,0.35528
318,2017,Iceland,7.504,1.480633,1.610574,0.833552,0.627163,0.153527,0.47554
319,2017,Switzerland,7.494,1.56498,1.516912,0.858131,0.620071,0.367007,0.290549
320,2017,Finland,7.469,1.443572,1.540247,0.809158,0.617951,0.382612,0.245483
321,2017,Netherlands,7.377,1.503945,1.428939,0.810696,0.585384,0.282662,0.47049
322,2017,Canada,7.316,1.479204,1.481349,0.834558,0.611101,0.287372,0.43554
323,2017,New Zealand,7.314,1.405706,1.548195,0.81676,0.614062,0.382817,0.500005
324,2017,Sweden,7.284,1.494387,1.478162,0.830875,0.612924,0.384399,0.385399
325,2017,Australia,7.284,1.484415,1.510042,0.843887,0.601607,0.301184,0.477699
326,2017,Israel,7.213,1.375382,1.37629,0.838404,0.405989,0.085242,0.330083
327,2017,Costa Rica,7.079,1.109706,1.416404,0.759509,0.580132,0.100107,0.214613
328,2017,Austria,7.006,1.487097,1.459945,0.815328,0.567766,0.22106,0.316472
329,2017,United States,6.993,1.546259,1.419921,0.774287,0.505741,0.135639,0.392579
330,2017,Ireland,6.977,1.535707,1.558231,0.809783,0.57311,0.298388,0.427858
331,2017,Germany,6.951,1.487923,1.47252,0.798951,0.562511,0.276732,0.336269
332,2017,Belgium,6.891,1.463781,1.462313,0.818092,0.539771,0.251343,0.231503
333,2017,Luxembourg,6.863,1.741944,1.457584,0.845089,0.596628,0.318834,0.283181
334,2017,United Kingdom,6.714,1.441634,1.49646,0.805336,0.50819,0.265428,0.492774
335,2017,Chile,6.652,1.252785,1.284025,0.81948,0.376895,0.082288,0.326662
336,2017,United Arab Emirates,6.648,1.626343,1.26641,0.726798,0.608345,0.32449,0.360942
337,2017,Brazil,6.635,1.107353,1.431306,0.616552,0.437454,0.111093,0.16235
338,2017,Czech Republic,6.609,1.352682,1.433885,0.754444,0.490946,0.036873,0.088107
339,2017,Argentina,6.599,1.185295,1.440451,0.695137,0.494519,0.05974,0.109457
340,2017,Mexico,6.578,1.153184,1.210862,0.709979,0.41273,0.132774,0.12099
341,2017,Singapore,6.572,1.692278,1.353814,0.949492,0.549841,0.464308,0.345966
342,2017,Malta,6.527,1.34328,1.488412,0.821944,0.588767,0.153066,0.574731
343,2017,Uruguay,6.454,1.21756,1.412228,0.719217,0.579392,0.178062,0.175097
344,2017,Guatemala,6.454,0.872002,1.255585,0.54024,0.531311,0.077223,0.283488
345,2017,Panama,6.452,1.233748,1.373193,0.706156,0.550027,0.070984,0.210557
346,2017,France,6.442,1.430923,1.387777,0.844466,0.470222,0.172502,0.129762
347,2017,Thailand,6.424,1.127869,1.425792,0.647239,0.580201,0.031613,0.572123
348,2017,Taiwan Province of China,6.422,1.433627,1.384565,0.793984,0.361467,0.063829,0.25836
349,2017,Spain,6.403,1.384398,1.532091,0.888961,0.408781,0.070914,0.190134
350,2017,Qatar,6.375,1.870766,1.274297,0.710098,0.604131,0.439299,0.330474
351,2017,Colombia,6.357,1.070622,1.402183,0.595028,0.477487,0.046669,0.149014
352,2017,Saudi Arabia,6.344,1.530624,1.286678,0.590148,0.449751,0.273432,0.147616
353,2017,Trinidad and Tobago,6.168,1.361356,1.380229,0.519983,0.518631,0.008965,0.325296
354,2017,Kuwait,6.105,1.632952,1.259699,0.632106,0.496338,0.21516,0.22829
355,2017,Slovakia,6.098,1.325394,1.505059,0.712733,0.295817,0.024211,0.136544
356,2017,Bahrain,6.087,1.488412,1.32311,0.653133,0.536747,0.257042,0.172668
357,2017,Malaysia,6.084,1.291215,1.284646,0.618784,0.402265,0.065601,0.416609
358,2017,Nicaragua,6.071,0.737299,1.287216,0.653096,0.447552,0.130688,0.301674
359,2017,Ecuador,6.008,1.00082,1.286169,0.685636,0.455198,0.140135,0.150112
360,2017,El Salvador,6.003,0.909784,1.182125,0.596019,0.432453,0.089981,0.078258
361,2017,Poland,5.973,1.291788,1.445712,0.699475,0.520342,0.059308,0.158466
362,2017,Uzbekistan,5.971,0.786441,1.548969,0.498273,0.658249,0.246528,0.415984
363,2017,Italy,5.964,1.395067,1.444923,0.853144,0.256451,0.028028,0.17279
364,2017,Russia,5.963,1.281778,1.469282,0.547349,0.373783,0.032963,0.052264
365,2017,Belize,5.956,0.907975,1.081418,0.450192,0.547509,0.096581,0.240016
366,2017,Japan,5.92,1.416915,1.436338,0.913476,0.505626,0.163761,0.120573
367,2017,Lithuania,5.902,1.314582,1.473516,0.62895,0.234232,0.011866,0.010165
368,2017,Algeria,5.872,1.091864,1.146217,0.617585,0.233336,0.146096,0.069437
369,2017,Latvia,5.85,1.260749,1.404715,0.638567,0.325708,0.073843,0.153075
370,2017,South Korea,5.838,1.401678,1.128274,0.900214,0.257922,0.063283,0.206674
371,2017,Moldova,5.838,0.728871,1.251826,0.589465,0.240729,0.010091,0.208779
372,2017,Romania,5.825,1.217684,1.150091,0.685158,0.457004,0.004388,0.13352
373,2017,Bolivia,5.823,0.833757,1.227619,0.47363,0.558733,0.060478,0.225561
374,2017,Turkmenistan,5.822,1.130777,1.493149,0.437726,0.418272,0.25927,0.249925
375,2017,Kazakhstan,5.819,1.284556,1.384369,0.606042,0.437454,0.119283,0.201964
376,2017,North Cyprus,5.81,1.346911,1.186303,0.834647,0.471204,0.155353,0.266846
377,2017,Slovenia,5.758,1.341206,1.452519,0.790828,0.572576,0.045129,0.242649
378,2017,Peru,5.715,1.035225,1.21877,0.630166,0.450003,0.047049,0.12682
379,2017,Mauritius,5.629,1.189396,1.209561,0.638007,0.491247,0.042182,0.360934
380,2017,Cyprus,5.621,1.355938,1.131363,0.844715,0.355112,0.041238,0.271254
381,2017,Estonia,5.611,1.320879,1.476671,0.695168,0.479131,0.183249,0.098891
382,2017,Belarus,5.569,1.156558,1.444945,0.637714,0.2954,0.156314,0.155138
383,2017,Libya,5.525,1.101803,1.357564,0.520169,0.465733,0.09261,0.152074
384,2017,Turkey,5.5,1.198274,1.337753,0.637606,0.300741,0.099672,0.046693
385,2017,Paraguay,5.493,0.932537,1.507285,0.579251,0.473508,0.091066,0.224151
386,2017,"Hong Kong S.A.R., China",5.472,1.551675,1.262791,0.943062,0.490969,0.293934,0.374466
387,2017,Philippines,5.43,0.857699,1.253918,0.468009,0.585215,0.099332,0.193513
388,2017,Serbia,5.395,1.069318,1.25819,0.650785,0.208716,0.040904,0.220126
389,2017,Jordan,5.336,0.991012,1.239089,0.60459,0.418421,0.119803,0.17217
390,2017,Hungary,5.324,1.286012,1.343133,0.687763,0.175864,0.036637,0.078402
391,2017,Jamaica,5.311,0.925579,1.368218,0.641022,0.474307,0.055268,0.233818
392,2017,Croatia,5.293,1.222556,0.967983,0.701289,0.255772,0.043103,0.248003
393,2017,Kosovo,5.279,0.951484,1.137854,0.541452,0.260288,0.057472,0.319931
394,2017,China,5.273,1.081166,1.160837,0.741416,0.472788,0.022794,0.028807
395,2017,Pakistan,5.269,0.726884,0.672691,0.402048,0.235215,0.124348,0.315446
396,2017,Indonesia,5.262,0.995539,1.274445,0.492346,0.443323,0.015317,0.611705
397,2017,Venezuela,5.25,1.128431,1.431338,0.617144,0.153997,0.064491,0.06502
398,2017,Montenegro,5.237,1.121129,1.238376,0.667465,0.194989,0.088174,0.197911
399,2017,Morocco,5.235,0.878115,0.774864,0.597711,0.408158,0.087763,0.03221
400,2017,Azerbaijan,5.234,1.153602,1.1524,0.540776,0.398156,0.180988,0.045269
401,2017,Dominican Republic,5.23,1.079374,1.402417,0.574874,0.55259,0.113945,0.186968
402,2017,Greece,5.227,1.289487,1.239415,0.810199,0.095731,0.04329,0
403,2017,Lebanon,5.225,1.074988,1.129624,0.735081,0.288516,0.037514,0.264451
404,2017,Portugal,5.195,1.315175,1.367043,0.795844,0.498465,0.015869,0.095103
405,2017,Bosnia and Herzegovina,5.182,0.982409,1.069336,0.705186,0.204403,0,0.328867
406,2017,Honduras,5.181,0.730573,1.143945,0.582569,0.34808,0.073345,0.236189
407,2017,Macedonia,5.175,1.064578,1.207893,0.644948,0.325906,0.060278,0.253761
408,2017,Somalia,5.151,0.022643,0.721151,0.113989,0.602127,0.28241,0.291631
409,2017,Vietnam,5.074,0.788548,1.277491,0.652169,0.571056,0.087633,0.234968
410,2017,Nigeria,5.074,0.783756,1.21577,0.056916,0.394953,0.026122,0.230947
411,2017,Tajikistan,5.041,0.524714,1.271463,0.529235,0.471567,0.146377,0.248998
412,2017,Bhutan,5.011,0.885416,1.340127,0.495879,0.501538,0.17338,0.474055
413,2017,Kyrgyzstan,5.004,0.59622,1.394239,0.553458,0.454943,0.039439,0.42858
414,2017,Nepal,4.962,0.47982,1.179283,0.504131,0.440306,0.072976,0.394096
415,2017,Mongolia,4.955,1.027236,1.493011,0.557783,0.394144,0.032902,0.338464
416,2017,South Africa,4.829,1.054699,1.384789,0.18708,0.479247,0.072509,0.139362
417,2017,Tunisia,4.805,1.007266,0.868351,0.613212,0.289681,0.086723,0.049693
418,2017,Palestinian Territories,4.775,0.716249,1.155647,0.565667,0.254711,0.089283,0.114173
419,2017,Egypt,4.735,0.989702,0.997471,0.520187,0.28211,0.114381,0.128631
420,2017,Bulgaria,4.714,1.161459,1.434379,0.708218,0.289232,0.011052,0.113178
421,2017,Sierra Leone,4.709,0.368421,0.984136,0.005565,0.318698,0.071095,0.293041
422,2017,Cameroon,4.695,0.564305,0.946018,0.132892,0.430389,0.051307,0.236298
423,2017,Iran,4.692,1.156873,0.711551,0.639333,0.249323,0.048761,0.387243
424,2017,Albania,4.644,0.996193,0.803685,0.73116,0.381499,0.039864,0.201313
425,2017,Bangladesh,4.608,0.586683,0.735132,0.533241,0.478357,0.123718,0.172255
426,2017,Namibia,4.574,0.964434,1.098471,0.338612,0.520304,0.093147,0.077134
427,2017,Kenya,4.553,0.560479,1.067951,0.309988,0.452764,0.064641,0.44486
428,2017,Mozambique,4.55,0.234306,0.870701,0.106654,0.480791,0.179436,0.322228
429,2017,Myanmar,4.545,0.367111,1.123236,0.397523,0.514492,0.188816,0.838075
430,2017,Senegal,4.535,0.479309,1.179692,0.409363,0.377922,0.11546,0.183469
431,2017,Zambia,4.514,0.636407,1.003187,0.257836,0.461603,0.078214,0.24958
432,2017,Iraq,4.497,1.10271,0.978613,0.50118,0.288556,0.107216,0.199637
433,2017,Gabon,4.465,1.19821,1.15562,0.356579,0.312329,0.076047,0.043785
434,2017,Ethiopia,4.46,0.339234,0.864669,0.35341,0.408843,0.165456,0.312651
435,2017,Sri Lanka,4.44,1.00985,1.259976,0.625131,0.561213,0.073654,0.490864
436,2017,Armenia,4.376,0.900597,1.007484,0.637524,0.198303,0.026674,0.083488
437,2017,India,4.315,0.792221,0.754373,0.455428,0.469987,0.092227,0.231538
438,2017,Mauritania,4.292,0.648457,1.272031,0.285349,0.096098,0.136957,0.20187
439,2017,Congo (Brazzaville),4.291,0.808964,0.832044,0.289957,0.435026,0.079618,0.120852
440,2017,Georgia,4.286,0.950613,0.570615,0.649547,0.30941,0.251667,0.054009
441,2017,Congo (Kinshasa),4.28,0.092102,1.229023,0.191407,0.235961,0.060241,0.246456
442,2017,Mali,4.19,0.47618,1.281473,0.169366,0.306614,0.10497,0.183354
443,2017,Ivory Coast,4.18,0.603049,0.90478,0.048642,0.447706,0.130062,0.201237
444,2017,Cambodia,4.168,0.601765,1.006238,0.429783,0.633376,0.068106,0.385923
445,2017,Sudan,4.139,0.659517,1.214009,0.290921,0.014996,0.089848,0.182317
446,2017,Ghana,4.12,0.667225,0.873665,0.295638,0.423026,0.025336,0.256924
447,2017,Ukraine,4.096,0.894652,1.394538,0.575904,0.122975,0.023029,0.270061
448,2017,Uganda,4.081,0.381431,1.129828,0.217633,0.443186,0.05707,0.325766
449,2017,Burkina Faso,4.032,0.350228,1.04328,0.215844,0.324368,0.120328,0.250865
450,2017,Niger,4.028,0.161925,0.993025,0.268505,0.363659,0.138573,0.228674
451,2017,Malawi,3.97,0.233442,0.512569,0.31509,0.466915,0.072712,0.28717
452,2017,Chad,3.936,0.438013,0.953856,0.041135,0.162342,0.053582,0.216114
453,2017,Zimbabwe,3.875,0.375847,1.083096,0.196764,0.336384,0.095375,0.189143
454,2017,Lesotho,3.808,0.521021,1.190095,0,0.390661,0.119095,0.157497
455,2017,Angola,3.795,0.858428,1.104412,0.049869,0,0.06972,0.097926
456,2017,Afghanistan,3.794,0.401477,0.581543,0.180747,0.10618,0.061158,0.311871
457,2017,Botswana,3.766,1.122094,1.221555,0.341756,0.505196,0.098583,0.099348
458,2017,Benin,3.657,0.431085,0.4353,0.20993,0.425963,0.060929,0.207948
459,2017,Madagascar,3.644,0.305809,0.91302,0.375223,0.189197,0.067232,0.208733
460,2017,Haiti,3.603,0.36861,0.64045,0.277321,0.03037,0.099872,0.489204
461,2017,Yemen,3.593,0.591683,0.935382,0.310081,0.249464,0.056767,0.104125
462,2017,South Sudan,3.591,0.397249,0.601323,0.163486,0.147062,0.116794,0.285671
463,2017,Liberia,3.533,0.119042,0.872118,0.229918,0.332881,0.038948,0.26655
464,2017,Guinea,3.507,0.24455,0.791245,0.194129,0.348588,0.110938,0.264815
465,2017,Togo,3.495,0.305445,0.431883,0.247106,0.380426,0.095665,0.196896
466,2017,Rwanda,3.471,0.368746,0.945707,0.326425,0.581844,0.45522,0.252756
467,2017,Syria,3.462,0.777153,0.396103,0.500533,0.081539,0.151347,0.493664
468,2017,Tanzania,3.349,0.511136,1.04199,0.364509,0.390018,0.066035,0.354256
469,2017,Burundi,2.905,0.091623,0.629794,0.151611,0.059901,0.084148,0.204435
470,2017,Central African Republic,2.693,0,0,0.018773,0.270842,0.056565,0.280876
471,2018,Finland,7.632,1.305,1.592,0.874,0.681,0.393,0.202
472,2018,Norway,7.594,1.456,1.582,0.861,0.686,0.34,0.286
473,2018,Denmark,7.555,1.351,1.59,0.868,0.683,0.408,0.284
474,2018,Iceland,7.495,1.343,1.644,0.914,0.677,0.138,0.353
475,2018,Switzerland,7.487,1.42,1.549,0.927,0.66,0.357,0.256
476,2018,Netherlands,7.441,1.361,1.488,0.878,0.638,0.295,0.333
477,2018,Canada,7.328,1.33,1.532,0.896,0.653,0.291,0.321
478,2018,New Zealand,7.324,1.268,1.601,0.876,0.669,0.389,0.365
479,2018,Sweden,7.314,1.355,1.501,0.913,0.659,0.383,0.285
480,2018,Australia,7.272,1.34,1.573,0.91,0.647,0.302,0.361
481,2018,United Kingdom,7.19,1.244,1.433,0.888,0.464,0.082,0.262
482,2018,Austria,7.139,1.341,1.504,0.891,0.617,0.224,0.242
483,2018,Costa Rica,7.072,1.01,1.459,0.817,0.632,0.101,0.143
484,2018,Ireland,6.977,1.448,1.583,0.876,0.614,0.306,0.307
485,2018,Germany,6.965,1.34,1.474,0.861,0.586,0.28,0.273
486,2018,Belgium,6.927,1.324,1.483,0.894,0.583,0.24,0.188
487,2018,Luxembourg,6.91,1.576,1.52,0.896,0.632,0.321,0.196
488,2018,United States,6.886,1.398,1.471,0.819,0.547,0.133,0.291
489,2018,Israel,6.814,1.301,1.559,0.883,0.533,0.272,0.354
490,2018,United Arab Emirates,6.774,2.096,0.776,0.67,0.284,0,0.186
491,2018,Czech Republic,6.711,1.233,1.489,0.854,0.543,0.034,0.064
492,2018,Malta,6.627,1.27,1.525,0.884,0.645,0.142,0.376
493,2018,France,6.489,1.293,1.466,0.908,0.52,0.176,0.098
494,2018,Mexico,6.488,1.038,1.252,0.761,0.479,0.095,0.069
495,2018,Chile,6.476,1.131,1.331,0.808,0.431,0.061,0.197
496,2018,Taiwan,6.441,1.365,1.436,0.857,0.418,0.078,0.151
497,2018,Panama,6.43,1.112,1.438,0.759,0.597,0.063,0.125
498,2018,Brazil,6.419,0.986,1.474,0.675,0.493,0.088,0.11
499,2018,Argentina,6.388,1.073,1.468,0.744,0.57,0.054,0.062
500,2018,Guatemala,6.382,0.781,1.268,0.608,0.604,0.071,0.179
501,2018,Uruguay,6.379,1.093,1.459,0.771,0.625,0.155,0.13
502,2018,Qatar,6.374,1.649,1.303,0.748,0.654,0.171,0.256
503,2018,Saudi Arabia,6.371,1.379,1.331,0.633,0.509,0.127,0.098
504,2018,Singapore,6.343,1.529,1.451,1.008,0.631,0.457,0.261
505,2018,Malaysia,6.322,1.161,1.258,0.669,0.356,0.059,0.311
506,2018,Spain,6.31,1.251,1.538,0.965,0.449,0.074,0.142
507,2018,Colombia,6.26,0.96,1.439,0.635,0.531,0.039,0.099
508,2018,Trinidad & Tobago,6.192,1.223,1.492,0.564,0.575,0.019,0.171
509,2018,Slovakia,6.173,1.21,1.537,0.776,0.354,0.014,0.118
510,2018,El Salvador,6.167,0.806,1.231,0.639,0.461,0.082,0.065
511,2018,Nicaragua,6.141,0.668,1.319,0.7,0.527,0.128,0.208
512,2018,Poland,6.123,1.176,1.448,0.781,0.546,0.064,0.108
513,2018,Bahrain,6.105,1.338,1.366,0.698,0.594,0.123,0.243
514,2018,Uzbekistan,6.096,0.719,1.584,0.605,0.724,0.259,0.328
515,2018,Kuwait,6.083,1.474,1.301,0.675,0.554,0.106,0.167
516,2018,Thailand,6.072,1.016,1.417,0.707,0.637,0.029,0.364
517,2018,Italy,6,1.264,1.501,0.946,0.281,0.028,0.137
518,2018,Ecuador,5.973,0.889,1.33,0.736,0.556,0.12,0.114
519,2018,Belize,5.956,0.807,1.101,0.474,0.593,0.089,0.183
520,2018,Lithuania,5.952,1.197,1.527,0.716,0.35,0.006,0.026
521,2018,Slovenia,5.948,1.219,1.506,0.856,0.633,0.051,0.16
522,2018,Romania,5.945,1.116,1.219,0.726,0.528,0.001,0.088
523,2018,Latvia,5.933,1.148,1.454,0.671,0.363,0.066,0.092
524,2018,Japan,5.915,1.294,1.462,0.988,0.553,0.15,0.079
525,2018,Mauritius,5.891,1.09,1.387,0.684,0.584,0.05,0.245
526,2018,Jamaica,5.89,0.819,1.493,0.693,0.575,0.031,0.096
527,2018,South Korea,5.875,1.266,1.204,0.955,0.244,0.051,0.175
528,2018,Northern Cyprus,5.835,1.229,1.211,0.909,0.495,0.154,0.179
529,2018,Russia,5.81,1.151,1.479,0.599,0.399,0.025,0.065
530,2018,Kazakhstan,5.79,1.143,1.516,0.631,0.454,0.121,0.148
531,2018,Cyprus,5.762,1.229,1.191,0.909,0.423,0.035,0.202
532,2018,Bolivia,5.752,0.751,1.223,0.508,0.606,0.054,0.141
533,2018,Estonia,5.739,1.2,1.532,0.737,0.553,0.174,0.086
534,2018,Paraguay,5.681,0.835,1.522,0.615,0.541,0.074,0.162
535,2018,Peru,5.663,0.934,1.249,0.674,0.53,0.034,0.092
536,2018,Kosovo,5.662,0.855,1.23,0.578,0.448,0.023,0.274
537,2018,Moldova,5.64,0.657,1.301,0.62,0.232,0,0.171
538,2018,Turkmenistan,5.636,1.016,1.533,0.517,0.417,0.037,0.199
539,2018,Hungary,5.62,1.171,1.401,0.732,0.259,0.022,0.061
540,2018,Libya,5.566,0.985,1.35,0.553,0.496,0.148,0.116
541,2018,Philippines,5.524,0.775,1.312,0.513,0.643,0.105,0.12
542,2018,Honduras,5.504,0.62,1.205,0.622,0.459,0.074,0.197
543,2018,Belarus,5.483,1.039,1.498,0.7,0.307,0.154,0.101
544,2018,Turkey,5.483,1.148,1.38,0.686,0.324,0.109,0.106
545,2018,Pakistan,5.472,0.652,0.81,0.424,0.334,0.113,0.216
546,2018,Hong Kong,5.43,1.405,1.29,1.03,0.524,0.291,0.246
547,2018,Portugal,5.41,1.188,1.429,0.884,0.562,0.017,0.055
548,2018,Serbia,5.398,0.975,1.369,0.685,0.288,0.043,0.134
549,2018,Greece,5.358,1.154,1.202,0.879,0.131,0.044,0
550,2018,Lebanon,5.358,0.965,1.179,0.785,0.503,0.136,0.214
551,2018,Montenegro,5.347,1.017,1.279,0.729,0.259,0.081,0.111
552,2018,Croatia,5.321,1.115,1.161,0.737,0.38,0.039,0.12
553,2018,Dominican Republic,5.302,0.982,1.441,0.614,0.578,0.106,0.12
554,2018,Algeria,5.295,0.979,1.154,0.687,0.077,0.135,0.055
555,2018,Morocco,5.254,0.779,0.797,0.669,0.46,0.074,0.026
556,2018,China,5.246,0.989,1.142,0.799,0.597,0.103,0.029
557,2018,Azerbaijan,5.201,1.024,1.161,0.603,0.43,0.176,0.031
558,2018,Tajikistan,5.199,0.474,1.166,0.598,0.292,0.034,0.187
559,2018,Macedonia,5.185,0.959,1.239,0.691,0.394,0.052,0.173
560,2018,Jordan,5.161,0.822,1.265,0.645,0.468,0.134,0.13
561,2018,Nigeria,5.155,0.689,1.172,0.048,0.462,0.032,0.201
562,2018,Kyrgyzstan,5.131,0.53,1.416,0.594,0.54,0.035,0.281
563,2018,Bosnia and Herzegovina,5.129,0.915,1.078,0.758,0.28,0,0.216
564,2018,Mongolia,5.125,0.914,1.517,0.575,0.395,0.032,0.253
565,2018,Vietnam,5.103,0.715,1.365,0.702,0.618,0.079,0.177
566,2018,Indonesia,5.093,0.899,1.215,0.522,0.538,0.018,0.484
567,2018,Bhutan,5.082,0.796,1.335,0.527,0.541,0.171,0.364
568,2018,Somalia,4.982,0,0.712,0.115,0.674,0.282,0.238
569,2018,Cameroon,4.975,0.535,0.891,0.182,0.454,0.043,0.183
570,2018,Bulgaria,4.933,1.054,1.515,0.712,0.359,0.009,0.064
571,2018,Nepal,4.88,0.425,1.228,0.539,0.526,0.078,0.302
572,2018,Venezuela,4.806,0.996,1.469,0.657,0.133,0.052,0.056
573,2018,Gabon,4.758,1.036,1.164,0.404,0.356,0.052,0.032
574,2018,Palestinian Territories,4.743,0.642,1.217,0.602,0.266,0.076,0.086
575,2018,South Africa,4.724,0.94,1.41,0.33,0.516,0.056,0.103
576,2018,Iran,4.707,1.059,0.771,0.691,0.459,0.129,0.282
577,2018,Ivory Coast,4.671,0.541,0.872,0.08,0.467,0.103,0.146
578,2018,Ghana,4.657,0.592,0.896,0.337,0.499,0.029,0.212
579,2018,Senegal,4.631,0.429,1.117,0.433,0.406,0.082,0.138
580,2018,Laos,4.623,0.72,1.034,0.441,0.626,0.174,0.23
581,2018,Tunisia,4.592,0.9,0.906,0.69,0.271,0.063,0.04
582,2018,Albania,4.586,0.916,0.817,0.79,0.419,0.032,0.149
583,2018,Sierra Leone,4.571,0.256,0.813,0,0.355,0.053,0.238
584,2018,Congo (Brazzaville),4.559,0.682,0.811,0.343,0.514,0.077,0.091
585,2018,Bangladesh,4.5,0.532,0.85,0.579,0.58,0.144,0.153
586,2018,Sri Lanka,4.471,0.918,1.314,0.672,0.585,0.05,0.307
587,2018,Iraq,4.456,1.01,0.971,0.536,0.304,0.095,0.148
588,2018,Mali,4.447,0.37,1.233,0.152,0.367,0.056,0.139
589,2018,Namibia,4.441,0.874,1.281,0.365,0.519,0.064,0.051
590,2018,Cambodia,4.433,0.549,1.088,0.457,0.696,0.065,0.256
591,2018,Burkina Faso,4.424,0.314,1.097,0.254,0.312,0.128,0.175
592,2018,Egypt,4.419,0.885,1.025,0.553,0.312,0.107,0.092
593,2018,Mozambique,4.417,0.198,0.902,0.173,0.531,0.158,0.206
594,2018,Kenya,4.41,0.493,1.048,0.454,0.504,0.055,0.352
595,2018,Zambia,4.377,0.562,1.047,0.295,0.503,0.082,0.221
596,2018,Mauritania,4.356,0.557,1.245,0.292,0.129,0.093,0.134
597,2018,Ethiopia,4.35,0.308,0.95,0.391,0.452,0.146,0.22
598,2018,Georgia,4.34,0.853,0.592,0.643,0.375,0.215,0.038
599,2018,Armenia,4.321,0.816,0.99,0.666,0.26,0.028,0.077
600,2018,Myanmar,4.308,0.682,1.174,0.429,0.58,0.178,0.598
601,2018,Chad,4.301,0.358,0.907,0.053,0.189,0.06,0.181
602,2018,Congo (Kinshasa),4.245,0.069,1.136,0.204,0.312,0.052,0.197
603,2018,India,4.19,0.721,0.747,0.485,0.539,0.093,0.172
604,2018,Niger,4.166,0.131,0.867,0.221,0.39,0.099,0.175
605,2018,Uganda,4.161,0.322,1.09,0.237,0.45,0.061,0.259
606,2018,Benin,4.141,0.378,0.372,0.24,0.44,0.067,0.163
607,2018,Sudan,4.139,0.605,1.24,0.312,0.016,0.082,0.134
608,2018,Ukraine,4.103,0.793,1.413,0.609,0.163,0.011,0.187
609,2018,Togo,3.999,0.259,0.474,0.253,0.434,0.101,0.158
610,2018,Guinea,3.964,0.344,0.792,0.211,0.394,0.094,0.185
611,2018,Lesotho,3.808,0.472,1.215,0.079,0.423,0.112,0.116
612,2018,Angola,3.795,0.73,1.125,0.269,0,0.061,0.079
613,2018,Madagascar,3.774,0.262,0.908,0.402,0.221,0.049,0.155
614,2018,Zimbabwe,3.692,0.357,1.094,0.248,0.406,0.099,0.132
615,2018,Afghanistan,3.632,0.332,0.537,0.255,0.085,0.036,0.191
616,2018,Botswana,3.59,1.017,1.174,0.417,0.557,0.092,0.042
617,2018,Malawi,3.587,0.186,0.541,0.306,0.531,0.08,0.21
618,2018,Haiti,3.582,0.315,0.714,0.289,0.025,0.104,0.392
619,2018,Liberia,3.495,0.076,0.858,0.267,0.419,0.03,0.206
620,2018,Syria,3.462,0.689,0.382,0.539,0.088,0.144,0.376
621,2018,Rwanda,3.408,0.332,0.896,0.4,0.636,0.444,0.2
622,2018,Yemen,3.355,0.442,1.073,0.343,0.244,0.064,0.083
623,2018,Tanzania,3.303,0.455,0.991,0.381,0.481,0.097,0.27
624,2018,South Sudan,3.254,0.337,0.608,0.177,0.112,0.106,0.224
625,2018,Central African Republic,3.083,0.024,0,0.01,0.305,0.038,0.218
626,2018,Burundi,2.905,0.091,0.627,0.145,0.065,0.076,0.149
627,2019,Finland,7.769,1.34,1.587,0.986,0.596,0.393,0.153
628,2019,Denmark,7.6,1.383,1.573,0.996,0.592,0.41,0.252
629,2019,Norway,7.554,1.488,1.582,1.028,0.603,0.341,0.271
630,2019,Iceland,7.494,1.38,1.624,1.026,0.591,0.118,0.354
631,2019,Netherlands,7.488,1.396,1.522,0.999,0.557,0.298,0.322
632,2019,Switzerland,7.48,1.452,1.526,1.052,0.572,0.343,0.263
633,2019,Sweden,7.343,1.387,1.487,1.009,0.574,0.373,0.267
634,2019,New Zealand,7.307,1.303,1.557,1.026,0.585,0.38,0.33
635,2019,Canada,7.278,1.365,1.505,1.039,0.584,0.308,0.285
636,2019,Austria,7.246,1.376,1.475,1.016,0.532,0.226,0.244
637,2019,Australia,7.228,1.372,1.548,1.036,0.557,0.29,0.332
638,2019,Costa Rica,7.167,1.034,1.441,0.963,0.558,0.093,0.144
639,2019,Israel,7.139,1.276,1.455,1.029,0.371,0.082,0.261
640,2019,Luxembourg,7.09,1.609,1.479,1.012,0.526,0.316,0.194
641,2019,United Kingdom,7.054,1.333,1.538,0.996,0.45,0.278,0.348
642,2019,Ireland,7.021,1.499,1.553,0.999,0.516,0.31,0.298
643,2019,Germany,6.985,1.373,1.454,0.987,0.495,0.265,0.261
644,2019,Belgium,6.923,1.356,1.504,0.986,0.473,0.21,0.16
645,2019,United States,6.892,1.433,1.457,0.874,0.454,0.128,0.28
646,2019,Czech Republic,6.852,1.269,1.487,0.92,0.457,0.036,0.046
647,2019,United Arab Emirates,6.825,1.503,1.31,0.825,0.598,0.182,0.262
648,2019,Malta,6.726,1.3,1.52,0.999,0.564,0.151,0.375
649,2019,Mexico,6.595,1.07,1.323,0.861,0.433,0.073,0.074
650,2019,France,6.592,1.324,1.472,1.045,0.436,0.183,0.111
651,2019,Taiwan,6.446,1.368,1.43,0.914,0.351,0.097,0.242
652,2019,Chile,6.444,1.159,1.369,0.92,0.357,0.056,0.187
653,2019,Guatemala,6.436,0.8,1.269,0.746,0.535,0.078,0.175
654,2019,Saudi Arabia,6.375,1.403,1.357,0.795,0.439,0.132,0.08
655,2019,Qatar,6.374,1.684,1.313,0.871,0.555,0.167,0.22
656,2019,Spain,6.354,1.286,1.484,1.062,0.362,0.079,0.153
657,2019,Panama,6.321,1.149,1.442,0.91,0.516,0.054,0.109
658,2019,Brazil,6.3,1.004,1.439,0.802,0.39,0.086,0.099
659,2019,Uruguay,6.293,1.124,1.465,0.891,0.523,0.15,0.127
660,2019,Singapore,6.262,1.572,1.463,1.141,0.556,0.453,0.271
661,2019,El Salvador,6.253,0.794,1.242,0.789,0.43,0.074,0.093
662,2019,Italy,6.223,1.294,1.488,1.039,0.231,0.03,0.158
663,2019,Bahrain,6.199,1.362,1.368,0.871,0.536,0.11,0.255
664,2019,Slovakia,6.198,1.246,1.504,0.881,0.334,0.014,0.121
665,2019,Trinidad & Tobago,6.192,1.231,1.477,0.713,0.489,0.016,0.185
666,2019,Poland,6.182,1.206,1.438,0.884,0.483,0.05,0.117
667,2019,Uzbekistan,6.174,0.745,1.529,0.756,0.631,0.24,0.322
668,2019,Lithuania,6.149,1.238,1.515,0.818,0.291,0.042,0.043
669,2019,Colombia,6.125,0.985,1.41,0.841,0.47,0.034,0.099
670,2019,Slovenia,6.118,1.258,1.523,0.953,0.564,0.057,0.144
671,2019,Nicaragua,6.105,0.694,1.325,0.835,0.435,0.127,0.2
672,2019,Kosovo,6.1,0.882,1.232,0.758,0.489,0.006,0.262
673,2019,Argentina,6.086,1.092,1.432,0.881,0.471,0.05,0.066
674,2019,Romania,6.07,1.162,1.232,0.825,0.462,0.005,0.083
675,2019,Cyprus,6.046,1.263,1.223,1.042,0.406,0.041,0.19
676,2019,Ecuador,6.028,0.912,1.312,0.868,0.498,0.087,0.126
677,2019,Kuwait,6.021,1.5,1.319,0.808,0.493,0.097,0.142
678,2019,Thailand,6.008,1.05,1.409,0.828,0.557,0.028,0.359
679,2019,Latvia,5.94,1.187,1.465,0.812,0.264,0.064,0.075
680,2019,South Korea,5.895,1.301,1.219,1.036,0.159,0.056,0.175
681,2019,Estonia,5.893,1.237,1.528,0.874,0.495,0.161,0.103
682,2019,Jamaica,5.89,0.831,1.478,0.831,0.49,0.028,0.107
683,2019,Mauritius,5.888,1.12,1.402,0.798,0.498,0.06,0.215
684,2019,Japan,5.886,1.327,1.419,1.088,0.445,0.14,0.069
685,2019,Honduras,5.86,0.642,1.236,0.828,0.507,0.078,0.246
686,2019,Kazakhstan,5.809,1.173,1.508,0.729,0.41,0.096,0.146
687,2019,Bolivia,5.779,0.776,1.209,0.706,0.511,0.064,0.137
688,2019,Hungary,5.758,1.201,1.41,0.828,0.199,0.02,0.081
689,2019,Paraguay,5.743,0.855,1.475,0.777,0.514,0.08,0.184
690,2019,Northern Cyprus,5.718,1.263,1.252,1.042,0.417,0.162,0.191
691,2019,Peru,5.697,0.96,1.274,0.854,0.455,0.027,0.083
692,2019,Portugal,5.693,1.221,1.431,0.999,0.508,0.025,0.047
693,2019,Pakistan,5.653,0.677,0.886,0.535,0.313,0.098,0.22
694,2019,Russia,5.648,1.183,1.452,0.726,0.334,0.031,0.082
695,2019,Philippines,5.631,0.807,1.293,0.657,0.558,0.107,0.117
696,2019,Serbia,5.603,1.004,1.383,0.854,0.282,0.039,0.137
697,2019,Moldova,5.529,0.685,1.328,0.739,0.245,0,0.181
698,2019,Libya,5.525,1.044,1.303,0.673,0.416,0.152,0.133
699,2019,Montenegro,5.523,1.051,1.361,0.871,0.197,0.08,0.142
700,2019,Tajikistan,5.467,0.493,1.098,0.718,0.389,0.144,0.23
701,2019,Croatia,5.432,1.155,1.266,0.914,0.296,0.022,0.119
702,2019,Hong Kong,5.43,1.438,1.277,1.122,0.44,0.287,0.258
703,2019,Dominican Republic,5.425,1.015,1.401,0.779,0.497,0.101,0.113
704,2019,Bosnia and Herzegovina,5.386,0.945,1.212,0.845,0.212,0.006,0.263
705,2019,Turkey,5.373,1.183,1.36,0.808,0.195,0.106,0.083
706,2019,Malaysia,5.339,1.221,1.171,0.828,0.508,0.024,0.26
707,2019,Belarus,5.323,1.067,1.465,0.789,0.235,0.142,0.094
708,2019,Greece,5.287,1.181,1.156,0.999,0.067,0.034,0
709,2019,Mongolia,5.285,0.948,1.531,0.667,0.317,0.038,0.235
710,2019,North Macedonia,5.274,0.983,1.294,0.838,0.345,0.034,0.185
711,2019,Nigeria,5.265,0.696,1.111,0.245,0.426,0.041,0.215
712,2019,Kyrgyzstan,5.261,0.551,1.438,0.723,0.508,0.023,0.3
713,2019,Turkmenistan,5.247,1.052,1.538,0.657,0.394,0.028,0.244
714,2019,Algeria,5.211,1.002,1.16,0.785,0.086,0.114,0.073
715,2019,Morocco,5.208,0.801,0.782,0.782,0.418,0.076,0.036
716,2019,Azerbaijan,5.208,1.043,1.147,0.769,0.351,0.182,0.035
717,2019,Lebanon,5.197,0.987,1.224,0.815,0.216,0.027,0.166
718,2019,Indonesia,5.192,0.931,1.203,0.66,0.491,0.028,0.498
719,2019,China,5.191,1.029,1.125,0.893,0.521,0.1,0.058
720,2019,Vietnam,5.175,0.741,1.346,0.851,0.543,0.073,0.147
721,2019,Bhutan,5.082,0.813,1.321,0.604,0.457,0.167,0.37
722,2019,Cameroon,5.044,0.549,0.91,0.331,0.381,0.037,0.187
723,2019,Bulgaria,5.011,1.092,1.513,0.815,0.311,0.004,0.081
724,2019,Ghana,4.996,0.611,0.868,0.486,0.381,0.04,0.245
725,2019,Ivory Coast,4.944,0.569,0.808,0.232,0.352,0.09,0.154
726,2019,Nepal,4.913,0.446,1.226,0.677,0.439,0.089,0.285
727,2019,Jordan,4.906,0.837,1.225,0.815,0.383,0.13,0.11
728,2019,Benin,4.883,0.393,0.437,0.397,0.349,0.082,0.175
729,2019,Congo (Brazzaville),4.812,0.673,0.799,0.508,0.372,0.093,0.105
730,2019,Gabon,4.799,1.057,1.183,0.571,0.295,0.055,0.043
731,2019,Laos,4.796,0.764,1.03,0.551,0.547,0.164,0.266
732,2019,South Africa,4.722,0.96,1.351,0.469,0.389,0.055,0.13
733,2019,Albania,4.719,0.947,0.848,0.874,0.383,0.027,0.178
734,2019,Venezuela,4.707,0.96,1.427,0.805,0.154,0.047,0.064
735,2019,Cambodia,4.7,0.574,1.122,0.637,0.609,0.062,0.232
736,2019,Palestinian Territories,4.696,0.657,1.247,0.672,0.225,0.066,0.103
737,2019,Senegal,4.681,0.45,1.134,0.571,0.292,0.072,0.153
738,2019,Somalia,4.668,0,0.698,0.268,0.559,0.27,0.243
739,2019,Namibia,4.639,0.879,1.313,0.477,0.401,0.056,0.07
740,2019,Niger,4.628,0.138,0.774,0.366,0.318,0.102,0.188
741,2019,Burkina Faso,4.587,0.331,1.056,0.38,0.255,0.113,0.177
742,2019,Armenia,4.559,0.85,1.055,0.815,0.283,0.064,0.095
743,2019,Iran,4.548,1.1,0.842,0.785,0.305,0.125,0.27
744,2019,Guinea,4.534,0.38,0.829,0.375,0.332,0.086,0.207
745,2019,Georgia,4.519,0.886,0.666,0.752,0.346,0.164,0.043
746,2019,Gambia,4.516,0.308,0.939,0.428,0.382,0.167,0.269
747,2019,Kenya,4.509,0.512,0.983,0.581,0.431,0.053,0.372
748,2019,Mauritania,4.49,0.57,1.167,0.489,0.066,0.088,0.106
749,2019,Mozambique,4.466,0.204,0.986,0.39,0.494,0.138,0.197
750,2019,Tunisia,4.461,0.921,1,0.815,0.167,0.055,0.059
751,2019,Bangladesh,4.456,0.562,0.928,0.723,0.527,0.143,0.166
752,2019,Iraq,4.437,1.043,0.98,0.574,0.241,0.089,0.148
753,2019,Congo (Kinshasa),4.418,0.094,1.125,0.357,0.269,0.053,0.212
754,2019,Mali,4.39,0.385,1.105,0.308,0.327,0.052,0.153
755,2019,Sierra Leone,4.374,0.268,0.841,0.242,0.309,0.045,0.252
756,2019,Sri Lanka,4.366,0.949,1.265,0.831,0.47,0.047,0.244
757,2019,Myanmar,4.36,0.71,1.181,0.555,0.525,0.172,0.566
758,2019,Chad,4.35,0.35,0.766,0.192,0.174,0.078,0.198
759,2019,Ukraine,4.332,0.82,1.39,0.739,0.178,0.01,0.187
760,2019,Ethiopia,4.286,0.336,1.033,0.532,0.344,0.1,0.209
761,2019,Swaziland,4.212,0.811,1.149,0,0.313,0.135,0.074
762,2019,Uganda,4.189,0.332,1.069,0.443,0.356,0.06,0.252
763,2019,Egypt,4.166,0.913,1.039,0.644,0.241,0.067,0.076
764,2019,Zambia,4.107,0.578,1.058,0.426,0.431,0.087,0.247
765,2019,Togo,4.085,0.275,0.572,0.41,0.293,0.085,0.177
766,2019,India,4.015,0.755,0.765,0.588,0.498,0.085,0.2
767,2019,Liberia,3.975,0.073,0.922,0.443,0.37,0.033,0.233
768,2019,Comoros,3.973,0.274,0.757,0.505,0.142,0.078,0.275
769,2019,Madagascar,3.933,0.274,0.916,0.555,0.148,0.041,0.169
770,2019,Lesotho,3.802,0.489,1.169,0.168,0.359,0.093,0.107
771,2019,Burundi,3.775,0.046,0.447,0.38,0.22,0.18,0.176
772,2019,Zimbabwe,3.663,0.366,1.114,0.433,0.361,0.089,0.151
773,2019,Haiti,3.597,0.323,0.688,0.449,0.026,0.11,0.419
774,2019,Botswana,3.488,1.041,1.145,0.538,0.455,0.1,0.025
775,2019,Syria,3.462,0.619,0.378,0.44,0.013,0.141,0.331
776,2019,Malawi,3.41,0.191,0.56,0.495,0.443,0.089,0.218
777,2019,Yemen,3.38,0.287,1.163,0.463,0.143,0.077,0.108
778,2019,Rwanda,3.334,0.359,0.711,0.614,0.555,0.411,0.217
779,2019,Tanzania,3.231,0.476,0.885,0.499,0.417,0.147,0.276
780,2019,Afghanistan,3.203,0.35,0.517,0.361,0,0.025,0.158
781,2019,Central African Republic,3.083,0.026,0,0.105,0.225,0.035,0.235
782,2019,South Sudan,2.853,0.306,0.575,0.295,0.01,0.091,0.202
