S.No.   name    Batch    Tool
1        Naveen     x        Jenkins
2        Mohit      x        Sonarqube
3        Yamank     9           Envoy
4       Muskan      11          Airflow
5       umanath     12          kafka
6       Mohan       x           Aws-cloud