{
  "id": "n0",
  "children": [
    {
      "id": "n13",
      "labels": [
        {
          "text": "S 140"
        }
      ],
      "ports": [
        {
          "id": "s140p1",
          "width": 7,
          "height": 7,
          "layoutOptions": {
            "port.side": "WEST"
          },
          "labels": [
            {
              "text": "D-11"
            }
          ]
        },
        {
          "id": "s140p2",
          "width": 7,
          "height": 7,
          "layoutOptions": {
            "port.side": "WEST"
          }
        },
        {
          "id": "s140p3",
          "width": 7,
          "height": 7,
          "layoutOptions": {
            "port.side": "WEST"
          }
        },
        {
          "id": "s140p4",
          "width": 7,
          "height": 7,
          "layoutOptions": {
            "port.side": "WEST"
          }
        },
        {
          "id": "s140p5",
          "width": 7,
          "height": 7,
          "layoutOptions": {
            "port.side": "WEST"
          }
        },
        {
          "id": "s140p6",
          "width": 7,
          "height": 7,
          "layoutOptions": {
            "port.side": "EAST"
          }
        },
        {
          "id": "s140p7",
          "width": 7,
          "height": 7,
          "layoutOptions": {
            "port.side": "EAST"
          }
        },
        {
          "id": "s140p8",
          "width": 7,
          "height": 7,
          "layoutOptions": {
            "port.side": "EAST"
          }
        },
        {
          "id": "s140p9",
          "width": 7,
          "height": 7,
          "layoutOptions": {
            "port.side": "EAST"
          }
        }
      ],
      "layoutOptions": {
        "portConstraints": "FREE",
        "spacing.portPort": 120
      },
      "width": 80,
      "height": 230
    },
    {
      "id": "n12",
      "labels": [
        {
          "text": "E 32",
          "layoutOptions": {
            "nodeLabels.placement": "[H_LEFT, V_TOP, OUTSIDE]"
         },
          "height": 12
        }
      ],
      "ports": [
        {
          "id": "e32p1",
          "width": 7,
          "height": 7,
          "layoutOptions": {
            "port.side": "EAST"
          },
          "labels": [
            {
              "text": "west1",
              "width": 36.0,
              "height": 15.0
            },
            {
              "text": "[0]",
              "width": 15.0,
              "height": 15.0
            }
          ]
        },
        {
          "id": "e32p2",
          "width": 7,
          "height": 7,
          "layoutOptions": {
            "port.side": "EAST"
          }
        },
        {
          "id": "e32p3",
          "width": 7,
          "height": 7,
          "layoutOptions": {
            "port.side": "EAST"
          }
        },
        {
          "id": "e32p4",
          "width": 7,
          "height": 7,
          "layoutOptions": {
            "port.side": "EAST"
          }
        },
        {
          "id": "e32p5",
          "width": 7,
          "height": 7,
          "layoutOptions": {
            "port.side": "EAST"
          }
        },
        {
          "id": "e32p6",
          "width": 7,
          "height": 7,
          "layoutOptions": {
            "port.side": "EAST"
          }
        },
        {
          "id": "e32p7",
          "width": 7,
          "height": 7,
          "layoutOptions": {
            "port.side": "EAST"
          }
        },
        {
          "id": "e32p8",
          "width": 7,
          "height": 7,
          "layoutOptions": {
            "port.side": "EAST"
          }
        },
        {
          "id": "e32p9",
          "width": 7,
          "height": 7,
          "layoutOptions": {
            "port.side": "EAST"
          }
        }
      ],
      "layoutOptions": {
        "portConstraints": "FREE"
      },
      "width": 100,
      "height": 370
    },
    {
      "id": "n14",
      "labels": [
        {
          "text": "C 380",
          "layoutOptions": {
            "nodeLabels.placement": "[H_LEFT, V_TOP, OUTSIDE]"
          }
        }
      ],
      "ports": [
        {
          "id": "c380p1",
          "width": 15,
          "height": 15
        }
      ],
      "layoutOptions": {
        "portConstraints": "FREE"
      },
      "width": 80,
      "height": 80
    },
    {
      "id": "n16",
      "labels": [
        {
          "text": "P2"
        }
      ],
      "ports": [
        {
          "id": "p2p1",
          "width": 7,
          "height": 7,
          "layoutOptions": {
            "port.side": "WEST"
          }
        },
        {
          "id": "p2p2",
          "width": 7,
          "height": 7,
          "layoutOptions": {
            "port.side": "WEST"
          }
        },
        {
          "id": "p2p3",
          "width": 7,
          "height": 7,
          "layoutOptions": {
            "port.side": "WEST"
          }
        },
        {
          "id": "p2p4",
          "width": 7,
          "height": 7,
          "layoutOptions": {
            "port.side": "WEST"
          }
        },
        {
          "id": "p2p5",
          "width": 7,
          "height": 7,
          "layoutOptions": {
            "port.side": "WEST"
          }
        },
        {
          "id": "p2p6",
          "width": 7,
          "height": 7,
          "layoutOptions": {
            "port.side": "EAST"
          }
        },
        {
          "id": "p2p7",
          "width": 7,
          "height": 7,
          "layoutOptions": {
            "port.side": "EAST"
          }
        },
        {
          "id": "p2p8",
          "width": 7,
          "height": 7,
          "layoutOptions": {
            "port.side": "EAST"
          }
        },
        {
          "id": "p2p9",
          "width": 7,
          "height": 7,
          "layoutOptions": {
            "port.side": "EAST"
          }
        },
        {
          "id": "p2p10",
          "width": 7,
          "height": 7,
          "layoutOptions": {
            "port.side": "EAST"
          }
        },
        {
          "id": "p2p11",
          "width": 7,
          "height": 7,
          "layoutOptions": {
            "port.side": "EAST"
          }
        },
        {
          "id": "p2p12",
          "width": 7,
          "height": 7,
          "layoutOptions": {
            "port.side": "EAST"
          }
        }
      ],
      "layoutOptions": {
        "portConstraints": "FREE"
      },
      "width": 90,
      "height": 260
    },
    {
      "id": "n17",
      "labels": [
        {
          "text": "C 274",
          "layoutOptions": {
            "nodeLabels.placement": "[H_LEFT, V_TOP, OUTSIDE]"
          }
        }
      ],
      "ports": [
        {
          "id": "c274p1",
          "width": 7,
          "height": 7
        }
      ],
      "layoutOptions": {
        "portConstraints": "FREE"
      },
      "width": 80,
      "height": 80
    },
    {
      "id": "n18",
      "labels": [
        {
          "text": "G1"
        }
      ],
      "ports": [
        {
          "id": "g1p1",
          "width": 7,
          "height": 7
        }
      ],
      "layoutOptions": {
        "portConstraints": "FREE"
      },
      "width": 80,
      "height": 80
    },
    {
      "id": "n19",
      "labels": [
        {
          "text": "G15"
        }
      ],
      "ports": [
        {
          "id": "g15p1",
          "width": 7,
          "height": 7,
          "port.Side": "NORTH"
        }
      ],
      "layoutOptions": {
        "portConstraints": "FREE"
      },
      "width": 80,
      "height": 80
    }
  ],
  "edges": [
    {
      "id": "e1",
      "sources": [
        "e32p1"
      ],
      "targets": [
        "s140p1"
      ]
    },
    {
      "id": "e2",
      "sources": [
        "e32p2"
      ],
      "targets": [
        "s140p2"
      ]
    },
    {
      "id": "e3",
      "sources": [
        "e32p3"
      ],
      "targets": [
        "s140p3"
      ]
    },
    {
      "id": "e4",
      "sources": [
        "e32p4"
      ],
      "targets": [
        "s140p4"
      ]
    },
    {
      "id": "e5",
      "sources": [
        "e32p5"
      ],
      "targets": [
        "s140p5"
      ]
    },
    {
      "id": "e6",
      "sources": [
        "e32p6"
      ],
      "targets": [
        "p2p1"
      ]
    },
    {
      "id": "e7",
      "sources": [
        "e32p7"
      ],
      "targets": [
        "p2p2"
      ],
      "layoutOptions": [{
        "colors": [
          { "offset": "0%", "color": "red" },
          { "offset": "0%", "color": "blue" }
        ]
      }]
    },
    {
      "id": "e8",
      "sources": [
        "e32p8"
      ],
      "targets": [
        "c380p1"
      ]
    },
    {
      "id": "e9",
      "sources": [
        "e32p9"
      ],
      "targets": [
        "c380p1"
      ]
    },
    {
      "id": "e10",
      "sources": [
        "s140p6"
      ],
      "targets": [
        "g1p1"
      ]
    },
    {
      "id": "e11",
      "sources": [
        "s140p7"
      ],
      "targets": [
        "c274p1"
      ]
    },
    {
      "id": "e12",
      "sources": [
        "s140p8"
      ],
      "targets": [
        "p2p3"
      ]
    },
    {
      "id": "e13",
      "sources": [
        "s140p9"
      ],
      "targets": [
        "p2p4"
      ],
      "layoutOptions": [{
        "colors": [
          { "offset": "0%", "color": "blue" },
          { "offset": "0%", "color": "yellow" }
        ]
      }]
    },
    {
      "id": "e14",
      "sources": [
        "c380p1"
      ],
      "targets": [
        "p2p5"
      ]
    },
    {
      "id": "e15",
      "sources": [
        "p2p6"
      ],
      "targets": [
        "g15p1"
      ]
    },
    {
      "id": "e16",
      "sources": [
        "p2p7"
      ],
      "targets": [
        "p2p10"
      ]
    },
    {
      "id": "e17",
      "sources": [
        "p2p8"
      ],
      "targets": [
        "p2p10"
      ]
    },
    {
      "id": "e18",
      "sources": [
        "p2p9"
      ],
      "targets": [
        "p2p10"
      ]
    },
    {
      "id": "e19",
      "sources": [
        "p2p11"
      ],
      "targets": [
        "p2p12"
      ]
    }
  ],
  "layoutOptions": {
    "portConstraints": "FREE",
    "spacing.edgeEdge": 20,
    "spacing.edgeNode": 150,
    "spacing.nodeNode": 50,
    "spacing.edgeEdgeBetweenLayers": 30,
    "spacing.edgeNodeBetweenLayers": 80,
    "spacing.nodeSelfLoop": 230,
    "elk.layered.nodePlacement.bk.fixedAlignment": "BALANCED",
    "elk.layered.spacing.baseValue": 200
  }
}
