{
	"slider": [{
		"image": "http://res.cloudinary.com/canvaskisa/image/upload/v1470601682/bottle_recofl.png",
		"caption": "Самое главное",
		"title": "Питьевая вода Архыз 19 л.",
		"price": "2 300 руб."
	}, {
		"image": "http://res.cloudinary.com/canvaskisa/image/upload/v1470601682/bottle_recofl.png",
		"caption": "Самое главное",
		"title": "Питьевая вода Архыз 19 л.",
		"price": "2 300 руб."
	}, {
		"image": "http://res.cloudinary.com/canvaskisa/image/upload/v1470601682/bottle_recofl.png",
		"caption": "Самое главное",
		"title": "Питьевая вода Архыз 19 л.",
		"price": "2 300 руб."
	}, {
		"image": "http://res.cloudinary.com/canvaskisa/image/upload/v1470601682/bottle_recofl.png",
		"caption": "Самое главное",
		"title": "Питьевая вода Архыз 19 л.",
		"price": "2 300 руб."
	}, {
		"image": "http://res.cloudinary.com/canvaskisa/image/upload/v1470601682/bottle_recofl.png",
		"caption": "Самое главное",
		"title": "Питьевая вода Архыз 19 л.",
		"price": "2 300 руб."
	}],
	"nav": [{
		"title": "Все товары",
		"href": "/"
	}, {
		"title": "Вода 19л.",
		"href": "/"
	}, {
		"title": "Вода 0,2–13л.",
		"href": "/"
	}, {
		"title": "Соки",
		"href": "/"
	}, {
		"title": "Продукты",
		"href": "/"
	}, {
		"title": "Чай, кофе, сахар",
		"href": "/"
	}, {
		"title": "Кулеры",
		"href": "/"
	}, {
		"title": "Аксессуары",
		"href": "/"
	}, {
		"title": "Акции",
		"href": "/"
	}, {
		"title": "Винные шкафы",
		"href": "/"
	}, {
		"title": "Хозяйственные товары",
		"href": "/"
	}, {
		"title": "Ремонт куллеров",
		"href": "/"
	}, {
		"title": "Аренда куллеров",
		"href": "/"
	}, {
		"title": "Товары со скидкой",
		"href": "/"
	}]
}
