<svg width="40" height="40" viewBox="0 0 40 40" fill="none" xmlns="http://www.w3.org/2000/svg">
<g clip-path="url(#clip0_105_12)">
<path fill-rule="evenodd" clip-rule="evenodd" d="M23.7426 22.5035L19.9938 26.2528L17.4945 28.7523V32.5015L13.7457 38.7502L16.2449 40L24.9922 31.2518L23.7426 22.5035ZM17.4945 16.2548L8.74727 15.0051L0 23.7533L1.24961 26.2528L7.49766 22.5035H11.2465L13.7457 20.0041L17.4945 16.2548Z" fill="#CCCCCC"/>
<path d="M6.24796 27.5025C3.78686 31.0943 0.0161592 35.5228 -8.57657e-05 37.5005C-0.0132067 39.0021 0.984607 40.0131 2.49913 40C4.50913 39.9831 8.75406 36.2314 12.496 33.7513L6.24796 27.5025Z" fill="#FFCC66"/>
<path d="M9.99686 26.2528C7.53576 29.8446 2.49921 34.2731 2.49921 36.2508C2.49921 37.5574 2.62479 37.5005 3.74882 37.5005C5.75881 37.5005 10.0037 32.4822 13.7457 30.002L9.99686 26.2528Z" fill="#ED7161"/>
<path d="M37.4883 0.00805873C33.5608 0.251134 26.7804 0.718539 18.7442 8.75628C12.8329 14.6682 7.647 23.2646 5.21588 28.969L11.0684 34.8222C16.7404 32.4146 25.279 27.215 31.2403 21.2537C39.2246 13.2685 39.6795 6.46362 39.9875 2.50755C40.125 0.74166 39.1215 -0.0931707 37.4883 0.00805873Z" fill="#387AA7"/>
<path d="M37.4883 0.00805873C33.5608 0.251134 26.7804 0.718539 18.7442 8.75628C13.9182 13.5822 9.58202 20.1958 6.82413 25.5685L14.4686 33.2138C19.8082 30.4631 26.3805 26.114 31.2402 21.2537C39.2246 13.2685 39.6795 6.46362 39.9875 2.50755C40.125 0.74166 39.1215 -0.0931707 37.4883 0.00805873Z" fill="#48A0DC"/>
<path d="M29.9906 15.0051C32.7512 15.0051 34.9891 12.767 34.9891 10.0061C34.9891 7.24523 32.7512 5.00711 29.9906 5.00711C27.2301 5.00711 24.9922 7.24523 24.9922 10.0061C24.9922 12.767 27.2301 15.0051 29.9906 15.0051Z" fill="#4D4D4D"/>
<path d="M29.9906 12.5056C31.3709 12.5056 32.4898 11.3865 32.4898 10.0061C32.4898 8.62565 31.3709 7.50659 29.9906 7.50659C28.6103 7.50659 27.4914 8.62565 27.4914 10.0061C27.4914 11.3865 28.6103 12.5056 29.9906 12.5056Z" fill="white"/>
</g>
<defs>
<clipPath id="clip0_105_12">
<rect width="40" height="40" fill="white"/>
</clipPath>
</defs>
</svg>
