{
  "compilerOptions": {
    "module": "CommonJS",
    "allowSyntheticDefaultImports": true,
    "baseUrl": "."
  },
  "include": ["*.js", "*.json", "./src/*.js", "./src/**/*.js"],
  "exclude": ["node_modules/"]
}
